====> make all in source/blender/python
====> make all in source/blender/python/api2_2x
gcc -c -DGAMEBLENDER=1 -DUSE_SUMO_SOLID -pipe -fPIC -DNDEBUG -O2 -funsigned-char -Wall -Wno-char-subscripts -DMOZ_NOT_NET -I../Physics/common -I../Physics/Dummy -I/usr/X11R6/include -I/home/sten/dev/blender/../lib/linux-glibc2.3.2-i386/guardedalloc/include -I../../makesdna -I../../blenkernel -I../../blenlib -I../../blenloader -I../../include -I../../render/extern/include -I../../radiosity/extern/include -I/home/sten/dev/blender/../lib/linux-glibc2.3.2-i386/bmfont/include -I../../imbuf -I/usr/include/python2.3 Armature.c -o /home/sten/dev/blender/obj/linux-glibc2.3.2-i386/blender/python/Armature.o
In file included from Armature.c:33:
Armature.h:36:20: Python.h: No such file or directory
In file included from Armature.c:33:
Armature.h:41: error: syntax error before "PyObject_HEAD"
Armature.h:41: warning: no semicolon at end of struct or union
Armature.h:42: warning: type defaults to `int' in declaration of `BPy_Armature'
Armature.h:42: warning: data definition has no type or storage class
Armature.h:46: error: syntax error before '*' token
Armature.h:46: warning: type defaults to `int' in declaration of `Armature_Init'
Armature.h:46: warning: data definition has no type or storage class
Armature.h:47: error: syntax error before '*' token
Armature.h:47: warning: type defaults to `int' in declaration of `Armature_CreatePyObject'
Armature.h:47: warning: data definition has no type or storage class
Armature.h:48: error: syntax error before '*' token
Armature.h:49: error: syntax error before '*' token
In file included from Armature.c:34:
Bone.h:36:20: Python.h: No such file or directory
In file included from Bone.h:38,
from Armature.c:34:
vector.h:36:20: Python.h: No such file or directory
In file included from vector.h:37,
from Bone.h:38,
from Armature.c:34:
gen_utils.h:36:20: Python.h: No such file or directory
gen_utils.h:37:21: compile.h: No such file or directory
gen_utils.h:38:59: eval.h: No such file or directory
In file included from vector.h:37,
from Bone.h:38,
from Armature.c:34:
gen_utils.h:67: error: syntax error before '*' token
gen_utils.h:67: error: syntax error before '*' token
gen_utils.h:67: warning: type defaults to `int' in declaration of `PythonReturnErrorObject'
gen_utils.h:67: warning: data definition has no type or storage class
gen_utils.h:68: error: syntax error before '*' token
gen_utils.h:68: error: syntax error before '*' token
gen_utils.h:68: warning: type defaults to `int' in declaration of `PythonIncRef'
gen_utils.h:68: warning: data definition has no type or storage class
gen_utils.h:75: error: syntax error before '*' token
gen_utils.h:75: error: syntax error before '*' token
gen_utils.h:75: warning: type defaults to `int' in declaration of `EXPP_incr_ret'
gen_utils.h:75: warning: data definition has no type or storage class
gen_utils.h:76: error: syntax error before '*' token
gen_utils.h:76: warning: type defaults to `int' in declaration of `EXPP_incr_ret_True'
gen_utils.h:76: warning: data definition has no type or storage class
gen_utils.h:77: error: syntax error before '*' token
gen_utils.h:77: warning: type defaults to `int' in declaration of `EXPP_incr_ret_False'
gen_utils.h:77: warning: data definition has no type or storage class
gen_utils.h:78: error: syntax error before '*' token
gen_utils.h:78: error: syntax error before '*' token
gen_utils.h:78: warning: type defaults to `int' in declaration of `EXPP_ReturnPyObjError'
gen_utils.h:78: warning: data definition has no type or storage class
gen_utils.h:79: error: syntax error before '*' token
gen_utils.h:81: error: syntax error before '*' token
gen_utils.h:82: error: syntax error before '*' token
gen_utils.h:82: error: syntax error before '*' token
gen_utils.h:82: warning: type defaults to `int' in declaration of `EXPP_tuple_repr'
gen_utils.h:82: warning: data definition has no type or storage class
gen_utils.h:101: error: syntax error before '*' token
gen_utils.h:101: error: syntax error before "PyObject"
gen_utils.h:101: warning: type defaults to `int' in declaration of `EXPP_getScriptLinks'
gen_utils.h:101: warning: data definition has no type or storage class
gen_utils.h:102: error: syntax error before '*' token
gen_utils.h:102: error: syntax error before "PyObject"
gen_utils.h:102: warning: type defaults to `int' in declaration of `EXPP_addScriptLink'
gen_utils.h:102: warning: data definition has no type or storage class
gen_utils.h:103: error: syntax error before '*' token
gen_utils.h:103: error: syntax error before "PyObject"
gen_utils.h:103: warning: type defaults to `int' in declaration of `EXPP_clearScriptLinks'
gen_utils.h:103: warning: data definition has no type or storage class
In file included from vector.h:38,
from Bone.h:38,
from Armature.c:34:
Types.h:36:20: Python.h: No such file or directory
In file included from vector.h:38,
from Bone.h:38,
from Armature.c:34:
Types.h:38: error: syntax error before "Action_Type"
Types.h:38: warning: type defaults to `int' in declaration of `Action_Type'
Types.h:38: warning: type defaults to `int' in declaration of `Armature_Type'
Types.h:38: warning: data definition has no type or storage class
Types.h:39: error: syntax error before "BezTriple_Type"
Types.h:39: warning: type defaults to `int' in declaration of `BezTriple_Type'
Types.h:39: warning: type defaults to `int' in declaration of `Bone_Type'
Types.h:39: warning: type defaults to `int' in declaration of `Build_Type'
Types.h:39: warning: type defaults to `int' in declaration of `Button_Type'
Types.h:39: warning: data definition has no type or storage class
Types.h:40: error: syntax error before "Camera_Type"
Types.h:40: warning: type defaults to `int' in declaration of `Camera_Type'
Types.h:40: warning: data definition has no type or storage class
Types.h:41: error: syntax error before "CurNurb_Type"
Types.h:41: warning: type defaults to `int' in declaration of `CurNurb_Type'
Types.h:41: warning: data definition has no type or storage class
Types.h:42: error: syntax error before "Curve_Type"
Types.h:42: warning: type defaults to `int' in declaration of `Curve_Type'
Types.h:42: warning: data definition has no type or storage class
Types.h:43: error: syntax error before "Effect_Type"
Types.h:43: warning: type defaults to `int' in declaration of `Effect_Type'
Types.h:43: warning: type defaults to `int' in declaration of `Font_Type'
Types.h:43: warning: data definition has no type or storage class
Types.h:44: error: syntax error before "Image_Type"
Types.h:44: warning: type defaults to `int' in declaration of `Image_Type'
Types.h:44: warning: type defaults to `int' in declaration of `Ipo_Type'
Types.h:44: warning: type defaults to `int' in declaration of `IpoCurve_Type'
Types.h:44: warning: data definition has no type or storage class
Types.h:45: error: syntax error before "Lamp_Type"
Types.h:45: warning: type defaults to `int' in declaration of `Lamp_Type'
Types.h:45: warning: type defaults to `int' in declaration of `Lattice_Type'
Types.h:45: warning: data definition has no type or storage class
Types.h:46: error: syntax error before "Material_Type"
Types.h:46: warning: type defaults to `int' in declaration of `Material_Type'
Types.h:46: warning: type defaults to `int' in declaration of `Metaball_Type'
Types.h:46: warning: type defaults to `int' in declaration of `MTex_Type'
Types.h:46: warning: data definition has no type or storage class
Types.h:47: error: syntax error before "NMFace_Type"
Types.h:47: warning: type defaults to `int' in declaration of `NMFace_Type'
Types.h:47: warning: type defaults to `int' in declaration of `NMVert_Type'
Types.h:47: warning: type defaults to `int' in declaration of `NMCol_Type'
Types.h:47: warning: type defaults to `int' in declaration of `NMesh_Type'
Types.h:47: warning: data definition has no type or storage class
Types.h:48: error: syntax error before "Object_Type"
Types.h:48: warning: type defaults to `int' in declaration of `Object_Type'
Types.h:48: warning: data definition has no type or storage class
Types.h:49: error: syntax error before "Particle_Type"
Types.h:49: warning: type defaults to `int' in declaration of `Particle_Type'
Types.h:49: warning: data definition has no type or storage class
Types.h:50: error: syntax error before "Scene_Type"
Types.h:50: warning: type defaults to `int' in declaration of `Scene_Type'
Types.h:50: warning: type defaults to `int' in declaration of `RenderData_Type'
Types.h:50: warning: data definition has no type or storage class
Types.h:51: error: syntax error before "Text_Type"
Types.h:51: warning: type defaults to `int' in declaration of `Text_Type'
Types.h:51: warning: type defaults to `int' in declaration of `Text3d_Type'
Types.h:51: warning: type defaults to `int' in declaration of `Texture_Type'
Types.h:51: warning: data definition has no type or storage class
Types.h:52: error: syntax error before "Wave_Type"
Types.h:52: warning: type defaults to `int' in declaration of `Wave_Type'
Types.h:52: warning: type defaults to `int' in declaration of `World_Type'
Types.h:52: warning: data definition has no type or storage class
Types.h:53: error: syntax error before "property_Type"
Types.h:53: warning: type defaults to `int' in declaration of `property_Type'
Types.h:53: warning: data definition has no type or storage class
Types.h:54: error: syntax error before "buffer_Type"
Types.h:54: warning: type defaults to `int' in declaration of `buffer_Type'
Types.h:54: warning: type defaults to `int' in declaration of `constant_Type'
Types.h:54: warning: type defaults to `int' in declaration of `euler_Type'
Types.h:54: warning: data definition has no type or storage class
Types.h:55: error: syntax error before "matrix_Type"
Types.h:55: warning: type defaults to `int' in declaration of `matrix_Type'
Types.h:55: warning: type defaults to `int' in declaration of `quaternion_Type'
Types.h:55: warning: type defaults to `int' in declaration of `rgbTuple_Type'
Types.h:55: warning: type defaults to `int' in declaration of `vector_Type'
Types.h:55: warning: data definition has no type or storage class
Types.h:57: error: syntax error before '*' token
Types.h:57: warning: type defaults to `int' in declaration of `Types_Init'
Types.h:57: warning: data definition has no type or storage class
In file included from vector.h:39,
from Bone.h:38,
from Armature.c:34:
matrix.h:36:20: Python.h: No such file or directory
In file included from matrix.h:41,
from vector.h:39,
from Bone.h:38,
from Armature.c:34:
quat.h:37:20: Python.h: No such file or directory
In file included from quat.h:41,
from matrix.h:41,
from vector.h:39,
from Bone.h:38,
from Armature.c:34:
euler.h:38:20: Python.h: No such file or directory
In file included from quat.h:41,
from matrix.h:41,
from vector.h:39,
from Bone.h:38,
from Armature.c:34:
euler.h:57: error: syntax error before "PyObject_VAR_HEAD"
euler.h:57: warning: no semicolon at end of struct or union
euler.h:58: warning: type defaults to `int' in declaration of `EulerObject'
euler.h:58: warning: data definition has no type or storage class
euler.h:61: error: syntax error before '*' token
euler.h:61: warning: type defaults to `int' in declaration of `newEulerObject'
euler.h:61: warning: data definition has no type or storage class
euler.h:62: error: syntax error before '*' token
euler.h:62: error: syntax error before '*' token
euler.h:62: warning: type defaults to `int' in declaration of `Euler_Zero'
euler.h:62: warning: data definition has no type or storage class
euler.h:63: error: syntax error before '*' token
euler.h:63: error: syntax error before '*' token
euler.h:63: warning: type defaults to `int' in declaration of `Euler_Unique'
euler.h:63: warning: data definition has no type or storage class
euler.h:64: error: syntax error before '*' token
euler.h:64: error: syntax error before '*' token
euler.h:64: warning: type defaults to `int' in declaration of `Euler_ToMatrix'
euler.h:64: warning: data definition has no type or storage class
euler.h:65: error: syntax error before '*' token
euler.h:65: error: syntax error before '*' token
euler.h:65: warning: type defaults to `int' in declaration of `Euler_ToQuat'
euler.h:65: warning: data definition has no type or storage class
In file included from matrix.h:41,
from vector.h:39,
from Bone.h:38,
from Armature.c:34:
quat.h:55: error: syntax error before "PyObject_VAR_HEAD"
quat.h:55: warning: no semicolon at end of struct or union
quat.h:60: error: syntax error before '}' token
quat.h:60: warning: type defaults to `int' in declaration of `QuaternionObject'
quat.h:60: warning: data definition has no type or storage class
quat.h:64: error: syntax error before '*' token
quat.h:64: warning: type defaults to `int' in declaration of `newQuaternionObject'
quat.h:64: warning: data definition has no type or storage class
quat.h:65: error: syntax error before '*' token
quat.h:65: error: syntax error before '*' token
quat.h:65: warning: type defaults to `int' in declaration of `Quaternion_Identity'
quat.h:65: warning: data definition has no type or storage class
quat.h:66: error: syntax error before '*' token
quat.h:66: error: syntax error before '*' token
quat.h:66: warning: type defaults to `int' in declaration of `Quaternion_Negate'
quat.h:66: warning: data definition has no type or storage class
quat.h:67: error: syntax error before '*' token
quat.h:67: error: syntax error before '*' token
quat.h:67: warning: type defaults to `int' in declaration of `Quaternion_Conjugate'
quat.h:67: warning: data definition has no type or storage class
quat.h:68: error: syntax error before '*' token
quat.h:68: error: syntax error before '*' token
quat.h:68: warning: type defaults to `int' in declaration of `Quaternion_Inverse'
quat.h:68: warning: data definition has no type or storage class
quat.h:69: error: syntax error before '*' token
quat.h:69: error: syntax error before '*' token
quat.h:69: warning: type defaults to `int' in declaration of `Quaternion_Normalize'
quat.h:69: warning: data definition has no type or storage class
quat.h:70: error: syntax error before '*' token
quat.h:70: error: syntax error before '*' token
quat.h:70: warning: type defaults to `int' in declaration of `Quaternion_ToEuler'
quat.h:70: warning: data definition has no type or storage class
quat.h:71: error: syntax error before '*' token
quat.h:71: error: syntax error before '*' token
quat.h:71: warning: type defaults to `int' in declaration of `Quaternion_ToMatrix'
quat.h:71: warning: data definition has no type or storage class
In file included from vector.h:39,
from Bone.h:38,
from Armature.c:34:
matrix.h:52: error: syntax error before "PyObject_VAR_HEAD"
matrix.h:52: warning: no semicolon at end of struct or union
matrix.h:61: error: syntax error before '}' token
matrix.h:61: warning: type defaults to `int' in declaration of `MatrixObject'
matrix.h:61: warning: data definition has no type or storage class
matrix.h:66: error: syntax error before '*' token
matrix.h:66: warning: type defaults to `int' in declaration of `newMatrixObject'
matrix.h:66: warning: data definition has no type or storage class
matrix.h:67: error: syntax error before '*' token
matrix.h:67: error: syntax error before '*' token
matrix.h:67: warning: type defaults to `int' in declaration of `Matrix_Zero'
matrix.h:67: warning: data definition has no type or storage class
matrix.h:68: error: syntax error before '*' token
matrix.h:68: error: syntax error before '*' token
matrix.h:68: warning: type defaults to `int' in declaration of `Matrix_Identity'
matrix.h:68: warning: data definition has no type or storage class
matrix.h:69: error: syntax error before '*' token
matrix.h:69: error: syntax error before '*' token
matrix.h:69: warning: type defaults to `int' in declaration of `Matrix_Transpose'
matrix.h:69: warning: data definition has no type or storage class
matrix.h:70: error: syntax error before '*' token
matrix.h:70: error: syntax error before '*' token
matrix.h:70: warning: type defaults to `int' in declaration of `Matrix_Determinant'
matrix.h:70: warning: data definition has no type or storage class
matrix.h:71: error: syntax error before '*' token
matrix.h:71: error: syntax error before '*' token
matrix.h:71: warning: type defaults to `int' in declaration of `Matrix_Invert'
matrix.h:71: warning: data definition has no type or storage class
matrix.h:72: error: syntax error before '*' token
matrix.h:72: error: syntax error before '*' token
matrix.h:72: warning: type defaults to `int' in declaration of `Matrix_TranslationPart'
matrix.h:72: warning: data definition has no type or storage class
matrix.h:73: error: syntax error before '*' token
matrix.h:73: error: syntax error before '*' token
matrix.h:73: warning: type defaults to `int' in declaration of `Matrix_RotationPart'
matrix.h:73: warning: data definition has no type or storage class
matrix.h:74: error: syntax error before '*' token
matrix.h:74: error: syntax error before '*' token
matrix.h:74: warning: type defaults to `int' in declaration of `Matrix_Resize4x4'
matrix.h:74: warning: data definition has no type or storage class
matrix.h:75: error: syntax error before '*' token
matrix.h:75: error: syntax error before '*' token
matrix.h:75: warning: type defaults to `int' in declaration of `Matrix_toEuler'
matrix.h:75: warning: data definition has no type or storage class
matrix.h:76: error: syntax error before '*' token
matrix.h:76: error: syntax error before '*' token
matrix.h:76: warning: type defaults to `int' in declaration of `Matrix_toQuat'
matrix.h:76: warning: data definition has no type or storage class
In file included from Bone.h:38,
from Armature.c:34:
vector.h:53: error: syntax error before "PyObject_VAR_HEAD"
vector.h:53: warning: no semicolon at end of struct or union
vector.h:60: error: syntax error before '}' token
vector.h:60: warning: type defaults to `int' in declaration of `VectorObject'
vector.h:60: warning: data definition has no type or storage class
vector.h:63: error: syntax error before '*' token
vector.h:63: warning: type defaults to `int' in declaration of `newVectorObject'
vector.h:63: warning: data definition has no type or storage class
vector.h:64: error: syntax error before '*' token
vector.h:64: warning: type defaults to `int' in declaration of `newVectorProxy'
vector.h:64: warning: data definition has no type or storage class
vector.h:65: error: syntax error before '*' token
vector.h:65: error: syntax error before '*' token
vector.h:65: warning: type defaults to `int' in declaration of `Vector_Zero'
vector.h:65: warning: data definition has no type or storage class
vector.h:66: error: syntax error before '*' token
vector.h:66: error: syntax error before '*' token
vector.h:66: warning: type defaults to `int' in declaration of `Vector_Normalize'
vector.h:66: warning: data definition has no type or storage class
vector.h:67: error: syntax error before '*' token
vector.h:67: error: syntax error before '*' token
vector.h:67: warning: type defaults to `int' in declaration of `Vector_Negate'
vector.h:67: warning: data definition has no type or storage class
vector.h:68: error: syntax error before '*' token
vector.h:68: error: syntax error before '*' token
vector.h:68: warning: type defaults to `int' in declaration of `Vector_Resize2D'
vector.h:68: warning: data definition has no type or storage class
vector.h:69: error: syntax error before '*' token
vector.h:69: error: syntax error before '*' token
vector.h:69: warning: type defaults to `int' in declaration of `Vector_Resize3D'
vector.h:69: warning: data definition has no type or storage class
vector.h:70: error: syntax error before '*' token
vector.h:70: error: syntax error before '*' token
vector.h:70: warning: type defaults to `int' in declaration of `Vector_Resize4D'
vector.h:70: warning: data definition has no type or storage class
In file included from Armature.c:34:
Bone.h:44: error: syntax error before "PyObject_HEAD"
Bone.h:44: warning: no semicolon at end of struct or union
Bone.h:55: error: syntax error before '*' token
Bone.h:55: warning: type defaults to `int' in declaration of `head'
Bone.h:55: warning: data definition has no type or storage class
Bone.h:56: error: syntax error before '*' token
Bone.h:56: warning: type defaults to `int' in declaration of `tail'
Bone.h:56: warning: data definition has no type or storage class
Bone.h:57: error: syntax error before '*' token
Bone.h:57: warning: type defaults to `int' in declaration of `loc'
Bone.h:57: warning: data definition has no type or storage class
Bone.h:58: error: syntax error before '*' token
Bone.h:58: warning: type defaults to `int' in declaration of `dloc'
Bone.h:58: warning: data definition has no type or storage class
Bone.h:59: error: syntax error before '*' token
Bone.h:59: warning: type defaults to `int' in declaration of `size'
Bone.h:59: error: conflicting types for `size'
vector.h:54: error: previous declaration of `size'
Bone.h:59: warning: data definition has no type or storage class
Bone.h:60: error: syntax error before '*' token
Bone.h:60: warning: type defaults to `int' in declaration of `dsize'
Bone.h:60: warning: data definition has no type or storage class
Bone.h:61: error: syntax error before '*' token
Bone.h:61: warning: type defaults to `int' in declaration of `quat'
Bone.h:61: warning: data definition has no type or storage class
Bone.h:62: error: syntax error before '*' token
Bone.h:62: warning: type defaults to `int' in declaration of `dquat'
Bone.h:62: warning: data definition has no type or storage class
Bone.h:63: error: syntax error before '*' token
Bone.h:63: warning: type defaults to `int' in declaration of `obmat'
Bone.h:63: warning: data definition has no type or storage class
Bone.h:64: error: syntax error before '*' token
Bone.h:64: warning: type defaults to `int' in declaration of `parmat'
Bone.h:64: warning: data definition has no type or storage class
Bone.h:65: error: syntax error before '*' token
Bone.h:65: warning: type defaults to `int' in declaration of `defmat'
Bone.h:65: warning: data definition has no type or storage class
Bone.h:66: error: syntax error before '*' token
Bone.h:66: warning: type defaults to `int' in declaration of `irestmat'
Bone.h:66: warning: data definition has no type or storage class
Bone.h:67: error: syntax error before '*' token
Bone.h:67: warning: type defaults to `int' in declaration of `posemat'
Bone.h:67: warning: data definition has no type or storage class
Bone.h:68: error: syntax error before '}' token
Bone.h:68: warning: type defaults to `int' in declaration of `BPy_Bone'
Bone.h:68: warning: data definition has no type or storage class
Bone.h:71: error: syntax error before '*' token
Bone.h:71: warning: type defaults to `int' in declaration of `Bone_CreatePyObject'
Bone.h:71: warning: data definition has no type or storage class
Bone.h:72: error: syntax error before '*' token
Bone.h:73: error: syntax error before '*' token
Bone.h:74: error: syntax error before '*' token
Bone.h:74: warning: type defaults to `int' in declaration of `Bone_Init'
Bone.h:74: warning: data definition has no type or storage class
Bone.h:75: error: syntax error before '*' token
In file included from Armature.c:35:
NLA.h:36:20: Python.h: No such file or directory
In file included from Armature.c:35:
NLA.h:40: error: syntax error before '*' token
NLA.h:40: warning: type defaults to `int' in declaration of `NLA_Init'
NLA.h:40: warning: data definition has no type or storage class
NLA.h:44: error: syntax error before "PyObject_HEAD"
NLA.h:44: warning: no semicolon at end of struct or union
NLA.h:45: warning: type defaults to `int' in declaration of `BPy_Action'
NLA.h:45: warning: data definition has no type or storage class
NLA.h:47: error: syntax error before '*' token
NLA.h:47: warning: type defaults to `int' in declaration of `Action_CreatePyObject'
NLA.h:47: warning: data definition has no type or storage class
NLA.h:48: error: syntax error before '*' token
NLA.h:49: error: syntax error before '*' token
In file included from Armature.c:45:
constant.h:36:20: Python.h: No such file or directory
In file included from Armature.c:45:
constant.h:49: error: syntax error before '*' token
constant.h:49: warning: type defaults to `int' in declaration of `M_constant_New'
constant.h:49: warning: data definition has no type or storage class
constant.h:55: error: syntax error before "PyObject_HEAD"
constant.h:55: warning: no semicolon at end of struct or union
constant.h:57: warning: type defaults to `int' in declaration of `BPy_constant'
constant.h:57: warning: data definition has no type or storage class
constant.h:62: error: syntax error before '*' token
Armature.c:50: error: syntax error before '*' token
Armature.c:50: error: syntax error before '*' token
Armature.c:50: warning: type defaults to `int' in declaration of `M_Armature_New'
Armature.c:50: warning: data definition has no type or storage class
Armature.c:51: error: syntax error before '*' token
Armature.c:51: error: syntax error before '*' token
Armature.c:51: warning: type defaults to `int' in declaration of `M_Armature_Get'
Armature.c:51: warning: data definition has no type or storage class
Armature.c:67: error: elements of array `M_Armature_methods' have incomplete type
Armature.c:68: warning: excess elements in struct initializer
Armature.c:68: warning: (near initialization for `M_Armature_methods[0]')
Armature.c:68: error: `PyCFunction' undeclared here (not in a function)
Armature.c:68: warning: excess elements in struct initializer
Armature.c:68: warning: (near initialization for `M_Armature_methods[0]')
Armature.c:68: error: syntax error before "M_Armature_New"
Armature.c:68: error: `METH_VARARGS' undeclared here (not in a function)
Armature.c:68: warning: excess elements in struct initializer
Armature.c:68: warning: (near initialization for `M_Armature_methods[0]')
Armature.c:69: warning: excess elements in struct initializer
Armature.c:69: warning: (near initialization for `M_Armature_methods[0]')
Armature.c:70: warning: excess elements in struct initializer
Armature.c:70: warning: (near initialization for `M_Armature_methods[1]')
Armature.c:70: warning: excess elements in struct initializer
Armature.c:70: warning: (near initialization for `M_Armature_methods[1]')
Armature.c:70: error: `METH_VARARGS' undeclared here (not in a function)
Armature.c:70: warning: excess elements in struct initializer
Armature.c:70: warning: (near initialization for `M_Armature_methods[1]')
Armature.c:70: warning: excess elements in struct initializer
Armature.c:70: warning: (near initialization for `M_Armature_methods[1]')
Armature.c:71: warning: excess elements in struct initializer
Armature.c:71: warning: (near initialization for `M_Armature_methods[2]')
Armature.c:71: warning: excess elements in struct initializer
Armature.c:71: warning: (near initialization for `M_Armature_methods[2]')
Armature.c:71: error: `METH_VARARGS' undeclared here (not in a function)
Armature.c:71: warning: excess elements in struct initializer
Armature.c:71: warning: (near initialization for `M_Armature_methods[2]')
Armature.c:71: warning: excess elements in struct initializer
Armature.c:71: warning: (near initialization for `M_Armature_methods[2]')
Armature.c:72: warning: excess elements in struct initializer
Armature.c:72: warning: (near initialization for `M_Armature_methods[3]')
Armature.c:72: warning: excess elements in struct initializer
Armature.c:72: warning: (near initialization for `M_Armature_methods[3]')
Armature.c:72: warning: excess elements in struct initializer
Armature.c:72: warning: (near initialization for `M_Armature_methods[3]')
Armature.c:72: warning: excess elements in struct initializer
Armature.c:72: warning: (near initialization for `M_Armature_methods[3]')
Armature.c:75: error: syntax error before '*' token
Armature.c:75: error: syntax error before '*' token
Armature.c:75: warning: type defaults to `int' in declaration of `Armature_getName'
Armature.c:75: warning: data definition has no type or storage class
Armature.c:76: error: syntax error before '*' token
Armature.c:76: error: syntax error before '*' token
Armature.c:76: warning: type defaults to `int' in declaration of `Armature_getBones'
Armature.c:76: warning: data definition has no type or storage class
Armature.c:77: error: syntax error before '*' token
Armature.c:77: error: syntax error before '*' token
Armature.c:77: warning: type defaults to `int' in declaration of `Armature_addBone'
Armature.c:77: warning: data definition has no type or storage class
Armature.c:78: error: syntax error before '*' token
Armature.c:78: error: syntax error before '*' token
Armature.c:78: warning: type defaults to `int' in declaration of `Armature_setName'
Armature.c:78: warning: data definition has no type or storage class
Armature.c:79: error: syntax error before '*' token
Armature.c:79: error: syntax error before '*' token
Armature.c:79: warning: type defaults to `int' in declaration of `Armature_drawAxes'
Armature.c:79: warning: data definition has no type or storage class
Armature.c:80: error: syntax error before '*' token
Armature.c:80: error: syntax error before '*' token
Armature.c:80: warning: type defaults to `int' in declaration of `Armature_drawNames'
Armature.c:80: warning: data definition has no type or storage class
Armature.c:82: error: syntax error before "BPy_Armature_methods"
Armature.c:82: warning: type defaults to `int' in declaration of `BPy_Armature_methods'
Armature.c:83: warning: braces around scalar initializer
Armature.c:83: warning: (near initialization for `BPy_Armature_methods[0]')
Armature.c:83: warning: initialization makes integer from pointer without a cast
Armature.c:83: error: `PyCFunction' undeclared here (not in a function)
Armature.c:83: warning: excess elements in scalar initializer
Armature.c:83: warning: (near initialization for `BPy_Armature_methods[0]')
Armature.c:83: error: syntax error before "Armature_getName"
Armature.c:83: error: `METH_NOARGS' undeclared here (not in a function)
Armature.c:83: warning: excess elements in scalar initializer
Armature.c:83: warning: (near initialization for `BPy_Armature_methods[0]')
Armature.c:84: warning: excess elements in scalar initializer
Armature.c:84: warning: (near initialization for `BPy_Armature_methods[0]')
Armature.c:85: warning: braces around scalar initializer
Armature.c:85: warning: (near initialization for `BPy_Armature_methods[1]')
Armature.c:85: warning: initialization makes integer from pointer without a cast
Armature.c:85: error: `PyCFunction' undeclared here (not in a function)
Armature.c:85: warning: excess elements in scalar initializer
Armature.c:85: warning: (near initialization for `BPy_Armature_methods[1]')
Armature.c:85: error: syntax error before "Armature_getBones"
Armature.c:85: error: `METH_NOARGS' undeclared here (not in a function)
Armature.c:85: warning: excess elements in scalar initializer
Armature.c:85: warning: (near initialization for `BPy_Armature_methods[1]')
Armature.c:86: warning: excess elements in scalar initializer
Armature.c:86: warning: (near initialization for `BPy_Armature_methods[1]')
Armature.c:87: warning: braces around scalar initializer
Armature.c:87: warning: (near initialization for `BPy_Armature_methods[2]')
Armature.c:87: warning: initialization makes integer from pointer without a cast
Armature.c:87: error: `PyCFunction' undeclared here (not in a function)
Armature.c:87: warning: excess elements in scalar initializer
Armature.c:87: warning: (near initialization for `BPy_Armature_methods[2]')
Armature.c:87: error: syntax error before "Armature_setName"
Armature.c:87: error: `METH_VARARGS' undeclared here (not in a function)
Armature.c:87: warning: excess elements in scalar initializer
Armature.c:87: warning: (near initialization for `BPy_Armature_methods[2]')
Armature.c:88: warning: excess elements in scalar initializer
Armature.c:88: warning: (near initialization for `BPy_Armature_methods[2]')
Armature.c:89: warning: braces around scalar initializer
Armature.c:89: warning: (near initialization for `BPy_Armature_methods[3]')
Armature.c:89: warning: initialization makes integer from pointer without a cast
Armature.c:89: error: `PyCFunction' undeclared here (not in a function)
Armature.c:89: warning: excess elements in scalar initializer
Armature.c:89: warning: (near initialization for `BPy_Armature_methods[3]')
Armature.c:89: error: syntax error before "Armature_addBone"
Armature.c:89: error: `METH_VARARGS' undeclared here (not in a function)
Armature.c:89: warning: excess elements in scalar initializer
Armature.c:89: warning: (near initialization for `BPy_Armature_methods[3]')
Armature.c:90: warning: excess elements in scalar initializer
Armature.c:90: warning: (near initialization for `BPy_Armature_methods[3]')
Armature.c:91: warning: braces around scalar initializer
Armature.c:91: warning: (near initialization for `BPy_Armature_methods[4]')
Armature.c:91: warning: initialization makes integer from pointer without a cast
Armature.c:91: error: `PyCFunction' undeclared here (not in a function)
Armature.c:91: warning: excess elements in scalar initializer
Armature.c:91: warning: (near initialization for `BPy_Armature_methods[4]')
Armature.c:91: error: syntax error before "Armature_drawAxes"
Armature.c:91: error: `METH_VARARGS' undeclared here (not in a function)
Armature.c:91: warning: excess elements in scalar initializer
Armature.c:91: warning: (near initialization for `BPy_Armature_methods[4]')
Armature.c:92: warning: excess elements in scalar initializer
Armature.c:92: warning: (near initialization for `BPy_Armature_methods[4]')
Armature.c:93: warning: braces around scalar initializer
Armature.c:93: warning: (near initialization for `BPy_Armature_methods[5]')
Armature.c:93: warning: initialization makes integer from pointer without a cast
Armature.c:93: error: `PyCFunction' undeclared here (not in a function)
Armature.c:93: warning: excess elements in scalar initializer
Armature.c:93: warning: (near initialization for `BPy_Armature_methods[5]')
Armature.c:93: error: syntax error before "Armature_drawNames"
Armature.c:93: error: `METH_VARARGS' undeclared here (not in a function)
Armature.c:93: warning: excess elements in scalar initializer
Armature.c:93: warning: (near initialization for `BPy_Armature_methods[5]')
Armature.c:94: warning: excess elements in scalar initializer
Armature.c:94: warning: (near initialization for `BPy_Armature_methods[5]')
Armature.c:95: warning: braces around scalar initializer
Armature.c:95: warning: (near initialization for `BPy_Armature_methods[6]')
Armature.c:95: warning: initialization makes integer from pointer without a cast
Armature.c:95: warning: excess elements in scalar initializer
Armature.c:95: warning: (near initialization for `BPy_Armature_methods[6]')
Armature.c:95: warning: excess elements in scalar initializer
Armature.c:95: warning: (near initialization for `BPy_Armature_methods[6]')
Armature.c:95: warning: excess elements in scalar initializer
Armature.c:95: warning: (near initialization for `BPy_Armature_methods[6]')
Armature.c:96: warning: data definition has no type or storage class
Armature.c:99: error: syntax error before '*' token
Armature.c:100: error: syntax error before '*' token
Armature.c:100: error: syntax error before '*' token
Armature.c:100: warning: type defaults to `int' in declaration of `Armature_getAttr'
Armature.c:100: warning: data definition has no type or storage class
Armature.c:101: error: syntax error before '*' token
Armature.c:103: error: syntax error before '*' token
Armature.c:104: error: syntax error before '*' token
Armature.c:104: error: syntax error before '*' token
Armature.c:104: warning: type defaults to `int' in declaration of `Armature_repr'
Armature.c:104: warning: data definition has no type or storage class
Armature.c:108: error: syntax error before "Armature_Type"
Armature.c:108: warning: type defaults to `int' in declaration of `Armature_Type'
Armature.c:109: warning: implicit declaration of function `PyObject_HEAD_INIT'
Armature.c:110: error: initializer element is not constant
Armature.c:110: error: (near initialization for `Armature_Type')
Armature.c:110: error: syntax error before numeric constant
Armature.c:111: warning: excess elements in scalar initializer
Armature.c:111: warning: (near initialization for `Armature_Type')
Armature.c:112: warning: excess elements in scalar initializer
Armature.c:112: warning: (near initialization for `Armature_Type')
Armature.c:113: warning: excess elements in scalar initializer
Armature.c:113: warning: (near initialization for `Armature_Type')
Armature.c:115: error: `destructor' undeclared here (not in a function)
Armature.c:115: warning: excess elements in scalar initializer
Armature.c:115: warning: (near initialization for `Armature_Type')
Armature.c:115: error: syntax error before "Armature_dealloc"
Armature.c:116: warning: excess elements in scalar initializer
Armature.c:116: warning: (near initialization for `Armature_Type')
Armature.c:117: error: `getattrfunc' undeclared here (not in a function)
Armature.c:117: warning: excess elements in scalar initializer
Armature.c:117: warning: (near initialization for `Armature_Type')
Armature.c:117: error: syntax error before "Armature_getAttr"
Armature.c:118: error: `setattrfunc' undeclared here (not in a function)
Armature.c:118: warning: excess elements in scalar initializer
Armature.c:118: warning: (near initialization for `Armature_Type')
Armature.c:118: error: syntax error before "Armature_setAttr"
Armature.c:119: error: `cmpfunc' undeclared here (not in a function)
Armature.c:119: warning: excess elements in scalar initializer
Armature.c:119: warning: (near initialization for `Armature_Type')
Armature.c:119: error: syntax error before "Armature_compare"
Armature.c:120: error: `reprfunc' undeclared here (not in a function)
Armature.c:120: warning: excess elements in scalar initializer
Armature.c:120: warning: (near initialization for `Armature_Type')
Armature.c:120: error: syntax error before "Armature_repr"
Armature.c:121: warning: excess elements in scalar initializer
Armature.c:121: warning: (near initialization for `Armature_Type')
Armature.c:122: warning: excess elements in scalar initializer
Armature.c:122: warning: (near initialization for `Armature_Type')
Armature.c:123: warning: excess elements in scalar initializer
Armature.c:123: warning: (near initialization for `Armature_Type')
Armature.c:124: warning: excess elements in scalar initializer
Armature.c:124: warning: (near initialization for `Armature_Type')
Armature.c:125: warning: excess elements in scalar initializer
Armature.c:125: warning: (near initialization for `Armature_Type')
Armature.c:125: warning: excess elements in scalar initializer
Armature.c:125: warning: (near initialization for `Armature_Type')
Armature.c:125: warning: excess elements in scalar initializer
Armature.c:125: warning: (near initialization for `Armature_Type')
Armature.c:125: warning: excess elements in scalar initializer
Armature.c:125: warning: (near initialization for `Armature_Type')
Armature.c:125: warning: excess elements in scalar initializer
Armature.c:125: warning: (near initialization for `Armature_Type')
Armature.c:125: warning: excess elements in scalar initializer
Armature.c:125: warning: (near initialization for `Armature_Type')
Armature.c:126: warning: excess elements in scalar initializer
Armature.c:126: warning: (near initialization for `Armature_Type')
Armature.c:127: warning: excess elements in scalar initializer
Armature.c:127: warning: (near initialization for `Armature_Type')
Armature.c:127: warning: excess elements in scalar initializer
Armature.c:127: warning: (near initialization for `Armature_Type')
Armature.c:127: warning: excess elements in scalar initializer
Armature.c:127: warning: (near initialization for `Armature_Type')
Armature.c:127: warning: excess elements in scalar initializer
Armature.c:127: warning: (near initialization for `Armature_Type')
Armature.c:127: warning: excess elements in scalar initializer
Armature.c:127: warning: (near initialization for `Armature_Type')
Armature.c:127: warning: excess elements in scalar initializer
Armature.c:127: warning: (near initialization for `Armature_Type')
Armature.c:128: warning: excess elements in scalar initializer
Armature.c:128: warning: (near initialization for `Armature_Type')
Armature.c:129: warning: excess elements in scalar initializer
Armature.c:129: warning: (near initialization for `Armature_Type')
Armature.c:130: warning: data definition has no type or storage class
Armature.c:132: error: syntax error before '*' token
Armature.c:133: warning: return type defaults to `int'
Armature.c: In function `Armature_Init':
Armature.c:134: error: `PyObject' undeclared (first use in this function)
Armature.c:134: error: (Each undeclared identifier is reported only once
Armature.c:134: error: for each function it appears in.)
Armature.c:134: error: `submodule' undeclared (first use in this function)
Armature.c:135: error: `dict' undeclared (first use in this function)
Armature.c:137: error: request for member `ob_type' in something not a structure or union
Armature.c:137: error: `PyType_Type' undeclared (first use in this function)
Armature.c:139: warning: implicit declaration of function `Py_InitModule3'
Armature.c:143: warning: implicit declaration of function `PyModule_GetDict'
Armature.c:144: warning: implicit declaration of function `PyDict_SetItemString'
Armature.c: At top level:
Armature.c:153: error: syntax error before "PyObject"
Armature.c: In function `append_childrenToList':
Armature.c:158: error: request for member `childbase' in something not a structure or union
Armature.c:159: warning: implicit declaration of function `PyList_Append'
Armature.c:159: error: `listbones' undeclared (first use in this function)
Armature.c: At top level:
Armature.c:284: error: syntax error before '*' token
Armature.c: In function `Armature_dealloc':
Armature.c:286: warning: implicit declaration of function `PyObject_DEL'
Armature.c:286: error: `self' undeclared (first use in this function)
Armature.c: At top level:
Armature.c:290: error: syntax error before '*' token
Armature.c:290: error: syntax error before '*' token
Armature.c:291: warning: return type defaults to `int'
Armature.c: In function `Armature_getAttr':
Armature.c:292: error: `PyObject' undeclared (first use in this function)
Armature.c:292: error: `attr' undeclared (first use in this function)
Armature.c:292: error: `Py_None' undeclared (first use in this function)
Armature.c:295: error: `self' undeclared (first use in this function)
Armature.c:300: warning: implicit declaration of function `Py_BuildValue'
Armature.c:304: error: `PyExc_MemoryError' undeclared (first use in this function)
Armature.c:311: warning: implicit declaration of function `Py_FindMethod'
Armature.c:311: error: syntax error before ')' token
Armature.c: At top level:
Armature.c:317: error: syntax error before '*' token
Armature.c: In function `Armature_setAttr':
Armature.c:319: error: `PyObject' undeclared (first use in this function)
Armature.c:319: error: `valtuple' undeclared (first use in this function)
Armature.c:320: error: `error' undeclared (first use in this function)
Armature.c:322: error: `value' undeclared (first use in this function)
Armature.c:325: error: `PyExc_MemoryError' undeclared (first use in this function)
Armature.c:329: error: `self' undeclared (first use in this function)
Armature.c:331: warning: implicit declaration of function `Py_DECREF'
Armature.c:335: error: `PyExc_KeyError' undeclared (first use in this function)
Armature.c:340: error: `Py_None' undeclared (first use in this function)
Armature.c: At top level:
Armature.c:348: error: syntax error before '*' token
Armature.c:348: error: syntax error before '*' token
Armature.c:349: warning: return type defaults to `int'
Armature.c: In function `Armature_repr':
Armature.c:350: warning: implicit declaration of function `PyString_FromFormat'
Armature.c:351: error: `self' undeclared (first use in this function)
Armature.c:351: warning: return makes pointer from integer without a cast
Armature.c: At top level:
Armature.c:355: error: syntax error before '*' token
Armature.c: In function `Armature_compare':
Armature.c:357: error: `a' undeclared (first use in this function)
Armature.c:357: error: `b' undeclared (first use in this function)
Armature.c: At top level:
Armature.c:362: error: syntax error before '*' token
Armature.c:363: warning: return type defaults to `int'
Armature.c: In function `Armature_CreatePyObject':
Armature.c:364: error: `blen_armature' undeclared (first use in this function)
Armature.c:367: error: syntax error before ')' token
Armature.c:375: error: `PyObject' undeclared (first use in this function)
Armature.c:375: error: syntax error before ')' token
Armature.c: At top level:
Armature.c:379: error: syntax error before '*' token
Armature.c: In function `Armature_CheckPyObject':
Armature.c:381: error: `py_obj' undeclared (first use in this function)
Armature.c: At top level:
Armature.c:385: error: syntax error before '*' token
Armature.c: In function `Armature_FromPyObject':
Armature.c:387: error: `blen_obj' undeclared (first use in this function)
Armature.c:389: error: syntax error before ')' token
Armature.c: At top level:
Armature.c:396: error: syntax error before '*' token
Armature.c:396: error: syntax error before '*' token
Armature.c:397: warning: return type defaults to `int'
Armature.c: In function `M_Armature_New':
Armature.c:399: error: `py_armature' undeclared (first use in this function)
Armature.c:403: warning: implicit declaration of function `PyArg_ParseTuple'
Armature.c:403: error: `args' undeclared (first use in this function)
Armature.c:404: error: `PyExc_AttributeError' undeclared (first use in this function)
Armature.c:414: error: syntax error before ')' token
Armature.c:417: error: `PyExc_RuntimeError' undeclared (first use in this function)
Armature.c:422: error: `PyExc_MemoryError' undeclared (first use in this function)
Armature.c:429: error: `PyObject' undeclared (first use in this function)
Armature.c:429: error: syntax error before ')' token
Armature.c: At top level:
Armature.c:435: error: syntax error before "return"
Armature.c:439: error: syntax error before '*' token
Armature.c:439: error: syntax error before '*' token
Armature.c:440: warning: return type defaults to `int'
Armature.c: In function `M_Armature_Get':
Armature.c:443: error: `wanted_armature' undeclared (first use in this function)
Armature.c:445: error: `args' undeclared (first use in this function)
Armature.c:446: error: `PyExc_TypeError' undeclared (first use in this function)
Armature.c:458: error: syntax error before ')' token
Armature.c:470: warning: implicit declaration of function `PyOS_snprintf'
Armature.c:473: error: `PyExc_NameError' undeclared (first use in this function)
Armature.c:475: error: `PyObject' undeclared (first use in this function)
Armature.c:475: error: syntax error before ')' token
Armature.c:479: error: `armlist' undeclared (first use in this function)
Armature.c:479: error: `pyobj' undeclared (first use in this function)
Armature.c:479: warning: left-hand operand of comma expression has no effect
Armature.c:481: warning: implicit declaration of function `PyList_New'
Armature.c:484: error: `PyExc_MemoryError' undeclared (first use in this function)
Armature.c:495: warning: implicit declaration of function `PyList_SET_ITEM'
Armature.c: At top level:
Armature.c:506: error: syntax error before '*' token
Armature.c:506: error: syntax error before '*' token
Armature.c:507: warning: return type defaults to `int'
Armature.c: In function `Armature_getName':
Armature.c:508: error: `PyObject' undeclared (first use in this function)
Armature.c:508: error: `attr' undeclared (first use in this function)
Armature.c:508: warning: implicit declaration of function `PyString_FromString'
Armature.c:508: error: `self' undeclared (first use in this function)
Armature.c:513: error: `PyExc_RuntimeError' undeclared (first use in this function)
Armature.c: At top level:
Armature.c:518: error: syntax error before '*' token
Armature.c:518: error: syntax error before '*' token
Armature.c:519: warning: return type defaults to `int'
Armature.c: In function `Armature_getBones':
Armature.c:521: error: `PyObject' undeclared (first use in this function)
Armature.c:521: error: `listbones' undeclared (first use in this function)
Armature.c:527: error: `self' undeclared (first use in this function)
Armature.c: At top level:
Armature.c:539: error: syntax error before '*' token
Armature.c:539: error: syntax error before '*' token
Armature.c:540: warning: return type defaults to `int'
Armature.c: In function `Armature_addBone':
Armature.c:541: error: `py_bone' undeclared (first use in this function)
Armature.c:548: error: `args' undeclared (first use in this function)
Armature.c:549: error: `PyExc_TypeError' undeclared (first use in this function)
Armature.c:560: error: `self' undeclared (first use in this function)
Armature.c:577: error: `PyExc_AttributeError' undeclared (first use in this function)
Armature.c:617: warning: implicit declaration of function `Py_INCREF'
Armature.c:617: error: `Py_None' undeclared (first use in this function)
Armature.c: At top level:
Armature.c:622: error: syntax error before '*' token
Armature.c:622: error: syntax error before '*' token
Armature.c:623: warning: return type defaults to `int'
Armature.c: In function `Armature_setName':
Armature.c:627: error: `args' undeclared (first use in this function)
Armature.c:628: error: `PyExc_AttributeError' undeclared (first use in this function)
Armature.c:633: error: `self' undeclared (first use in this function)
Armature.c:635: error: `Py_None' undeclared (first use in this function)
Armature.c: At top level:
Armature.c:640: error: syntax error before '*' token
Armature.c:640: error: syntax error before '*' token
Armature.c:641: warning: return type defaults to `int'
Armature.c: In function `Armature_drawAxes':
Armature.c:644: error: `args' undeclared (first use in this function)
Armature.c:645: error: `PyExc_AttributeError' undeclared (first use in this function)
Armature.c:649: error: `self' undeclared (first use in this function)
Armature.c:653: error: `Py_None' undeclared (first use in this function)
Armature.c: At top level:
Armature.c:658: error: syntax error before '*' token
Armature.c:658: error: syntax error before '*' token
Armature.c:659: warning: return type defaults to `int'
Armature.c: In function `Armature_drawNames':
Armature.c:662: error: `args' undeclared (first use in this function)
Armature.c:663: error: `PyExc_AttributeError' undeclared (first use in this function)
Armature.c:667: error: `self' undeclared (first use in this function)
Armature.c:671: error: `Py_None' undeclared (first use in this function)
Armature.c: At top level:
Armature.c:67: warning: array `M_Armature_methods' assumed to have one element
Armature.c:67: error: storage size of `M_Armature_methods' isn't known
Armature.c:285: warning: `Armature_dealloc' defined but not used
Armature.c:318: warning: `Armature_setAttr' defined but not used
Armature.c:356: warning: `Armature_compare' defined but not used
make[4]: *** [/home/sten/dev/blender/obj/linux-glibc2.3.2-i386/blender/python/Armature.o] Error 1
make[3]: *** [all] Error 1
make[2]: *** [all] Error 1
make[1]: *** [all] Error 1
make: *** [all] Error 1