rendered paste bodygmake[3]: Entering directory `/usr/ports/x11/e17-module-flame/e_modules/calendar
/src'
if /bin/sh ../libtool --tag=CC --mode=compile gcc -DHAVE_CONFIG_H -I. -I. -I.. -
I. -I.. -I/root/.e/e/include -I/usr/local/include/enlightenment -DUSE_E_CONFIG_H
-I/usr/local/include -I/usr/local/include -I/usr/local/include -I/usr/local/inc
lude -I/usr/local/include -I/usr/local/include -I/usr/local/include -g -L/usr/X
11R6/lib -L/usr/local/lib -I/usr/local/include -I/usr/X11R6/include -lintl -g -
L/usr/X11R6/lib -L/usr/local/lib -I/usr/local/include -I/usr/X11R6/include -MT a
dd_event_dialog.lo -MD -MP -MF ".deps/add_event_dialog.Tpo" -c -o add_event_dial
og.lo add_event_dialog.c; \
then mv -f ".deps/add_event_dialog.Tpo" ".deps/add_event_dialog.Plo"; el
se rm -f ".deps/add_event_dialog.Tpo"; exit 1; fi
gcc -DHAVE_CONFIG_H -I. -I. -I.. -I. -I.. -I/root/.e/e/include -I/usr/local/inc
lude/enlightenment -DUSE_E_CONFIG_H -I/usr/local/include -I/usr/local/include -I
/usr/local/include -I/usr/local/include -I/usr/local/include -I/usr/local/includ
e -I/usr/local/include -g -L/usr/X11R6/lib -L/usr/local/lib -I/usr/local/include
-I/usr/X11R6/include -lintl -g -L/usr/X11R6/lib -L/usr/local/lib -I/usr/local/i
nclude -I/usr/X11R6/include -MT add_event_dialog.lo -MD -MP -MF .deps/add_event_
dialog.Tpo -c add_event_dialog.c -fPIC -DPIC -o .libs/add_event_dialog.o
In file included from add_event_dialog.c:2:
e_mod_main.h:218: error: syntax error before "E_Gadman_Client"
In file included from e_mod_main.h:327,
from add_event_dialog.c:2:
dialog_func.h:33: error: syntax error before '*' token
dialog_func.h:35: error: syntax error before '*' token
dialog_func.h:37: error: syntax error before '*' token
In file included from e_mod_main.h:329,
from add_event_dialog.c:2:
cal_face_func.h:16: error: syntax error before "E_Gadman_Client"
add_event_dialog.c: In function `_add_event_basic_create_widgets':
add_event_dialog.c:130: warning: passing arg 2 of `e_widget_entry_add' from inco
mpatible pointer type
gmake[3]: *** [add_event_dialog.lo] Error 1
gmake[3]: Leaving directory `/usr/ports/x11/e17-module-flame/e_modules/calendar/
src'
gmake[2]: *** [all-recursive] Error 1
gmake[2]: Leaving directory `/usr/ports/x11/e17-module-flame/e_modules/calendar/
src'
gmake[1]: *** [all-recursive] Error 1
gmake[1]: Leaving directory `/usr/ports/x11/e17-module-flame/e_modules/calendar'
gmake: *** [all] Error 2
Serpentis#