-f 32/libgcc_s.so && if [ -f 32/libgcc_s.so.1 ]; then mv -f 32/libgcc_s.so.1 32/libgcc_s.so.1.backup; else true; fi && mv 32/libgcc_s.so.1.tmp 32/libgcc_s.so.1 && ln -s libgcc_s.so.1 32/libgcc_s.so
/usr/x86_64-pc-linux-gnu/bin/ld: skipping incompatible /usr/lib/gcc/x86_64-pc-linux-gnu/4.1.1/../../../libc.so when searching for -lc
/usr/x86_64-pc-linux-gnu/bin/ld: skipping incompatible /usr/lib/gcc/x86_64-pc-linux-gnu/4.1.1/../../../libc.a when searching for -lc
/usr/x86_64-pc-linux-gnu/bin/ld: skipping incompatible /usr/lib/libc.so when searching for -lc
/usr/x86_64-pc-linux-gnu/bin/ld: skipping incompatible /usr/lib/libc.a when searching for -lc
/usr/x86_64-pc-linux-gnu/bin/ld: cannot find -lc
collect2: ld returned 1 exit status
make[3]: *** [32/libgcc_s.so] Error 1
make[3]: Leaving directory `/var/tmp/portage/gcc-4.1.1-r1/work/build/gcc'
make[2]: *** [stmp-multilib] Error 2
make[2]: Leaving directory `/var/tmp/portage/gcc-4.1.1-r1/work/build/gcc'
make[1]: *** [stage1_build] Error 2
make[1]: Leaving directory `/var/tmp/portage/gcc-4.1.1-r1/work/build/gcc'
make: *** [profiledbootstrap] Error 2
!!! ERROR: sys-devel/gcc-4.1.1-r1 failed.
Call stack:
ebuild.sh, line 1546: Called dyn_compile
ebuild.sh, line 937: Called src_compile
ebuild.sh, line 1255: Called toolchain_src_compile
toolchain.eclass, line 24: Called gcc_src_compile
toolchain.eclass, line 1529: Called gcc_do_make
toolchain.eclass, line 1403: Called die
!!! emake failed with profiledbootstrap
!!! If you need support, post the topmost build error, and the call stack if relevant.