All pastes #167632 Raw Edit

Unnamed

public text v1 · immutable
·published 2006-09-12 04:57 UTC
rendered paste body
checking for isinfl declaration... no
checking for _isinfl declaration... no
checking for copysignl declaration... yes
checking for copysignl... (cached) yes
checking for atan2l declaration... yes
checking for atan2l... (cached) yes
checking for expl declaration... yes
checking for expl... (cached) yes
checking for fabsl declaration... yes
checking for fabsl... (cached) yes
checking for fmodl declaration... yes
checking for fmodl... (cached) yes
checking for frexpl declaration... yes
checking for frexpl... (cached) yes
checking for hypotl declaration... yes
checking for hypotl... (cached) yes
checking for ldexpl declaration... yes
checking for ldexpl... (cached) yes
checking for logl declaration... yes
checking for logl... (cached) yes
checking for log10l declaration... yes
checking for log10l... (cached) yes
checking for modfl declaration... yes
checking for modfl... (cached) yes
checking for powl declaration... yes
checking for powl... (cached) yes
checking for sqrtl declaration... yes
checking for sqrtl... (cached) yes
checking for sincosl declaration... yes
checking for sincosl... (cached) yes
checking for finitel declaration... no
checking for _finitel declaration... no
checking for __builtin_abs declaration... yes
checking for __builtin_abs linkage... yes
checking for __builtin_fabsf declaration... yes
checking for __builtin_fabsf linkage... yes
checking for __builtin_fabs declaration... yes
checking for __builtin_fabs linkage... yes
checking for __builtin_fabsl declaration... yes
checking for __builtin_fabsl linkage... yes
checking for __builtin_labs declaration... yes
checking for __builtin_labs linkage... yes
checking for __builtin_sqrtf declaration... yes
checking for __builtin_sqrtf linkage... yes
checking for __builtin_sqrt declaration... yes
checking for __builtin_sqrt linkage... yes
checking for __builtin_sqrtl declaration... yes
checking for __builtin_sqrtl linkage... yes
checking for __builtin_sinf declaration... yes
checking for __builtin_sinf linkage... yes
checking for __builtin_sin declaration... yes
checking for __builtin_sin linkage... yes
checking for __builtin_sinl declaration... yes
checking for __builtin_sinl linkage... yes
checking for __builtin_cosf declaration... yes
checking for __builtin_cosf linkage... yes
checking for __builtin_cos declaration... yes
checking for __builtin_cos linkage... yes
checking for __builtin_cosl declaration... yes
checking for __builtin_cosl linkage... yes
checking for main in -lm... (cached) yes
checking for copysignf... (cached) yes
checking for __signbit... (cached) no
checking for __signbitf... (cached) no
checking for __signbitl... (cached) no
checking for iconv.h... (cached) yes
checking for langinfo.h... (cached) yes
checking for iconv in -liconv... (cached) no
checking for iconv_open... (cached) yes
checking for iconv_close... (cached) yes
checking for iconv... (cached) yes
checking for nl_langinfo... (cached) yes
checking for enabled iconv specializations... yes
checking for strtold declaration... yes
checking for strtold... (cached) yes
checking for strtof declaration... yes
checking for strtof... (cached) yes
checking for sys/ioctl.h... (cached) yes
checking for sys/filio.h... (cached) yes
checking for poll... (cached) yes
checking for S_ISREG or S_IFREG... (cached) (cached) S_ISREG
checking for sys/uio.h... (cached) yes
checking for writev... (cached) yes
checking for int64_t... (cached) yes
checking for LFS support... (cached) yes
checking whether the target supports thread-local storage... no
checking for locale.h... (cached) yes
checking for LC_MESSAGES... (cached) yes
checking for stdlib.h... (cached) yes
checking for unistd.h... (cached) yes
checking for getpagesize... (cached) yes
checking for working mmap... (cached) yes
configure: WARNING: === You have requested some kind of symbol versioning, but
configure: WARNING: === you are not using a supported linker.
configure: WARNING: === Symbol versioning will be disabled.
checking for size_t as unsigned int... yes
checking for ptrdiff_t as int... yes
configure: versioning on shared library symbols is no
checking for unistd.h... (cached) yes
checking for sys/time.h... (cached) yes
checking for sys/resource.h... (cached) yes
checking for RLIMIT_DATA... yes
checking for RLIMIT_RSS... no
checking for RLIMIT_VMEM... yes
checking for RLIMIT_AS... yes
checking for RLIMIT_FSIZE... yes
checking for testsuite resource limits support... yes
checking for setenv declaration... yes
checking for setenv... (cached) yes
updating cache ./config.cache
checking for gxx-include-dir... no
checking for --enable-version-specific-runtime-libs... no
checking for install location... ${prefix}/include/c++/${gcc_version}
configure: creating ./config.status
config.status: creating Makefile
config.status: creating include/Makefile
config.status: creating libmath/Makefile
config.status: creating libsupc++/Makefile
config.status: creating src/Makefile
config.status: creating po/Makefile
config.status: creating testsuite/Makefile
config.status: creating scripts/testsuite_flags
config.status: creating config.h
config.status: config.h is unchanged
config.status: executing default-1 commands
Adding multilib support to Makefile in ../../../libstdc++-v3
multidirs=amd64
with_multisubdir=
Running configure in multilib subdirs amd64
pwd: /export/home/justin/SFS/sources/gcc-4.1.1/objdir/i386-pc-solaris2.11/libstdc++-v3
Running configure in multilib subdir amd64
pwd: /export/home/justin/SFS/sources/gcc-4.1.1/objdir/i386-pc-solaris2.11
configure: loading cache ./config.cache
checking build system type... i386-pc-solaris2.11
checking host system type... i386-pc-solaris2.11
checking target system type... i386-pc-solaris2.11
checking for a BSD-compatible install... /opt/sfw/bin/install -c
checking whether build environment is sane... yes
checking for gawk... gawk
checking whether /usr/sfw/bin/gmake sets $(MAKE)... yes
checking for i386-pc-solaris2.11-gcc... /export/home/justin/SFS/sources/gcc-4.1.1/objdir/./gcc/xgcc -B/export/home/justin/SFS/sources/gcc-4.1.1/objdir/./gcc/ -B/export/home/justin/tools/i386-pc-solaris2.11/bin/ -B/export/home/justin/tools/i386-pc-solaris2.11/lib/ -isystem /export/home/justin/tools/i386-pc-solaris2.11/include -isystem /export/home/justin/tools/i386-pc-solaris2.11/sys-include  -m64
checking for C compiler default output file name... a.out
checking whether the C compiler works... configure: error: cannot run C compiled programs.
If you meant to cross compile, use `--host'.
See `config.log' for more details.
gmake[2]: *** [configure-target-libstdc++-v3] Error 1
gmake[2]: Leaving directory `/export/home/justin/SFS/sources/gcc-4.1.1/objdir'
gmake[1]: *** [all] Error 2
gmake[1]: Leaving directory `/export/home/justin/SFS/sources/gcc-4.1.1/objdir'
gmake: *** [bootstrap] Error 2