stik
public text v1 · immutableclassdev.c: In function `net_add':
classdev.c:236: error: `ARPHRD_IEEE80211_PRISM' undeclared (first use in this function)
classdev.c:236: error: (Each undeclared identifier is reported only once
classdev.c:236: error: for each function it appears in.)
classdev.c:237: error: `ARPHRD_IEEE80211_RADIOTAP' undeclared (first use in this function)
make[5]: *** [classdev.lo] Error 1