All pastes #167572 Raw Edit

Untitled

public text v1 · immutable
·published 2006-09-12 03:06 UTC
rendered paste body
ion returning non-void
../../gcc/config/i386/gmon-sol2.c:223:11: warning: extra tokens at end of #endif directive
../../gcc/config/i386/gmon-sol2.c:237:13: warning: extra tokens at end of #endif directive
../../gcc/config/i386/gmon-sol2.c:244: warning: implicit declaration of function 'close'
../../gcc/config/i386/gmon-sol2.c: At top level:
../../gcc/config/i386/gmon-sol2.c:253: warning: return type defaults to 'int'
../../gcc/config/i386/gmon-sol2.c:253: warning: function declaration isn't a prototype
../../gcc/config/i386/gmon-sol2.c: In function 'internal_mcount':
../../gcc/config/i386/gmon-sol2.c:253: warning: old-style function definition
../../gcc/config/i386/gmon-sol2.c:274: warning: type defaults to 'int' in declaration of 'etext'
../../gcc/config/i386/gmon-sol2.c:274: warning: function declaration isn't a prototype
../../gcc/config/i386/gmon-sol2.c:281: warning: implicit declaration of function 'atexit'
../../gcc/config/i386/gmon-sol2.c:376: warning: 'return' with no value, in function returning non-void
../../gcc/config/i386/gmon-sol2.c: At top level:
../../gcc/config/i386/gmon-sol2.c:391: warning: return type defaults to 'int'
../../gcc/config/i386/gmon-sol2.c:391: warning: function declaration isn't a prototype
../../gcc/config/i386/gmon-sol2.c: In function 'moncontrol':
../../gcc/config/i386/gmon-sol2.c:392: warning: old-style function definition
../../gcc/config/i386/gmon-sol2.c:396: warning: implicit declaration of function 'profil'
../../gcc/config/i386/gmon-sol2.c:398: warning: cast from pointer to integer of different size
../../gcc/config/i386/gmon-sol2.c:406: warning: control reaches end of non-void function
../../gcc/config/i386/gmon-sol2.c: At top level:
../../gcc/config/i386/gmon-sol2.c:58: warning: 'sccsid' defined but not used
Assembler:
        "", line 1 : Illegal flag (-)
gmake[4]: *** [amd64/gmon.o] Error 1
gmake[4]: Leaving directory `/export/home/justin/SFS/sources/gcc-4.1.1/objdir/gcc'
gmake[3]: *** [extraamd64] Error 2
gmake[3]: Leaving directory `/export/home/justin/SFS/sources/gcc-4.1.1/objdir/gcc'
gmake[2]: *** [stmp-multilib] Error 2
gmake[2]: Leaving directory `/export/home/justin/SFS/sources/gcc-4.1.1/objdir/gcc'
gmake[1]: *** [stage1_build] Error 2
gmake[1]: Leaving directory `/export/home/justin/SFS/sources/gcc-4.1.1/objdir/gcc'
gmake: *** [bootstrap] Error 2

real    5m57.865s
user    3m36.242s
sys     2m7.006s

 echo $PATH
/opt/SUNWspro/bin:/opt/onbld/bin:/usr/sbin:/usr/bin:/usr/sfw/bin:/opt/sfw/bin:/usr/ccs/bin:/usr/ucb