rendered paste bodyAR_FOR_TARGET="x86_64-pc-linux-gnu-ar" \
AR_CREATE_FOR_TARGET="x86_64-pc-linux-gnu-ar rc" \
AR_EXTRACT_FOR_TARGET="x86_64-pc-linux-gnu-ar x" \
AR_FLAGS_FOR_TARGET="" \
CC="gcc" CFLAGS="-O -DENABLE_CHECKING -DENABLE_ASSERT_CHECKING -W -Wall -Wwrite-strings -Wstrict-prototypes -Wmissing-prototypes -pedantic -Wno-long-long -Wno-variadic-macros -Wold-style-definition -Wmissing-format-attribute " \
BUILD_PREFIX="" \
BUILD_PREFIX_1="loser-" \
LANGUAGES="c " \
LIBGCC2_CFLAGS="-O2 -O2 -march=k8 -O2 -pipe -DIN_GCC -W -Wall -Wwrite-strings -Wstrict-prototypes -Wmissing-prototypes -Wold-style-definition -isystem ./include -fPIC -g -DHAVE_GTHR_DEFAULT -DIN_LIBGCC2 -D__GCC_FLOAT_NOT_NEEDED -m32 " \
MULTILIB_CFLAGS=" -m32" T=32/ 32/crtbegin.o 32/crtend.o 32/crtbeginS.o 32/crtendS.o 32/crtbeginT.o 32/crtfastmath.o
make[4]: Entering directory `/var/tmp/portage/gcc-4.1.1-r1/work/build/gcc'
./xgcc -B./ -B/usr/x86_64-pc-linux-gnu/bin/ -isystem /usr/x86_64-pc-linux-gnu/include -isystem /usr/x86_64-pc-linux-gnu/sys-include -L/var/tmp/portage/gcc-4.1.1-r1/work/build/gcc/../ld -O2 -O2 -march=k8 -O2 -pipe -DIN_GCC -W -Wall -Wwrite-strings -Wstrict-prototypes -Wmissing-prototypes -Wold-style-definition -isystem ./include -I. -I32 -I/var/tmp/portage/gcc-4.1.1-r1/work/gcc-4.1.1/gcc -I/var/tmp/portage/gcc-4.1.1-r1/work/gcc-4.1.1/gcc/32 -I/var/tmp/portage/gcc-4.1.1-r1/work/gcc-4.1.1/gcc/../include -I/var/tmp/portage/gcc-4.1.1-r1/work/gcc-4.1.1/gcc/../libcpp/include -m32 -g0 -finhibit-size-directive -fno-inline-functions -fno-exceptions -fno-zero-initialized-in-bss -fno-unit-at-a-time -fno-omit-frame-pointer -fno-asynchronous-unwind-tables \
-c /var/tmp/portage/gcc-4.1.1-r1/work/gcc-4.1.1/gcc/crtstuff.c -DCRT_BEGIN \
-o 32/crtbegin.o
In file included from /usr/include/features.h:346,
from /usr/include/stdio.h:28,
from /var/tmp/portage/gcc-4.1.1-r1/work/gcc-4.1.1/gcc/tsystem.h:90,
from /var/tmp/portage/gcc-4.1.1-r1/work/gcc-4.1.1/gcc/crtstuff.c:68:
/usr/include/gnu/stubs.h:7:27: error: gnu/stubs-32.h: No such file or directory
make[4]: *** [32/crtbegin.o] Error 1
make[4]: Leaving directory `/var/tmp/portage/gcc-4.1.1-r1/work/build/gcc'
make[3]: *** [extra32] Error 2
make[3]: Leaving directory `/var/tmp/portage/gcc-4.1.1-r1/work/build/gcc'
make[2]: *** [stmp-multilib] Error 2
make[2]: Leaving directory `/var/tmp/portage/gcc-4.1.1-r1/work/build/gcc'
make[1]: *** [stage1_build] Error 2
make[1]: Leaving directory `/var/tmp/portage/gcc-4.1.1-r1/work/build/gcc'
make: *** [profiledbootstrap] Error 2
!!! ERROR: sys-devel/gcc-4.1.1-r1 failed.
Call stack:
ebuild.sh, line 1546: Called dyn_compile
ebuild.sh, line 937: Called src_compile
ebuild.sh, line 1255: Called toolchain_src_compile
toolchain.eclass, line 24: Called gcc_src_compile
toolchain.eclass, line 1529: Called gcc_do_make
toolchain.eclass, line 1403: Called die
!!! emake failed with profiledbootstrap
!!! If you need support, post the topmost build error, and the call stack if relevant.