------ Build started: Project: Download APR, Configuration: Debug Win32 ------
Downloading APR.
Downloading: http://svn.freeswitch.org/downloads/win32/7za.exe
Downloading: http://svn.freeswitch.org/downloads/libs/apr-1.2.7.tar.gz
Extracting: C:\Documents and Settings\michael\Desktop\freeswitch\libs\apr-1.2.7.tar.gz
c:\Documents and Settings\michael\Desktop\freeswitch\libs\win32\util.vbs(99, 2) WshShell.Exec: C:\Documents and Settings\michael\Desktop\freeswitch\libs\win32\tmp9558.bat is not a valid Win32 application.
Build log was saved at "file://c:\Documents and Settings\michael\Desktop\freeswitch\libs\win32\Debug\BuildLog Download APR.htm"
Download APR - 0 error(s), 0 warning(s)
------ Build started: Project: libapr, Configuration: Debug Win32 ------
Performing Pre-Build Event...
The system cannot find the path specified.
File not found - *.h
0 File(s) copied
Project : error PRJ0019: A tool returned an error code from "Performing Pre-Build Event..."
Build log was saved at "file://c:\Documents and Settings\michael\Desktop\freeswitch\libs\win32\apr\Debug\BuildLog.htm"
libapr - 1 error(s), 0 warning(s)
------ Build started: Project: Download EXOSIP, Configuration: Debug Win32 ------
Downloading EXOSIP.
Downloading: http://svn.freeswitch.org/downloads/libs/libosip2-2.2.2.tar.gz
Extracting: C:\Documents and Settings\michael\Desktop\freeswitch\libs\libosip2-2.2.2.tar.gz
c:\Documents and Settings\michael\Desktop\freeswitch\libs\win32\util.vbs(99, 2) WshShell.Exec: C:\Documents and Settings\michael\Desktop\freeswitch\libs\win32\tmp1021.bat is not a valid Win32 application.
Downloading: http://svn.freeswitch.org/downloads/libs/libeXosip2-2.2.2.tar.gz
Extracting: C:\Documents and Settings\michael\Desktop\freeswitch\libs\libeXosip2-2.2.2.tar.gz
c:\Documents and Settings\michael\Desktop\freeswitch\libs\win32\util.vbs(99, 2) WshShell.Exec: C:\Documents and Settings\michael\Desktop\freeswitch\libs\win32\tmp3007.bat is not a valid Win32 application.
Build log was saved at "file://c:\Documents and Settings\michael\Desktop\freeswitch\libs\win32\Debug\BuildLog Download EXOSIP.htm"
Download EXOSIP - 0 error(s), 0 warning(s)
------ Build started: Project: Download PCRE, Configuration: Debug Win32 ------
Downloading PCRE.
Downloading: http://svn.freeswitch.org/downloads/libs/pcre-6.4.tar.gz
Extracting: C:\Documents and Settings\michael\Desktop\freeswitch\libs\pcre-6.4.tar.gz
c:\Documents and Settings\michael\Desktop\freeswitch\libs\win32\util.vbs(99, 2) WshShell.Exec: C:\Documents and Settings\michael\Desktop\freeswitch\libs\win32\tmp6356.bat is not a valid Win32 application.
Build log was saved at "file://c:\Documents and Settings\michael\Desktop\freeswitch\libs\win32\Debug\BuildLog Download PCRE.htm"
Download PCRE - 0 error(s), 0 warning(s)
------ Build started: Project: Download APR-Iconv, Configuration: Debug Win32 ------
Downloading APR-Iconv.
Downloading: http://svn.freeswitch.org/downloads/libs/apr-iconv-1.1.1.tar.gz
Extracting: C:\Documents and Settings\michael\Desktop\freeswitch\libs\apr-iconv-1.1.1.tar.gz
c:\Documents and Settings\michael\Desktop\freeswitch\libs\win32\util.vbs(99, 2) WshShell.Exec: C:\Documents and Settings\michael\Desktop\freeswitch\libs\win32\tmp8480.bat is not a valid Win32 application.
Build log was saved at "file://c:\Documents and Settings\michael\Desktop\freeswitch\libs\win32\Debug\BuildLog Download APR-Iconv.htm"
Download APR-Iconv - 0 error(s), 0 warning(s)
------ Build started: Project: Download LIBRESAMPLE, Configuration: Debug Win32 ------
Downloading LIBRESAMPLE.
Downloading: http://svn.freeswitch.org/downloads/libs/libresample-0.1.3.zip
Extracting: C:\Documents and Settings\michael\Desktop\freeswitch\libs\libresample-0.1.3.zip
c:\Documents and Settings\michael\Desktop\freeswitch\libs\win32\util.vbs(99, 2) WshShell.Exec: C:\Documents and Settings\michael\Desktop\freeswitch\libs\win32\tmp2766.bat is not a valid Win32 application.
Build log was saved at "file://c:\Documents and Settings\michael\Desktop\freeswitch\libs\win32\Debug\BuildLog Download LIBRESAMPLE.htm"
Download LIBRESAMPLE - 0 error(s), 0 warning(s)
------ Build started: Project: libpcre Generate pcre_chartables.c, Configuration: Debug Win32 ------
Compiling...
dftables.c
c:\documents and settings\michael\desktop\freeswitch\libs\win32\pcre\dftables.c(50) : fatal error C1083: Cannot open include file: 'pcre_internal.h': No such file or directory
Build log was saved at "file://c:\Documents and Settings\michael\Desktop\freeswitch\libs\win32\pcre\Debug\BuildLog.htm"
libpcre Generate pcre_chartables.c - 1 error(s), 0 warning(s)
------ Build started: Project: Download SQLITE, Configuration: Debug Win32 ------
Downloading SQLITE.
Downloading: http://svn.freeswitch.org/downloads/libs/sqlite-source-3_3_6.zip
Extracting: C:\Documents and Settings\michael\Desktop\freeswitch\libs\sqlite-source-3_3_6.zip
c:\Documents and Settings\michael\Desktop\freeswitch\libs\win32\util.vbs(99, 2) WshShell.Exec: C:\Documents and Settings\michael\Desktop\freeswitch\libs\win32\tmp9291.bat is not a valid Win32 application.
Build log was saved at "file://c:\Documents and Settings\michael\Desktop\freeswitch\libs\win32\Debug\BuildLog Download SQLITE.htm"
Download SQLITE - 0 error(s), 0 warning(s)
------ Build started: Project: Download IKSEMEL, Configuration: Debug Win32 ------
Downloading IKSEMEL.
Downloading: http://svn.freeswitch.org/downloads/libs/iksemel-1.2.tar.gz
Extracting: C:\Documents and Settings\michael\Desktop\freeswitch\libs\iksemel-1.2.tar.gz
c:\Documents and Settings\michael\Desktop\freeswitch\libs\win32\util.vbs(99, 2) WshShell.Exec: C:\Documents and Settings\michael\Desktop\freeswitch\libs\win32\tmp7023.bat is not a valid Win32 application.
Build log was saved at "file://c:\Documents and Settings\michael\Desktop\freeswitch\libs\win32\Debug\BuildLog Download IKSEMEL.htm"
Download IKSEMEL - 0 error(s), 0 warning(s)
------ Build started: Project: Download APR-Util, Configuration: Debug Win32 ------
Downloading APR-Util.
Downloading: http://svn.freeswitch.org/downloads/libs/apr-util-1.2.7.tar.gz
Extracting: C:\Documents and Settings\michael\Desktop\freeswitch\libs\apr-util-1.2.7.tar.gz
c:\Documents and Settings\michael\Desktop\freeswitch\libs\win32\util.vbs(99, 2) WshShell.Exec: C:\Documents and Settings\michael\Desktop\freeswitch\libs\win32\tmp490.bat is not a valid Win32 application.
Build log was saved at "file://c:\Documents and Settings\michael\Desktop\freeswitch\libs\win32\Debug\BuildLog Download APR-Util.htm"
Download APR-Util - 0 error(s), 0 warning(s)
------ Build started: Project: libapriconv, Configuration: Debug Win32 ------
Performing Pre-Build Event...
File not found - *.h
0 File(s) copied
Project : error PRJ0019: A tool returned an error code from "Performing Pre-Build Event..."
Build log was saved at "file://c:\Documents and Settings\michael\Desktop\freeswitch\libs\win32\apr-iconv\Debug\BuildLog.htm"
libapriconv - 1 error(s), 0 warning(s)
------ Build started: Project: Download SPIDERMONKEY, Configuration: Debug Win32 ------
Downloading SPIDERMONKEY.
Downloading: http://svn.freeswitch.org/downloads/libs/js20051231.zip
Extracting: C:\Documents and Settings\michael\Desktop\freeswitch\libs\js20051231.zip
c:\Documents and Settings\michael\Desktop\freeswitch\libs\win32\util.vbs(99, 2) WshShell.Exec: C:\Documents and Settings\michael\Desktop\freeswitch\libs\win32\tmp7865.bat is not a valid Win32 application.
Downloading: http://svn.freeswitch.org/downloads/libs/nspr-4.6.1.winnt5.debug.zip
Extracting: C:\Documents and Settings\michael\Desktop\freeswitch\libs\nspr-4.6.1.winnt5.debug.zip
c:\Documents and Settings\michael\Desktop\freeswitch\libs\win32\util.vbs(99, 2) WshShell.Exec: C:\Documents and Settings\michael\Desktop\freeswitch\libs\win32\tmp3984.bat is not a valid Win32 application.
Downloading: http://svn.freeswitch.org/downloads/libs/nspr-4.6.1.winnt5.release.zip
Extracting: C:\Documents and Settings\michael\Desktop\freeswitch\libs\nspr-4.6.1.winnt5.release.zip
c:\Documents and Settings\michael\Desktop\freeswitch\libs\win32\util.vbs(99, 2) WshShell.Exec: C:\Documents and Settings\michael\Desktop\freeswitch\libs\win32\tmp9608.bat is not a valid Win32 application.
Build log was saved at "file://c:\Documents and Settings\michael\Desktop\freeswitch\libs\win32\Debug\BuildLog Download SPIDERMONKEY.htm"
Download SPIDERMONKEY - 0 error(s), 0 warning(s)
------ Build started: Project: osipparser2, Configuration: Debug Win32 ------
Compiling...
osip_accept.c
c1 : fatal error C1083: Cannot open source file: '..\..\libosip2-2.2.2\src\osipparser2\osip_accept.c': No such file or directory
osip_accept_encoding.c
c1 : fatal error C1083: Cannot open source file: '..\..\libosip2-2.2.2\src\osipparser2\osip_accept_encoding.c': No such file or directory
osip_accept_language.c
c1 : fatal error C1083: Cannot open source file: '..\..\libosip2-2.2.2\src\osipparser2\osip_accept_language.c': No such file or directory
osip_alert_info.c
c1 : fatal error C1083: Cannot open source file: '..\..\libosip2-2.2.2\src\osipparser2\osip_alert_info.c': No such file or directory
osip_allow.c
c1 : fatal error C1083: Cannot open source file: '..\..\libosip2-2.2.2\src\osipparser2\osip_allow.c': No such file or directory
osip_authentication_info.c
c1 : fatal error C1083: Cannot open source file: '..\..\libosip2-2.2.2\src\osipparser2\osip_authentication_info.c': No such file or directory
osip_authorization.c
c1 : fatal error C1083: Cannot open source file: '..\..\libosip2-2.2.2\src\osipparser2\osip_authorization.c': No such file or directory
osip_body.c
c1 : fatal error C1083: Cannot open source file: '..\..\libosip2-2.2.2\src\osipparser2\osip_body.c': No such file or directory
osip_call_id.c
c1 : fatal error C1083: Cannot open source file: '..\..\libosip2-2.2.2\src\osipparser2\osip_call_id.c': No such file or directory
osip_call_info.c
c1 : fatal error C1083: Cannot open source file: '..\..\libosip2-2.2.2\src\osipparser2\osip_call_info.c': No such file or directory
osip_contact.c
c1 : fatal error C1083: Cannot open source file: '..\..\libosip2-2.2.2\src\osipparser2\osip_contact.c': No such file or directory
osip_content_disposition.c
c1 : fatal error C1083: Cannot open source file: '..\..\libosip2-2.2.2\src\osipparser2\osip_content_disposition.c': No such file or directory
osip_content_encoding.c
c1 : fatal error C1083: Cannot open source file: '..\..\libosip2-2.2.2\src\osipparser2\osip_content_encoding.c': No such file or directory
osip_content_length.c
c1 : fatal error C1083: Cannot open source file: '..\..\libosip2-2.2.2\src\osipparser2\osip_content_length.c': No such file or directory
osip_content_type.c
c1 : fatal error C1083: Cannot open source file: '..\..\libosip2-2.2.2\src\osipparser2\osip_content_type.c': No such file or directory
osip_cseq.c
c1 : fatal error C1083: Cannot open source file: '..\..\libosip2-2.2.2\src\osipparser2\osip_cseq.c': No such file or directory
osip_error_info.c
c1 : fatal error C1083: Cannot open source file: '..\..\libosip2-2.2.2\src\osipparser2\osip_error_info.c': No such file or directory
osip_from.c
c1 : fatal error C1083: Cannot open source file: '..\..\libosip2-2.2.2\src\osipparser2\osip_from.c': No such file or directory
osip_header.c
c1 : fatal error C1083: Cannot open source file: '..\..\libosip2-2.2.2\src\osipparser2\osip_header.c': No such file or directory
osip_list.c
c1 : fatal error C1083: Cannot open source file: '..\..\libosip2-2.2.2\src\osipparser2\osip_list.c': No such file or directory
Generating Code...
Compiling...
osip_md5c.c
c1 : fatal error C1083: Cannot open source file: '..\..\libosip2-2.2.2\src\osipparser2\osip_md5c.c': No such file or directory
osip_message.c
c1 : fatal error C1083: Cannot open source file: '..\..\libosip2-2.2.2\src\osipparser2\osip_message.c': No such file or directory
osip_message_parse.c
c1 : fatal error C1083: Cannot open source file: '..\..\libosip2-2.2.2\src\osipparser2\osip_message_parse.c': No such file or directory
osip_message_to_str.c
c1 : fatal error C1083: Cannot open source file: '..\..\libosip2-2.2.2\src\osipparser2\osip_message_to_str.c': No such file or directory
osip_mime_version.c
c1 : fatal error C1083: Cannot open source file: '..\..\libosip2-2.2.2\src\osipparser2\osip_mime_version.c': No such file or directory
osip_parser_cfg.c
c1 : fatal error C1083: Cannot open source file: '..\..\libosip2-2.2.2\src\osipparser2\osip_parser_cfg.c': No such file or directory
osip_port.c
c1 : fatal error C1083: Cannot open source file: '..\..\libosip2-2.2.2\src\osipparser2\osip_port.c': No such file or directory
osip_proxy_authenticate.c
c1 : fatal error C1083: Cannot open source file: '..\..\libosip2-2.2.2\src\osipparser2\osip_proxy_authenticate.c': No such file or directory
osip_proxy_authentication_info.c
c1 : fatal error C1083: Cannot open source file: '..\..\libosip2-2.2.2\src\osipparser2\osip_proxy_authentication_info.c': No such file or directory
osip_proxy_authorization.c
c1 : fatal error C1083: Cannot open source file: '..\..\libosip2-2.2.2\src\osipparser2\osip_proxy_authorization.c': No such file or directory
osip_record_route.c
c1 : fatal error C1083: Cannot open source file: '..\..\libosip2-2.2.2\src\osipparser2\osip_record_route.c': No such file or directory
osip_route.c
c1 : fatal error C1083: Cannot open source file: '..\..\libosip2-2.2.2\src\osipparser2\osip_route.c': No such file or directory
osip_to.c
c1 : fatal error C1083: Cannot open source file: '..\..\libosip2-2.2.2\src\osipparser2\osip_to.c': No such file or directory
osip_uri.c
c1 : fatal error C1083: Cannot open source file: '..\..\libosip2-2.2.2\src\osipparser2\osip_uri.c': No such file or directory
osip_via.c
c1 : fatal error C1083: Cannot open source file: '..\..\libosip2-2.2.2\src\osipparser2\osip_via.c': No such file or directory
osip_www_authenticate.c
c1 : fatal error C1083: Cannot open source file: '..\..\libosip2-2.2.2\src\osipparser2\osip_www_authenticate.c': No such file or directory
sdp_accessor.c
c1 : fatal error C1083: Cannot open source file: '..\..\libosip2-2.2.2\src\osipparser2\sdp_accessor.c': No such file or directory
sdp_message.c
c1 : fatal error C1083: Cannot open source file: '..\..\libosip2-2.2.2\src\osipparser2\sdp_message.c': No such file or directory
Generating Code...
Build log was saved at "file://c:\Documents and Settings\michael\Desktop\freeswitch\libs\win32\exosip\Debug\BuildLog.htm"
osipparser2 - 38 error(s), 0 warning(s)
------ Build started: Project: Download HOWL, Configuration: Debug Win32 ------
Downloading HOWL.
Downloading: http://svn.freeswitch.org/downloads/libs/howl-1.0.0.tar.gz
Extracting: C:\Documents and Settings\michael\Desktop\freeswitch\libs\howl-1.0.0.tar.gz
c:\Documents and Settings\michael\Desktop\freeswitch\libs\win32\util.vbs(99, 2) WshShell.Exec: C:\Documents and Settings\michael\Desktop\freeswitch\libs\win32\tmp2243.bat is not a valid Win32 application.
Build log was saved at "file://c:\Documents and Settings\michael\Desktop\freeswitch\libs\win32\Debug\BuildLog Download HOWL.htm"
Download HOWL - 0 error(s), 0 warning(s)
------ Build started: Project: Download XMLRPC, Configuration: Debug Win32 ------
Downloading XMLRPC.
Downloading: http://svn.freeswitch.org/downloads/libs/xmlrpc-c-1.03.14.tgz
Extracting: C:\Documents and Settings\michael\Desktop\freeswitch\libs\xmlrpc-c-1.03.14.tgz
c:\Documents and Settings\michael\Desktop\freeswitch\libs\win32\util.vbs(99, 2) WshShell.Exec: C:\Documents and Settings\michael\Desktop\freeswitch\libs\win32\tmp3521.bat is not a valid Win32 application.
Build log was saved at "file://c:\Documents and Settings\michael\Desktop\freeswitch\libs\win32\Debug\BuildLog Download XMLRPC.htm"
Download XMLRPC - 0 error(s), 0 warning(s)
------ Build started: Project: xmlrpc, Configuration: Debug Win32 ------
Performing Pre-Build Event...
Compiling...
casprintf.c
c1 : fatal error C1083: Cannot open source file: '..\..\xmlrpc-c-1.03.14\lib\util\casprintf.c': No such file or directory
pthreadx_win32.c
c1 : fatal error C1083: Cannot open source file: '..\..\xmlrpc-c-1.03.14\lib\util\pthreadx_win32.c': No such file or directory
xmlrpc_array.c
c1 : fatal error C1083: Cannot open source file: '..\..\xmlrpc-c-1.03.14\src\xmlrpc_array.c': No such file or directory
xmlrpc_authcookie.c
c1 : fatal error C1083: Cannot open source file: '..\..\xmlrpc-c-1.03.14\src\xmlrpc_authcookie.c': No such file or directory
xmlrpc_base64.c
c1 : fatal error C1083: Cannot open source file: '..\..\xmlrpc-c-1.03.14\src\xmlrpc_base64.c': No such file or directory
xmlrpc_builddecomp.c
c1 : fatal error C1083: Cannot open source file: '..\..\xmlrpc-c-1.03.14\src\xmlrpc_builddecomp.c': No such file or directory
xmlrpc_client.c
c1 : fatal error C1083: Cannot open source file: '..\..\xmlrpc-c-1.03.14\src\xmlrpc_client.c': No such file or directory
xmlrpc_data.c
c1 : fatal error C1083: Cannot open source file: '..\..\xmlrpc-c-1.03.14\src\xmlrpc_data.c': No such file or directory
xmlrpc_datetime.c
c1 : fatal error C1083: Cannot open source file: '..\..\xmlrpc-c-1.03.14\src\xmlrpc_datetime.c': No such file or directory
xmlrpc_expat.c
c1 : fatal error C1083: Cannot open source file: '..\..\xmlrpc-c-1.03.14\src\xmlrpc_expat.c': No such file or directory
xmlrpc_parse.c
c1 : fatal error C1083: Cannot open source file: '..\..\xmlrpc-c-1.03.14\src\xmlrpc_parse.c': No such file or directory
xmlrpc_registry.c
c1 : fatal error C1083: Cannot open source file: '..\..\xmlrpc-c-1.03.14\src\xmlrpc_registry.c': No such file or directory
xmlrpc_serialize.c
c1 : fatal error C1083: Cannot open source file: '..\..\xmlrpc-c-1.03.14\src\xmlrpc_serialize.c': No such file or directory
xmlrpc_server_abyss.c
c1 : fatal error C1083: Cannot open source file: '..\..\xmlrpc-c-1.03.14\src\xmlrpc_server_abyss.c': No such file or directory
xmlrpc_struct.c
c1 : fatal error C1083: Cannot open source file: '..\..\xmlrpc-c-1.03.14\src\xmlrpc_struct.c': No such file or directory
xmlrpc_strutil.c
c1 : fatal error C1083: Cannot open source file: '..\..\xmlrpc-c-1.03.14\src\xmlrpc_strutil.c': No such file or directory
xmlrpc_support.c
c1 : fatal error C1083: Cannot open source file: '..\..\xmlrpc-c-1.03.14\src\xmlrpc_support.c': No such file or directory
xmlrpc_utf8.c
c1 : fatal error C1083: Cannot open source file: '..\..\xmlrpc-c-1.03.14\src\xmlrpc_utf8.c': No such file or directory
xmlrpc_wininet_transport.c
c1 : fatal error C1083: Cannot open source file: '..\..\xmlrpc-c-1.03.14\lib\wininet_transport\xmlrpc_wininet_transport.c': No such file or directory
Generating Code...
Build log was saved at "file://c:\Documents and Settings\michael\Desktop\freeswitch\libs\win32\xmlrpc\Debug\xmlrpc\BuildLog.htm"
xmlrpc - 19 error(s), 0 warning(s)
------ Build started: Project: Download PTHREAD, Configuration: Debug Win32 ------
Downloading PTHREAD.
Downloading: http://svn.freeswitch.org/downloads/libs/pthreads-w32-2-7-0-release.tar.gz
Extracting: C:\Documents and Settings\michael\Desktop\freeswitch\libs\pthreads-w32-2-7-0-release.tar.gz
c:\Documents and Settings\michael\Desktop\freeswitch\libs\win32\util.vbs(99, 2) WshShell.Exec: C:\Documents and Settings\michael\Desktop\freeswitch\libs\win32\tmp9485.bat is not a valid Win32 application.
Build log was saved at "file://c:\Documents and Settings\michael\Desktop\freeswitch\libs\win32\Debug\BuildLog Download PTHREAD.htm"
Download PTHREAD - 0 error(s), 0 warning(s)
------ Build started: Project: Download CURL, Configuration: Debug Win32 ------
Downloading CURL.
Downloading: http://svn.freeswitch.org/downloads/libs/curl-7.15.2.tar.gz
Extracting: C:\Documents and Settings\michael\Desktop\freeswitch\libs\curl-7.15.2.tar.gz
c:\Documents and Settings\michael\Desktop\freeswitch\libs\win32\util.vbs(99, 2) WshShell.Exec: C:\Documents and Settings\michael\Desktop\freeswitch\libs\win32\tmp6081.bat is not a valid Win32 application.
Build log was saved at "file://c:\Documents and Settings\michael\Desktop\freeswitch\libs\win32\Debug\BuildLog Download CURL.htm"
Download CURL - 0 error(s), 0 warning(s)
------ Build started: Project: libresample, Configuration: Debug Win32 ------
Compiling...
filterkit.c
c1 : fatal error C1083: Cannot open source file: '..\..\libresample-0.1.3\src\filterkit.c': No such file or directory
resample.c
c1 : fatal error C1083: Cannot open source file: '..\..\libresample-0.1.3\src\resample.c': No such file or directory
resamplesubs.c
c1 : fatal error C1083: Cannot open source file: '..\..\libresample-0.1.3\src\resamplesubs.c': No such file or directory
Generating Code...
Build log was saved at "file://c:\Documents and Settings\michael\Desktop\freeswitch\libs\win32\libresample\Debug\BuildLog.htm"
libresample - 3 error(s), 0 warning(s)
------ Build started: Project: Download LIBSNDFILE, Configuration: Debug Win32 ------
Downloading LIBSNDFILE.
Downloading: http://svn.freeswitch.org/downloads/libs/libsndfile-1.0.16.tar.gz
Extracting: C:\Documents and Settings\michael\Desktop\freeswitch\libs\libsndfile-1.0.16.tar.gz
c:\Documents and Settings\michael\Desktop\freeswitch\libs\win32\util.vbs(99, 2) WshShell.Exec: C:\Documents and Settings\michael\Desktop\freeswitch\libs\win32\tmp4027.bat is not a valid Win32 application.
Build log was saved at "file://c:\Documents and Settings\michael\Desktop\freeswitch\libs\win32\Debug\BuildLog Download LIBSNDFILE.htm"
Download LIBSNDFILE - 0 error(s), 0 warning(s)
------ Build started: Project: libaprutil, Configuration: Debug Win32 ------
Performing Pre-Build Event...
The system cannot find the path specified.
The system cannot find the path specified.
The system cannot find the path specified.
The system cannot find the path specified.
The system cannot find the path specified.
File not found - *.h
0 File(s) copied
Project : error PRJ0019: A tool returned an error code from "Performing Pre-Build Event..."
Build log was saved at "file://c:\Documents and Settings\michael\Desktop\freeswitch\libs\win32\apr-util\Debug\BuildLog.htm"
libaprutil - 1 error(s), 0 warning(s)
------ Build started: Project: howl static library, Configuration: Debug Win32 ------
Compiling...
address.c
c1 : fatal error C1083: Cannot open source file: '..\..\howl-1.0.0\src\lib\howl\address.c': No such file or directory
buffer.c
c1 : fatal error C1083: Cannot open source file: '..\..\howl-1.0.0\src\lib\howl\buffer.c': No such file or directory
channel.c
c1 : fatal error C1083: Cannot open source file: '..\..\howl-1.0.0\src\lib\howl\channel.c': No such file or directory
debug.c
c1 : fatal error C1083: Cannot open source file: '..\..\howl-1.0.0\src\lib\howl\debug.c': No such file or directory
discovery.c
c1 : fatal error C1083: Cannot open source file: '..\..\howl-1.0.0\src\lib\howl\discovery.c': No such file or directory
interface.c
c1 : fatal error C1083: Cannot open source file: '..\..\howl-1.0.0\src\lib\howl\interface.c': No such file or directory
ior.c
c1 : fatal error C1083: Cannot open source file: '..\..\howl-1.0.0\src\lib\howl\ior.c': No such file or directory
message.c
c1 : fatal error C1083: Cannot open source file: '..\..\howl-1.0.0\src\lib\howl\message.c': No such file or directory
notosx_mdns_stub.c
c1 : fatal error C1083: Cannot open source file: '..\..\howl-1.0.0\src\lib\howl\notosx\notosx_mdns_stub.c': No such file or directory
object.c
c1 : fatal error C1083: Cannot open source file: '..\..\howl-1.0.0\src\lib\howl\object.c': No such file or directory
orb.c
c1 : fatal error C1083: Cannot open source file: '..\..\howl-1.0.0\src\lib\howl\orb.c': No such file or directory
platform.c
c1 : fatal error C1083: Cannot open source file: '..\..\howl-1.0.0\src\lib\howl\platform.c': No such file or directory
profile.c
c1 : fatal error C1083: Cannot open source file: '..\..\howl-1.0.0\src\lib\howl\profile.c': No such file or directory
salt.c
c1 : fatal error C1083: Cannot open source file: '..\..\howl-1.0.0\src\lib\howl\salt.c': No such file or directory
signal.c
c1 : fatal error C1083: Cannot open source file: '..\..\howl-1.0.0\src\lib\howl\signal.c': No such file or directory
socket.c
c1 : fatal error C1083: Cannot open source file: '..\..\howl-1.0.0\src\lib\howl\socket.c': No such file or directory
text_record.c
c1 : fatal error C1083: Cannot open source file: '..\..\howl-1.0.0\src\lib\howl\text_record.c': No such file or directory
time.c
c1 : fatal error C1083: Cannot open source file: '..\..\howl-1.0.0\src\lib\howl\time.c': No such file or directory
win32_interface.c
c1 : fatal error C1083: Cannot open source file: '..\..\howl-1.0.0\src\lib\howl\win32\win32_interface.c': No such file or directory
win32_salt.c
c1 : fatal error C1083: Cannot open source file: '..\..\howl-1.0.0\src\lib\howl\win32\win32_salt.c': No such file or directory
Generating Code...
Compiling...
win32_socket.c
c1 : fatal error C1083: Cannot open source file: '..\..\howl-1.0.0\src\lib\howl\win32\win32_socket.c': No such file or directory
win32_time.c
c1 : fatal error C1083: Cannot open source file: '..\..\howl-1.0.0\src\lib\howl\win32\win32_time.c': No such file or directory
Generating Code...
Build log was saved at "file://c:\Documents and Settings\michael\Desktop\freeswitch\libs\win32\howl\Debug\BuildLog.htm"
howl static library - 22 error(s), 0 warning(s)
------ Build started: Project: libsqlite, Configuration: Debug DLL Win32 ------
Compiling...
alter.c
c1 : fatal error C1083: Cannot open source file: '..\..\sqlite-source-3_3_6\alter.c': No such file or directory
analyze.c
c1 : fatal error C1083: Cannot open source file: '..\..\sqlite-source-3_3_6\analyze.c': No such file or directory
attach.c
c1 : fatal error C1083: Cannot open source file: '..\..\sqlite-source-3_3_6\attach.c': No such file or directory
auth.c
c1 : fatal error C1083: Cannot open source file: '..\..\sqlite-source-3_3_6\auth.c': No such file or directory
btree.c
c1 : fatal error C1083: Cannot open source file: '..\..\sqlite-source-3_3_6\btree.c': No such file or directory
build.c
c1 : fatal error C1083: Cannot open source file: '..\..\sqlite-source-3_3_6\build.c': No such file or directory
callback.c
c1 : fatal error C1083: Cannot open source file: '..\..\sqlite-source-3_3_6\callback.c': No such file or directory
complete.c
c1 : fatal error C1083: Cannot open source file: '..\..\sqlite-source-3_3_6\complete.c': No such file or directory
date.c
c1 : fatal error C1083: Cannot open source file: '..\..\sqlite-source-3_3_6\date.c': No such file or directory
delete.c
c1 : fatal error C1083: Cannot open source file: '..\..\sqlite-source-3_3_6\delete.c': No such file or directory
expr.c
c1 : fatal error C1083: Cannot open source file: '..\..\sqlite-source-3_3_6\expr.c': No such file or directory
func.c
c1 : fatal error C1083: Cannot open source file: '..\..\sqlite-source-3_3_6\func.c': No such file or directory
hash.c
c1 : fatal error C1083: Cannot open source file: '..\..\sqlite-source-3_3_6\hash.c': No such file or directory
insert.c
c1 : fatal error C1083: Cannot open source file: '..\..\sqlite-source-3_3_6\insert.c': No such file or directory
legacy.c
c1 : fatal error C1083: Cannot open source file: '..\..\sqlite-source-3_3_6\legacy.c': No such file or directory
main.c
c1 : fatal error C1083: Cannot open source file: '..\..\sqlite-source-3_3_6\main.c': No such file or directory
opcodes.c
c1 : fatal error C1083: Cannot open source file: '..\..\sqlite-source-3_3_6\opcodes.c': No such file or directory
os.c
c1 : fatal error C1083: Cannot open source file: '..\..\sqlite-source-3_3_6\os.c': No such file or directory
os_unix.c
c1 : fatal error C1083: Cannot open source file: '..\..\sqlite-source-3_3_6\os_unix.c': No such file or directory
os_win.c
c1 : fatal error C1083: Cannot open source file: '..\..\sqlite-source-3_3_6\os_win.c': No such file or directory
Generating Code...
Compiling...
pager.c
c1 : fatal error C1083: Cannot open source file: '..\..\sqlite-source-3_3_6\pager.c': No such file or directory
parse.c
c1 : fatal error C1083: Cannot open source file: '..\..\sqlite-source-3_3_6\parse.c': No such file or directory
pragma.c
c1 : fatal error C1083: Cannot open source file: '..\..\sqlite-source-3_3_6\pragma.c': No such file or directory
prepare.c
c1 : fatal error C1083: Cannot open source file: '..\..\sqlite-source-3_3_6\prepare.c': No such file or directory
printf.c
c1 : fatal error C1083: Cannot open source file: '..\..\sqlite-source-3_3_6\printf.c': No such file or directory
random.c
c1 : fatal error C1083: Cannot open source file: '..\..\sqlite-source-3_3_6\random.c': No such file or directory
select.c
c1 : fatal error C1083: Cannot open source file: '..\..\sqlite-source-3_3_6\select.c': No such file or directory
shell.c
c1 : fatal error C1083: Cannot open source file: '..\..\sqlite-source-3_3_6\shell.c': No such file or directory
table.c
c1 : fatal error C1083: Cannot open source file: '..\..\sqlite-source-3_3_6\table.c': No such file or directory
tokenize.c
c1 : fatal error C1083: Cannot open source file: '..\..\sqlite-source-3_3_6\tokenize.c': No such file or directory
trigger.c
c1 : fatal error C1083: Cannot open source file: '..\..\sqlite-source-3_3_6\trigger.c': No such file or directory
update.c
c1 : fatal error C1083: Cannot open source file: '..\..\sqlite-source-3_3_6\update.c': No such file or directory
utf.c
c1 : fatal error C1083: Cannot open source file: '..\..\sqlite-source-3_3_6\utf.c': No such file or directory
util.c
c1 : fatal error C1083: Cannot open source file: '..\..\sqlite-source-3_3_6\util.c': No such file or directory
vacuum.c
c1 : fatal error C1083: Cannot open source file: '..\..\sqlite-source-3_3_6\vacuum.c': No such file or directory
vdbe.c
c1 : fatal error C1083: Cannot open source file: '..\..\sqlite-source-3_3_6\vdbe.c': No such file or directory
vdbeapi.c
c1 : fatal error C1083: Cannot open source file: '..\..\sqlite-source-3_3_6\vdbeapi.c': No such file or directory
vdbeaux.c
c1 : fatal error C1083: Cannot open source file: '..\..\sqlite-source-3_3_6\vdbeaux.c': No such file or directory
vdbefifo.c
c1 : fatal error C1083: Cannot open source file: '..\..\sqlite-source-3_3_6\vdbefifo.c': No such file or directory
vdbemem.c
c1 : fatal error C1083: Cannot open source file: '..\..\sqlite-source-3_3_6\vdbemem.c': No such file or directory
Generating Code...
Compiling...
where.c
c1 : fatal error C1083: Cannot open source file: '..\..\sqlite-source-3_3_6\where.c': No such file or directory
Generating Code...
Build log was saved at "file://c:\Documents and Settings\michael\Desktop\freeswitch\libs\win32\sqlite\Debug DLL\BuildLog.htm"
libsqlite - 41 error(s), 0 warning(s)
------ Build started: Project: libsrtp, Configuration: Debug Win32 ------
Creating config.h from config.hw
Compiling...
srtp.c
alloc.c
crypto_kernel.c
ctr_prng.c
err.c
key.c
prng.c
rand_source.c
aes.c
aes_cbc.c
aes_icm.c
cipher.c
null_cipher.c
auth.c
hmac.c
null_auth.c
sha1.c
rdb.c
rdbx.c
ut_sim.c
Generating Code...
Compiling...
datatypes.c
stat.c
Generating Code...
Creating library...
Build log was saved at "file://c:\Documents and Settings\michael\Desktop\freeswitch\libs\srtp\Debug\BuildLog.htm"
libsrtp - 0 error(s), 0 warning(s)
------ Build started: Project: osip2, Configuration: Debug Win32 ------
Compiling...
fsm_misc.c
c1 : fatal error C1083: Cannot open source file: '..\..\libosip2-2.2.2\src\osip2\fsm_misc.c': No such file or directory
ict.c
c1 : fatal error C1083: Cannot open source file: '..\..\libosip2-2.2.2\src\osip2\ict.c': No such file or directory
ict_fsm.c
c1 : fatal error C1083: Cannot open source file: '..\..\libosip2-2.2.2\src\osip2\ict_fsm.c': No such file or directory
ist.c
c1 : fatal error C1083: Cannot open source file: '..\..\libosip2-2.2.2\src\osip2\ist.c': No such file or directory
ist_fsm.c
c1 : fatal error C1083: Cannot open source file: '..\..\libosip2-2.2.2\src\osip2\ist_fsm.c': No such file or directory
nict.c
c1 : fatal error C1083: Cannot open source file: '..\..\libosip2-2.2.2\src\osip2\nict.c': No such file or directory
nict_fsm.c
c1 : fatal error C1083: Cannot open source file: '..\..\libosip2-2.2.2\src\osip2\nict_fsm.c': No such file or directory
nist.c
c1 : fatal error C1083: Cannot open source file: '..\..\libosip2-2.2.2\src\osip2\nist.c': No such file or directory
nist_fsm.c
c1 : fatal error C1083: Cannot open source file: '..\..\libosip2-2.2.2\src\osip2\nist_fsm.c': No such file or directory
osip.c
c1 : fatal error C1083: Cannot open source file: '..\..\libosip2-2.2.2\src\osip2\osip.c': No such file or directory
osip_dialog.c
c1 : fatal error C1083: Cannot open source file: '..\..\libosip2-2.2.2\src\osip2\osip_dialog.c': No such file or directory
osip_event.c
c1 : fatal error C1083: Cannot open source file: '..\..\libosip2-2.2.2\src\osip2\osip_event.c': No such file or directory
osip_negotiation.c
c1 : fatal error C1083: Cannot open source file: '..\..\libosip2-2.2.2\src\osip2\osip_negotiation.c': No such file or directory
osip_time.c
c1 : fatal error C1083: Cannot open source file: '..\..\libosip2-2.2.2\src\osip2\osip_time.c': No such file or directory
osip_transaction.c
c1 : fatal error C1083: Cannot open source file: '..\..\libosip2-2.2.2\src\osip2\osip_transaction.c': No such file or directory
port_condv.c
c1 : fatal error C1083: Cannot open source file: '..\..\libosip2-2.2.2\src\osip2\port_condv.c': No such file or directory
port_fifo.c
c1 : fatal error C1083: Cannot open source file: '..\..\libosip2-2.2.2\src\osip2\port_fifo.c': No such file or directory
port_sema.c
c1 : fatal error C1083: Cannot open source file: '..\..\libosip2-2.2.2\src\osip2\port_sema.c': No such file or directory
port_thread.c
c1 : fatal error C1083: Cannot open source file: '..\..\libosip2-2.2.2\src\osip2\port_thread.c': No such file or directory
Generating Code...
Build log was saved at "file://c:\Documents and Settings\michael\Desktop\freeswitch\libs\win32\exosip\Debug\BuildLog.htm"
osip2 - 19 error(s), 0 warning(s)
------ Build started: Project: Download SPEEX, Configuration: Debug Win32 ------
Downloading SPEEX.
Downloading: http://svn.freeswitch.org/downloads/libs/speex-1.1.11.1.tar.gz
Extracting: C:\Documents and Settings\michael\Desktop\freeswitch\libs\speex-1.1.11.1.tar.gz
c:\Documents and Settings\michael\Desktop\freeswitch\libs\win32\util.vbs(99, 2) WshShell.Exec: C:\Documents and Settings\michael\Desktop\freeswitch\libs\win32\tmp5857.bat is not a valid Win32 application.
Build log was saved at "file://c:\Documents and Settings\michael\Desktop\freeswitch\libs\win32\Debug\BuildLog Download SPEEX.htm"
Download SPEEX - 0 error(s), 0 warning(s)
------ Build started: Project: fdlibm, Configuration: Debug Win32 ------
Compiling...
w_sqrt.c
c1 : fatal error C1083: Cannot open source file: '..\..\js20051231\src\fdlibm\w_sqrt.c': No such file or directory
w_pow.c
c1 : fatal error C1083: Cannot open source file: '..\..\js20051231\src\fdlibm\w_pow.c': No such file or directory
w_atan2.c
c1 : fatal error C1083: Cannot open source file: '..\..\js20051231\src\fdlibm\w_atan2.c': No such file or directory
s_scalbn.c
c1 : fatal error C1083: Cannot open source file: '..\..\js20051231\src\fdlibm\s_scalbn.c': No such file or directory
s_rint.c
c1 : fatal error C1083: Cannot open source file: '..\..\js20051231\src\fdlibm\s_rint.c': No such file or directory
s_matherr.c
c1 : fatal error C1083: Cannot open source file: '..\..\js20051231\src\fdlibm\s_matherr.c': No such file or directory
s_isnan.c
c1 : fatal error C1083: Cannot open source file: '..\..\js20051231\src\fdlibm\s_isnan.c': No such file or directory
s_finite.c
c1 : fatal error C1083: Cannot open source file: '..\..\js20051231\src\fdlibm\s_finite.c': No such file or directory
s_fabs.c
c1 : fatal error C1083: Cannot open source file: '..\..\js20051231\src\fdlibm\s_fabs.c': No such file or directory
s_copysign.c
c1 : fatal error C1083: Cannot open source file: '..\..\js20051231\src\fdlibm\s_copysign.c': No such file or directory
s_atan.c
c1 : fatal error C1083: Cannot open source file: '..\..\js20051231\src\fdlibm\s_atan.c': No such file or directory
k_standard.c
c1 : fatal error C1083: Cannot open source file: '..\..\js20051231\src\fdlibm\k_standard.c': No such file or directory
e_sqrt.c
c1 : fatal error C1083: Cannot open source file: '..\..\js20051231\src\fdlibm\e_sqrt.c': No such file or directory
e_pow.c
c1 : fatal error C1083: Cannot open source file: '..\..\js20051231\src\fdlibm\e_pow.c': No such file or directory
e_atan2.c
c1 : fatal error C1083: Cannot open source file: '..\..\js20051231\src\fdlibm\e_atan2.c': No such file or directory
Generating Code...
Build log was saved at "file://c:\Documents and Settings\michael\Desktop\freeswitch\libs\win32\js\Debug\BuildLog.htm"
fdlibm - 15 error(s), 0 warning(s)
------ Build started: Project: libpcre, Configuration: Debug DLL Win32 ------
Compiling...
pcre_chartables.c
c1 : fatal error C1083: Cannot open source file: '.\pcre_chartables.c': No such file or directory
pcre_compile.c
c1 : fatal error C1083: Cannot open source file: '..\..\pcre-6.4\pcre_compile.c': No such file or directory
Generating Code...
Build log was saved at "file://c:\Documents and Settings\michael\Desktop\freeswitch\libs\win32\pcre\Debug DLL\BuildLog.htm"
libpcre - 2 error(s), 0 warning(s)
------ Build started: Project: Download PORTAUDIO, Configuration: Debug Win32 ------
Downloading PORTAUDIO.
Downloading: http://svn.freeswitch.org/downloads/libs/portaudio_v18_1.zip
Extracting: C:\Documents and Settings\michael\Desktop\freeswitch\libs\portaudio_v18_1.zip
c:\Documents and Settings\michael\Desktop\freeswitch\libs\win32\util.vbs(99, 2) WshShell.Exec: C:\Documents and Settings\michael\Desktop\freeswitch\libs\win32\tmp5204.bat is not a valid Win32 application.
Build log was saved at "file://c:\Documents and Settings\michael\Desktop\freeswitch\libs\win32\Debug\BuildLog Download PORTAUDIO.htm"
Download PORTAUDIO - 0 error(s), 0 warning(s)
------ Build started: Project: iksemel, Configuration: Debug Win32 ------
Compiling...
base64.c
c1 : fatal error C1083: Cannot open source file: '..\..\iksemel-1.2\src\base64.c': No such file or directory
dom.c
c1 : fatal error C1083: Cannot open source file: '..\..\iksemel-1.2\src\dom.c': No such file or directory
filter.c
c1 : fatal error C1083: Cannot open source file: '..\..\iksemel-1.2\src\filter.c': No such file or directory
iks.c
c1 : fatal error C1083: Cannot open source file: '..\..\iksemel-1.2\src\iks.c': No such file or directory
ikstack.c
c1 : fatal error C1083: Cannot open source file: '..\..\iksemel-1.2\src\ikstack.c': No such file or directory
io-posix.c
c1 : fatal error C1083: Cannot open source file: '..\..\iksemel-1.2\src\io-posix.c': No such file or directory
jabber.c
c1 : fatal error C1083: Cannot open source file: '..\..\iksemel-1.2\src\jabber.c': No such file or directory
md5.c
c1 : fatal error C1083: Cannot open source file: '..\..\iksemel-1.2\src\md5.c': No such file or directory
sax.c
c1 : fatal error C1083: Cannot open source file: '..\..\iksemel-1.2\src\sax.c': No such file or directory
sha.c
c1 : fatal error C1083: Cannot open source file: '..\..\iksemel-1.2\src\sha.c': No such file or directory
stream.c
c1 : fatal error C1083: Cannot open source file: '..\..\iksemel-1.2\src\stream.c': No such file or directory
utility.c
c1 : fatal error C1083: Cannot open source file: '..\..\iksemel-1.2\src\utility.c': No such file or directory
Generating Code...
Build log was saved at "file://c:\Documents and Settings\michael\Desktop\freeswitch\libs\win32\iksemel\Debug\BuildLog.htm"
iksemel - 12 error(s), 0 warning(s)
------ Build started: Project: PAStaticWMME, Configuration: Debug Win32 ------
Compiling...
pa_lib.c
c1 : fatal error C1083: Cannot open source file: '..\..\portaudio_v18_1\pa_common\pa_lib.c': No such file or directory
pa_win_wmme.c
c1 : fatal error C1083: Cannot open source file: '..\..\portaudio_v18_1\pa_win_wmme\pa_win_wmme.c': No such file or directory
Generating Code...
Build log was saved at "file://c:\Documents and Settings\michael\Desktop\freeswitch\libs\win32\portaudio\Debug\BuildLog.htm"
PAStaticWMME - 2 error(s), 0 warning(s)
------ Build started: Project: libspeex, Configuration: Debug Win32 ------
Compiling...
vq.c
c1 : fatal error C1083: Cannot open source file: '..\..\speex-1.1.11.1\libspeex\vq.c': No such file or directory
vbr.c
c1 : fatal error C1083: Cannot open source file: '..\..\speex-1.1.11.1\libspeex\vbr.c': No such file or directory
stereo.c
c1 : fatal error C1083: Cannot open source file: '..\..\speex-1.1.11.1\libspeex\stereo.c': No such file or directory
speex_header.c
c1 : fatal error C1083: Cannot open source file: '..\..\speex-1.1.11.1\libspeex\speex_header.c': No such file or directory
speex_callbacks.c
c1 : fatal error C1083: Cannot open source file: '..\..\speex-1.1.11.1\libspeex\speex_callbacks.c': No such file or directory
speex.c
c1 : fatal error C1083: Cannot open source file: '..\..\speex-1.1.11.1\libspeex\speex.c': No such file or directory
smallft.c
c1 : fatal error C1083: Cannot open source file: '..\..\speex-1.1.11.1\libspeex\smallft.c': No such file or directory
sb_celp.c
c1 : fatal error C1083: Cannot open source file: '..\..\speex-1.1.11.1\libspeex\sb_celp.c': No such file or directory
quant_lsp.c
c1 : fatal error C1083: Cannot open source file: '..\..\speex-1.1.11.1\libspeex\quant_lsp.c': No such file or directory
preprocess.c
c1 : fatal error C1083: Cannot open source file: '..\..\speex-1.1.11.1\libspeex\preprocess.c': No such file or directory
nb_celp.c
c1 : fatal error C1083: Cannot open source file: '..\..\speex-1.1.11.1\libspeex\nb_celp.c': No such file or directory
modes.c
c1 : fatal error C1083: Cannot open source file: '..\..\speex-1.1.11.1\libspeex\modes.c': No such file or directory
misc.c
c1 : fatal error C1083: Cannot open source file: '..\..\speex-1.1.11.1\libspeex\misc.c': No such file or directory
math_approx.c
c1 : fatal error C1083: Cannot open source file: '..\..\speex-1.1.11.1\libspeex\math_approx.c': No such file or directory
ltp.c
c1 : fatal error C1083: Cannot open source file: '..\..\speex-1.1.11.1\libspeex\ltp.c': No such file or directory
lsp_tables_nb.c
c1 : fatal error C1083: Cannot open source file: '..\..\speex-1.1.11.1\libspeex\lsp_tables_nb.c': No such file or directory
lsp.c
c1 : fatal error C1083: Cannot open source file: '..\..\speex-1.1.11.1\libspeex\lsp.c': No such file or directory
lpc.c
c1 : fatal error C1083: Cannot open source file: '..\..\speex-1.1.11.1\libspeex\lpc.c': No such file or directory
high_lsp_tables.c
c1 : fatal error C1083: Cannot open source file: '..\..\speex-1.1.11.1\libspeex\high_lsp_tables.c': No such file or directory
hexc_table.c
c1 : fatal error C1083: Cannot open source file: '..\..\speex-1.1.11.1\libspeex\hexc_table.c': No such file or directory
Generating Code...
Compiling...
hexc_10_32_table.c
c1 : fatal error C1083: Cannot open source file: '..\..\speex-1.1.11.1\libspeex\hexc_10_32_table.c': No such file or directory
gain_table_lbr.c
c1 : fatal error C1083: Cannot open source file: '..\..\speex-1.1.11.1\libspeex\gain_table_lbr.c': No such file or directory
gain_table.c
c1 : fatal error C1083: Cannot open source file: '..\..\speex-1.1.11.1\libspeex\gain_table.c': No such file or directory
filters.c
c1 : fatal error C1083: Cannot open source file: '..\..\speex-1.1.11.1\libspeex\filters.c': No such file or directory
exc_8_128_table.c
c1 : fatal error C1083: Cannot open source file: '..\..\speex-1.1.11.1\libspeex\exc_8_128_table.c': No such file or directory
exc_5_64_table.c
c1 : fatal error C1083: Cannot open source file: '..\..\speex-1.1.11.1\libspeex\exc_5_64_table.c': No such file or directory
exc_5_256_table.c
c1 : fatal error C1083: Cannot open source file: '..\..\speex-1.1.11.1\libspeex\exc_5_256_table.c': No such file or directory
exc_20_32_table.c
c1 : fatal error C1083: Cannot open source file: '..\..\speex-1.1.11.1\libspeex\exc_20_32_table.c': No such file or directory
exc_10_32_table.c
c1 : fatal error C1083: Cannot open source file: '..\..\speex-1.1.11.1\libspeex\exc_10_32_table.c': No such file or directory
exc_10_16_table.c
c1 : fatal error C1083: Cannot open source file: '..\..\speex-1.1.11.1\libspeex\exc_10_16_table.c': No such file or directory
cb_search.c
c1 : fatal error C1083: Cannot open source file: '..\..\speex-1.1.11.1\libspeex\cb_search.c': No such file or directory
bits.c
c1 : fatal error C1083: Cannot open source file: '..\..\speex-1.1.11.1\libspeex\bits.c': No such file or directory
Generating Code...
Build log was saved at "file://c:\Documents and Settings\michael\Desktop\freeswitch\libs\win32\speex\Debug\BuildLog.htm"
libspeex - 32 error(s), 0 warning(s)
------ Build started: Project: eXosip, Configuration: Debug Win32 ------
Compiling...
udp.c
c1 : fatal error C1083: Cannot open source file: '..\..\libexosip2-2.2.2\src\udp.c': No such file or directory
sdp_offans.c
c1 : fatal error C1083: Cannot open source file: '..\..\libexosip2-2.2.2\src\sdp_offans.c': No such file or directory
misc.c
c1 : fatal error C1083: Cannot open source file: '..\..\libexosip2-2.2.2\src\misc.c': No such file or directory
jsubscribe.c
c1 : fatal error C1083: Cannot open source file: '..\..\libexosip2-2.2.2\src\jsubscribe.c': No such file or directory
jresponse.c
c1 : fatal error C1083: Cannot open source file: '..\..\libexosip2-2.2.2\src\jresponse.c': No such file or directory
jrequest.c
c1 : fatal error C1083: Cannot open source file: '..\..\libexosip2-2.2.2\src\jrequest.c': No such file or directory
jreg.c
c1 : fatal error C1083: Cannot open source file: '..\..\libexosip2-2.2.2\src\jreg.c': No such file or directory
jpublish.c
c1 : fatal error C1083: Cannot open source file: '..\..\libexosip2-2.2.2\src\jpublish.c': No such file or directory
jpipe.c
c1 : fatal error C1083: Cannot open source file: '..\..\libexosip2-2.2.2\src\jpipe.c': No such file or directory
jnotify.c
c1 : fatal error C1083: Cannot open source file: '..\..\libexosip2-2.2.2\src\jnotify.c': No such file or directory
jevents.c
c1 : fatal error C1083: Cannot open source file: '..\..\libexosip2-2.2.2\src\jevents.c': No such file or directory
jdialog.c
c1 : fatal error C1083: Cannot open source file: '..\..\libexosip2-2.2.2\src\jdialog.c': No such file or directory
jcallback.c
c1 : fatal error C1083: Cannot open source file: '..\..\libexosip2-2.2.2\src\jcallback.c': No such file or directory
jcall.c
c1 : fatal error C1083: Cannot open source file: '..\..\libexosip2-2.2.2\src\jcall.c': No such file or directory
jauth.c
c1 : fatal error C1083: Cannot open source file: '..\..\libexosip2-2.2.2\src\jauth.c': No such file or directory
inet_ntop.c
c1 : fatal error C1083: Cannot open source file: '..\..\libexosip2-2.2.2\src\inet_ntop.c': No such file or directory
eXutils.c
c1 : fatal error C1083: Cannot open source file: '..\..\libexosip2-2.2.2\src\eXutils.c': No such file or directory
eXtransport.c
c1 : fatal error C1083: Cannot open source file: '..\..\libexosip2-2.2.2\src\eXtransport.c': No such file or directory
eXsubscription_api.c
c1 : fatal error C1083: Cannot open source file: '..\..\libexosip2-2.2.2\src\eXsubscription_api.c': No such file or directory
eXregister_api.c
c1 : fatal error C1083: Cannot open source file: '..\..\libexosip2-2.2.2\src\eXregister_api.c': No such file or directory
Generating Code...
Compiling...
eXrefer_api.c
c1 : fatal error C1083: Cannot open source file: '..\..\libexosip2-2.2.2\src\eXrefer_api.c': No such file or directory
eXpublish_api.c
c1 : fatal error C1083: Cannot open source file: '..\..\libexosip2-2.2.2\src\eXpublish_api.c': No such file or directory
eXosip.c
c1 : fatal error C1083: Cannot open source file: '..\..\libexosip2-2.2.2\src\eXosip.c': No such file or directory
eXoptions_api.c
c1 : fatal error C1083: Cannot open source file: '..\..\libexosip2-2.2.2\src\eXoptions_api.c': No such file or directory
eXmessage_api.c
c1 : fatal error C1083: Cannot open source file: '..\..\libexosip2-2.2.2\src\eXmessage_api.c': No such file or directory
eXinsubscription_api.c
c1 : fatal error C1083: Cannot open source file: '..\..\libexosip2-2.2.2\src\eXinsubscription_api.c': No such file or directory
eXconf.c
c1 : fatal error C1083: Cannot open source file: '..\..\libexosip2-2.2.2\src\eXconf.c': No such file or directory
eXcall_api.c
c1 : fatal error C1083: Cannot open source file: '..\..\libexosip2-2.2.2\src\eXcall_api.c': No such file or directory
Generating Code...
Creating browse information file...
Microsoft Browse Information Maintenance Utility Version 8.00.50727
Copyright (C) Microsoft Corporation. All rights reserved.
BSCMAKE: error BK1506 : cannot open file '.\debug\eXcall_api.sbr': No such file or directory
Build log was saved at "file://c:\Documents and Settings\michael\Desktop\freeswitch\libs\win32\exosip\Debug\BuildLog.htm"
eXosip - 29 error(s), 0 warning(s)
------ Build started: Project: xml, Configuration: Debug Win32 ------
Creating config.h from winconfig.h
Creating expat.h from expat.h.in
Compiling...
xmltok.c
c1 : fatal error C1083: Cannot open source file: '..\..\apr-util-1.2.7\xml\expat\lib\xmltok.c': No such file or directory
xmlrole.c
c1 : fatal error C1083: Cannot open source file: '..\..\apr-util-1.2.7\xml\expat\lib\xmlrole.c': No such file or directory
xmlparse.c
c1 : fatal error C1083: Cannot open source file: '..\..\apr-util-1.2.7\xml\expat\lib\xmlparse.c': No such file or directory
Generating Code...
Build log was saved at "file://c:\Documents and Settings\michael\Desktop\freeswitch\libs\win32\apr-util\Debug\BuildLog.htm"
xml - 3 error(s), 0 warning(s)
------ Build started: Project: libdingaling, Configuration: Debug Win32 ------
Compiling...
libdingaling.c
.\src\libdingaling.c(37) : fatal error C1083: Cannot open include file: 'iksemel.h': No such file or directory
Build log was saved at "file://c:\Documents and Settings\michael\Desktop\freeswitch\libs\libdingaling\Debug\BuildLog.htm"
libdingaling - 1 error(s), 0 warning(s)
------ Build started: Project: libiax2, Configuration: Debug Win32 ------
Compiling...
iax.c
iax2-parser.c
jitterbuf.c
md5.c
Generating Code...
Creating library...
Build log was saved at "file://c:\Documents and Settings\michael\Desktop\freeswitch\libs\iax\Debug\BuildLog.htm"
libiax2 - 0 error(s), 0 warning(s)
------ Build started: Project: pthread, Configuration: Debug Win32 ------
Compiling...
pthread.c
c1 : fatal error C1083: Cannot open source file: '..\..\pthreads-w32-2-7-0-release\pthread.c': No such file or directory
Build log was saved at "file://c:\Documents and Settings\michael\Desktop\freeswitch\libs\win32\pthread\Debug\BuildLog.htm"
pthread - 1 error(s), 0 warning(s)
------ Build started: Project: libilbc, Configuration: Debug Win32 ------
Compiling...
anaFilter.c
constants.c
createCB.c
doCPLC.c
enhancer.c
filter.c
FrameClassify.c
gainquant.c
getCBvec.c
helpfun.c
hpInput.c
hpOutput.c
iCBConstruct.c
iCBSearch.c
iLBC_decode.c
iLBC_encode.c
LPCdecode.c
LPCencode.c
lsf.c
packing.c
Generating Code...
Compiling...
StateConstructW.c
StateSearchW.c
syntFilter.c
Generating Code...
Creating library...
Build log was saved at "file://c:\Documents and Settings\michael\Desktop\freeswitch\libs\codec\ilbc\Debug\BuildLog.htm"
libilbc - 0 error(s), 0 warning(s)
------ Build started: Project: FreeSwitchCoreLib, Configuration: Debug Win32 ------
Generating switch_version.h
Downloading: http://svn.freeswitch.org/downloads/win32/svnversion.exe
c:\Documents and Settings\michael\Desktop\freeswitch\libs\win32\util.vbs(224, 2) WshShell.Exec: C:\Documents and Settings\michael\Desktop\freeswitch\w32\Library\tmpVersion.Bat is not a valid Win32 application.
Compiling...
switch_buffer.c
c:\Documents and Settings\michael\Desktop\freeswitch\src\include\switch_apr.h(42) : fatal error C1083: Cannot open include file: 'apr.h': No such file or directory
Build log was saved at "file://c:\Documents and Settings\michael\Desktop\freeswitch\w32\Library\Debug\BuildLog FreeSwitchCoreLib.htm"
FreeSwitchCoreLib - 1 error(s), 0 warning(s)
------ Build started: Project: Abyss, Configuration: Debug Win32 ------
Compiling...
conf.c
c1 : fatal error C1083: Cannot open source file: '..\..\xmlrpc-c-1.03.14\lib\abyss\src\conf.c': No such file or directory
conn.c
c1 : fatal error C1083: Cannot open source file: '..\..\xmlrpc-c-1.03.14\lib\abyss\src\conn.c': No such file or directory
data.c
c1 : fatal error C1083: Cannot open source file: '..\..\xmlrpc-c-1.03.14\lib\abyss\src\data.c': No such file or directory
file.c
c1 : fatal error C1083: Cannot open source file: '..\..\xmlrpc-c-1.03.14\lib\abyss\src\file.c': No such file or directory
http.c
c1 : fatal error C1083: Cannot open source file: '..\..\xmlrpc-c-1.03.14\lib\abyss\src\http.c': No such file or directory
server.c
c1 : fatal error C1083: Cannot open source file: '..\..\xmlrpc-c-1.03.14\lib\abyss\src\server.c': No such file or directory
socket.c
c1 : fatal error C1083: Cannot open source file: '..\..\xmlrpc-c-1.03.14\lib\abyss\src\socket.c': No such file or directory
thread.c
c1 : fatal error C1083: Cannot open source file: '..\..\xmlrpc-c-1.03.14\lib\abyss\src\thread.c': No such file or directory
token.c
c1 : fatal error C1083: Cannot open source file: '..\..\xmlrpc-c-1.03.14\lib\abyss\src\token.c': No such file or directory
Generating Code...
Build log was saved at "file://c:\Documents and Settings\michael\Desktop\freeswitch\libs\win32\xmlrpc\Debug\BuildLog.htm"
Abyss - 9 error(s), 0 warning(s)
------ Build started: Project: mDNSResponder static library, Configuration: Debug Win32 ------
Compiling...
DNSServices.c
c1 : fatal error C1083: Cannot open source file: '..\..\howl-1.0.0\src\lib\mdnsresponder\DNSServices.c': No such file or directory
mDNS.c
c1 : fatal error C1083: Cannot open source file: '..\..\howl-1.0.0\src\lib\mdnsresponder\mDNS.c': No such file or directory
mDNSPlatform.c
c1 : fatal error C1083: Cannot open source file: '..\..\howl-1.0.0\src\lib\mdnsresponder\mDNSPlatform.c': No such file or directory
mDNSServant.c
c1 : fatal error C1083: Cannot open source file: '..\..\howl-1.0.0\src\lib\mdnsresponder\mDNSServant.c': No such file or directory
win32_mdns.c
c1 : fatal error C1083: Cannot open source file: '..\..\howl-1.0.0\src\lib\mdnsresponder\win32\win32_mdns.c': No such file or directory
Generating Code...
Build log was saved at "file://c:\Documents and Settings\michael\Desktop\freeswitch\libs\win32\howl\Debug Static\BuildLog.htm"
mDNSResponder static library - 5 error(s), 0 warning(s)
------ Build started: Project: Download SOFIA, Configuration: Debug Win32 ------
Downloading SOFIA.
Downloading: http://svn.freeswitch.org/downloads/libs/sofia-sip.tar.gz
Extracting: C:\Documents and Settings\michael\Desktop\freeswitch\libs\sofia-sip.tar.gz
c:\Documents and Settings\michael\Desktop\freeswitch\libs\win32\util.vbs(99, 2) WshShell.Exec: C:\Documents and Settings\michael\Desktop\freeswitch\libs\win32\tmp1694.bat is not a valid Win32 application.
Build log was saved at "file://c:\Documents and Settings\michael\Desktop\freeswitch\libs\win32\Debug\BuildLog Download SOFIA.htm"
Download SOFIA - 0 error(s), 0 warning(s)
------ Build started: Project: libgsm, Configuration: Debug Win32 ------
Compiling...
add.c
code.c
decode.c
gsm_create.c
gsm_decode.c
gsm_destroy.c
gsm_encode.c
gsm_lpc.c
gsm_option.c
long_term.c
preprocess.c
rpe.c
short_term.c
table.c
Generating Code...
Creating library...
Build log was saved at "file://c:\Documents and Settings\michael\Desktop\freeswitch\libs\codec\gsm\Debug\BuildLog.htm"
libgsm - 0 error(s), 0 warning(s)
------ Build started: Project: libsndfile, Configuration: Debug Win32 ------
Compiling...
aiff.c
c1 : fatal error C1083: Cannot open source file: '..\..\libsndfile-1.0.16\src\aiff.c': No such file or directory
alaw.c
c1 : fatal error C1083: Cannot open source file: '..\..\libsndfile-1.0.16\src\alaw.c': No such file or directory
au.c
c1 : fatal error C1083: Cannot open source file: '..\..\libsndfile-1.0.16\src\au.c': No such file or directory
avr.c
c1 : fatal error C1083: Cannot open source file: '..\..\libsndfile-1.0.16\src\avr.c': No such file or directory
broadcast.c
c1 : fatal error C1083: Cannot open source file: '..\..\libsndfile-1.0.16\src\broadcast.c': No such file or directory
caf.c
c1 : fatal error C1083: Cannot open source file: '..\..\libsndfile-1.0.16\src\caf.c': No such file or directory
command.c
c1 : fatal error C1083: Cannot open source file: '..\..\libsndfile-1.0.16\src\command.c': No such file or directory
common.c
.\common.c(26) : fatal error C1083: Cannot open include file: 'sfendian.h': No such file or directory
dither.c
c1 : fatal error C1083: Cannot open source file: '..\..\libsndfile-1.0.16\src\dither.c': No such file or directory
double64.c
c1 : fatal error C1083: Cannot open source file: '..\..\libsndfile-1.0.16\src\double64.c': No such file or directory
dwd.c
c1 : fatal error C1083: Cannot open source file: '..\..\libsndfile-1.0.16\src\dwd.c': No such file or directory
dwvw.c
c1 : fatal error C1083: Cannot open source file: '..\..\libsndfile-1.0.16\src\dwvw.c': No such file or directory
file_io.c
c1 : fatal error C1083: Cannot open source file: '..\..\libsndfile-1.0.16\src\file_io.c': No such file or directory
flac.c
c1 : fatal error C1083: Cannot open source file: '..\..\libsndfile-1.0.16\src\flac.c': No such file or directory
float32.c
c1 : fatal error C1083: Cannot open source file: '..\..\libsndfile-1.0.16\src\float32.c': No such file or directory
gsm610.c
c1 : fatal error C1083: Cannot open source file: '..\..\libsndfile-1.0.16\src\gsm610.c': No such file or directory
htk.c
c1 : fatal error C1083: Cannot open source file: '..\..\libsndfile-1.0.16\src\htk.c': No such file or directory
ima_adpcm.c
c1 : fatal error C1083: Cannot open source file: '..\..\libsndfile-1.0.16\src\ima_adpcm.c': No such file or directory
ircam.c
c1 : fatal error C1083: Cannot open source file: '..\..\libsndfile-1.0.16\src\ircam.c': No such file or directory
mat4.c
c1 : fatal error C1083: Cannot open source file: '..\..\libsndfile-1.0.16\src\mat4.c': No such file or directory
Generating Code...
Compiling...
mat5.c
c1 : fatal error C1083: Cannot open source file: '..\..\libsndfile-1.0.16\src\mat5.c': No such file or directory
ms_adpcm.c
c1 : fatal error C1083: Cannot open source file: '..\..\libsndfile-1.0.16\src\ms_adpcm.c': No such file or directory
nist.c
c1 : fatal error C1083: Cannot open source file: '..\..\libsndfile-1.0.16\src\nist.c': No such file or directory
ogg.c
c1 : fatal error C1083: Cannot open source file: '..\..\libsndfile-1.0.16\src\ogg.c': No such file or directory
paf.c
c1 : fatal error C1083: Cannot open source file: '..\..\libsndfile-1.0.16\src\paf.c': No such file or directory
pcm.c
c1 : fatal error C1083: Cannot open source file: '..\..\libsndfile-1.0.16\src\pcm.c': No such file or directory
pvf.c
c1 : fatal error C1083: Cannot open source file: '..\..\libsndfile-1.0.16\src\pvf.c': No such file or directory
raw.c
c1 : fatal error C1083: Cannot open source file: '..\..\libsndfile-1.0.16\src\raw.c': No such file or directory
rx2.c
c1 : fatal error C1083: Cannot open source file: '..\..\libsndfile-1.0.16\src\rx2.c': No such file or directory
sd2.c
c1 : fatal error C1083: Cannot open source file: '..\..\libsndfile-1.0.16\src\sd2.c': No such file or directory
sds.c
c1 : fatal error C1083: Cannot open source file: '..\..\libsndfile-1.0.16\src\sds.c': No such file or directory
sndfile.c
c1 : fatal error C1083: Cannot open source file: '..\..\libsndfile-1.0.16\src\sndfile.c': No such file or directory
strings.c
c1 : fatal error C1083: Cannot open source file: '..\..\libsndfile-1.0.16\src\strings.c': No such file or directory
svx.c
c1 : fatal error C1083: Cannot open source file: '..\..\libsndfile-1.0.16\src\svx.c': No such file or directory
txw.c
c1 : fatal error C1083: Cannot open source file: '..\..\libsndfile-1.0.16\src\txw.c': No such file or directory
ulaw.c
c1 : fatal error C1083: Cannot open source file: '..\..\libsndfile-1.0.16\src\ulaw.c': No such file or directory
voc.c
c1 : fatal error C1083: Cannot open source file: '..\..\libsndfile-1.0.16\src\voc.c': No such file or directory
vox_adpcm.c
c1 : fatal error C1083: Cannot open source file: '..\..\libsndfile-1.0.16\src\vox_adpcm.c': No such file or directory
w64.c
c1 : fatal error C1083: Cannot open source file: '..\..\libsndfile-1.0.16\src\w64.c': No such file or directory
wav.c
c1 : fatal error C1083: Cannot open source file: '..\..\libsndfile-1.0.16\src\wav.c': No such file or directory
Generating Code...
Compiling...
wav_w64.c
c1 : fatal error C1083: Cannot open source file: '..\..\libsndfile-1.0.16\src\wav_w64.c': No such file or directory
wve.c
c1 : fatal error C1083: Cannot open source file: '..\..\libsndfile-1.0.16\src\wve.c': No such file or directory
xi.c
c1 : fatal error C1083: Cannot open source file: '..\..\libsndfile-1.0.16\src\xi.c': No such file or directory
add.c
c1 : fatal error C1083: Cannot open source file: '..\..\libsndfile-1.0.16\src\gsm610\add.c': No such file or directory
code.c
c1 : fatal error C1083: Cannot open source file: '..\..\libsndfile-1.0.16\src\gsm610\code.c': No such file or directory
decode.c
c1 : fatal error C1083: Cannot open source file: '..\..\libsndfile-1.0.16\src\gsm610\decode.c': No such file or directory
gsm_create.c
c1 : fatal error C1083: Cannot open source file: '..\..\libsndfile-1.0.16\src\gsm610\gsm_create.c': No such file or directory
gsm_decode.c
c1 : fatal error C1083: Cannot open source file: '..\..\libsndfile-1.0.16\src\gsm610\gsm_decode.c': No such file or directory
gsm_destroy.c
c1 : fatal error C1083: Cannot open source file: '..\..\libsndfile-1.0.16\src\gsm610\gsm_destroy.c': No such file or directory
gsm_encode.c
c1 : fatal error C1083: Cannot open source file: '..\..\libsndfile-1.0.16\src\gsm610\gsm_encode.c': No such file or directory
gsm_option.c
c1 : fatal error C1083: Cannot open source file: '..\..\libsndfile-1.0.16\src\gsm610\gsm_option.c': No such file or directory
long_term.c
c1 : fatal error C1083: Cannot open source file: '..\..\libsndfile-1.0.16\src\gsm610\long_term.c': No such file or directory
lpc.c
c1 : fatal error C1083: Cannot open source file: '..\..\libsndfile-1.0.16\src\gsm610\lpc.c': No such file or directory
preprocess.c
c1 : fatal error C1083: Cannot open source file: '..\..\libsndfile-1.0.16\src\gsm610\preprocess.c': No such file or directory
rpe.c
c1 : fatal error C1083: Cannot open source file: '..\..\libsndfile-1.0.16\src\gsm610\rpe.c': No such file or directory
short_term.c
c1 : fatal error C1083: Cannot open source file: '..\..\libsndfile-1.0.16\src\gsm610\short_term.c': No such file or directory
table.c
c1 : fatal error C1083: Cannot open source file: '..\..\libsndfile-1.0.16\src\gsm610\table.c': No such file or directory
g721.c
c1 : fatal error C1083: Cannot open source file: '..\..\libsndfile-1.0.16\src\g72x\g721.c': No such file or directory
g723_16.c
c1 : fatal error C1083: Cannot open source file: '..\..\libsndfile-1.0.16\src\g72x\g723_16.c': No such file or directory
g723_24.c
c1 : fatal error C1083: Cannot open source file: '..\..\libsndfile-1.0.16\src\g72x\g723_24.c': No such file or directory
Generating Code...
Compiling...
g723_40.c
c1 : fatal error C1083: Cannot open source file: '..\..\libsndfile-1.0.16\src\g72x\g723_40.c': No such file or directory
g72x.c
c1 : fatal error C1083: Cannot open source file: '..\..\libsndfile-1.0.16\src\g72x\g72x.c': No such file or directory
Generating Code...
Build log was saved at "file://c:\Documents and Settings\michael\Desktop\freeswitch\libs\win32\libsndfile\Debug\BuildLog.htm"
libsndfile - 62 error(s), 0 warning(s)
------ Build started: Project: curllib, Configuration: Debug Win32 ------
Compiling...
base64.c
c1 : fatal error C1083: Cannot open source file: '..\..\curl-7.15.2\lib\base64.c': No such file or directory
connect.c
c1 : fatal error C1083: Cannot open source file: '..\..\curl-7.15.2\lib\connect.c': No such file or directory
content_encoding.c
c1 : fatal error C1083: Cannot open source file: '..\..\curl-7.15.2\lib\content_encoding.c': No such file or directory
cookie.c
c1 : fatal error C1083: Cannot open source file: '..\..\curl-7.15.2\lib\cookie.c': No such file or directory
dict.c
c1 : fatal error C1083: Cannot open source file: '..\..\curl-7.15.2\lib\dict.c': No such file or directory
easy.c
c1 : fatal error C1083: Cannot open source file: '..\..\curl-7.15.2\lib\easy.c': No such file or directory
escape.c
c1 : fatal error C1083: Cannot open source file: '..\..\curl-7.15.2\lib\escape.c': No such file or directory
file.c
c1 : fatal error C1083: Cannot open source file: '..\..\curl-7.15.2\lib\file.c': No such file or directory
formdata.c
c1 : fatal error C1083: Cannot open source file: '..\..\curl-7.15.2\lib\formdata.c': No such file or directory
ftp.c
c1 : fatal error C1083: Cannot open source file: '..\..\curl-7.15.2\lib\ftp.c': No such file or directory
getenv.c
c1 : fatal error C1083: Cannot open source file: '..\..\curl-7.15.2\lib\getenv.c': No such file or directory
getinfo.c
c1 : fatal error C1083: Cannot open source file: '..\..\curl-7.15.2\lib\getinfo.c': No such file or directory
gtls.c
c1 : fatal error C1083: Cannot open source file: '..\..\curl-7.15.2\lib\gtls.c': No such file or directory
hash.c
c1 : fatal error C1083: Cannot open source file: '..\..\curl-7.15.2\lib\hash.c': No such file or directory
hostares.c
c1 : fatal error C1083: Cannot open source file: '..\..\curl-7.15.2\lib\hostares.c': No such file or directory
hostasyn.c
c1 : fatal error C1083: Cannot open source file: '..\..\curl-7.15.2\lib\hostasyn.c': No such file or directory
hostip.c
c1 : fatal error C1083: Cannot open source file: '..\..\curl-7.15.2\lib\hostip.c': No such file or directory
hostip4.c
c1 : fatal error C1083: Cannot open source file: '..\..\curl-7.15.2\lib\hostip4.c': No such file or directory
hostip6.c
c1 : fatal error C1083: Cannot open source file: '..\..\curl-7.15.2\lib\hostip6.c': No such file or directory
hostsyn.c
c1 : fatal error C1083: Cannot open source file: '..\..\curl-7.15.2\lib\hostsyn.c': No such file or directory
Generating Code...
Compiling...
hostthre.c
c1 : fatal error C1083: Cannot open source file: '..\..\curl-7.15.2\lib\hostthre.c': No such file or directory
http.c
c1 : fatal error C1083: Cannot open source file: '..\..\curl-7.15.2\lib\http.c': No such file or directory
http_chunks.c
c1 : fatal error C1083: Cannot open source file: '..\..\curl-7.15.2\lib\http_chunks.c': No such file or directory
http_digest.c
c1 : fatal error C1083: Cannot open source file: '..\..\curl-7.15.2\lib\http_digest.c': No such file or directory
http_negotiate.c
c1 : fatal error C1083: Cannot open source file: '..\..\curl-7.15.2\lib\http_negotiate.c': No such file or directory
http_ntlm.c
c1 : fatal error C1083: Cannot open source file: '..\..\curl-7.15.2\lib\http_ntlm.c': No such file or directory
if2ip.c
c1 : fatal error C1083: Cannot open source file: '..\..\curl-7.15.2\lib\if2ip.c': No such file or directory
inet_ntop.c
c1 : fatal error C1083: Cannot open source file: '..\..\curl-7.15.2\lib\inet_ntop.c': No such file or directory
inet_pton.c
c1 : fatal error C1083: Cannot open source file: '..\..\curl-7.15.2\lib\inet_pton.c': No such file or directory
krb4.c
c1 : fatal error C1083: Cannot open source file: '..\..\curl-7.15.2\lib\krb4.c': No such file or directory
ldap.c
c1 : fatal error C1083: Cannot open source file: '..\..\curl-7.15.2\lib\ldap.c': No such file or directory
llist.c
c1 : fatal error C1083: Cannot open source file: '..\..\curl-7.15.2\lib\llist.c': No such file or directory
md5.c
c1 : fatal error C1083: Cannot open source file: '..\..\curl-7.15.2\lib\md5.c': No such file or directory
memdebug.c
c1 : fatal error C1083: Cannot open source file: '..\..\curl-7.15.2\lib\memdebug.c': No such file or directory
mprintf.c
c1 : fatal error C1083: Cannot open source file: '..\..\curl-7.15.2\lib\mprintf.c': No such file or directory
multi.c
c1 : fatal error C1083: Cannot open source file: '..\..\curl-7.15.2\lib\multi.c': No such file or directory
netrc.c
c1 : fatal error C1083: Cannot open source file: '..\..\curl-7.15.2\lib\netrc.c': No such file or directory
parsedate.c
c1 : fatal error C1083: Cannot open source file: '..\..\curl-7.15.2\lib\parsedate.c': No such file or directory
progress.c
c1 : fatal error C1083: Cannot open source file: '..\..\curl-7.15.2\lib\progress.c': No such file or directory
security.c
c1 : fatal error C1083: Cannot open source file: '..\..\curl-7.15.2\lib\security.c': No such file or directory
Generating Code...
Compiling...
select.c
c1 : fatal error C1083: Cannot open source file: '..\..\curl-7.15.2\lib\select.c': No such file or directory
sendf.c
c1 : fatal error C1083: Cannot open source file: '..\..\curl-7.15.2\lib\sendf.c': No such file or directory
share.c
c1 : fatal error C1083: Cannot open source file: '..\..\curl-7.15.2\lib\share.c': No such file or directory
speedcheck.c
c1 : fatal error C1083: Cannot open source file: '..\..\curl-7.15.2\lib\speedcheck.c': No such file or directory
sslgen.c
c1 : fatal error C1083: Cannot open source file: '..\..\curl-7.15.2\lib\sslgen.c': No such file or directory
ssluse.c
c1 : fatal error C1083: Cannot open source file: '..\..\curl-7.15.2\lib\ssluse.c': No such file or directory
strequal.c
c1 : fatal error C1083: Cannot open source file: '..\..\curl-7.15.2\lib\strequal.c': No such file or directory
strerror.c
c1 : fatal error C1083: Cannot open source file: '..\..\curl-7.15.2\lib\strerror.c': No such file or directory
strtok.c
c1 : fatal error C1083: Cannot open source file: '..\..\curl-7.15.2\lib\strtok.c': No such file or directory
strtoofft.c
c1 : fatal error C1083: Cannot open source file: '..\..\curl-7.15.2\lib\strtoofft.c': No such file or directory
telnet.c
c1 : fatal error C1083: Cannot open source file: '..\..\curl-7.15.2\lib\telnet.c': No such file or directory
tftp.c
c1 : fatal error C1083: Cannot open source file: '..\..\curl-7.15.2\lib\tftp.c': No such file or directory
timeval.c
c1 : fatal error C1083: Cannot open source file: '..\..\curl-7.15.2\lib\timeval.c': No such file or directory
transfer.c
c1 : fatal error C1083: Cannot open source file: '..\..\curl-7.15.2\lib\transfer.c': No such file or directory
url.c
c1 : fatal error C1083: Cannot open source file: '..\..\curl-7.15.2\lib\url.c': No such file or directory
version.c
c1 : fatal error C1083: Cannot open source file: '..\..\curl-7.15.2\lib\version.c': No such file or directory
Generating Code...
Creating browse information file...
Microsoft Browse Information Maintenance Utility Version 8.00.50727
Copyright (C) Microsoft Corporation. All rights reserved.
BSCMAKE: error BK1506 : cannot open file '.\debug\base64.sbr': No such file or directory
Build log was saved at "file://c:\Documents and Settings\michael\Desktop\freeswitch\libs\win32\curl\Debug\BuildLog.htm"
curllib - 57 error(s), 0 warning(s)
------ Build started: Project: js, Configuration: Debug Win32 ------
Compiling...
jsapi.c
c1 : fatal error C1083: Cannot open source file: '..\..\js20051231\src\jsapi.c': No such file or directory
jsarena.c
c1 : fatal error C1083: Cannot open source file: '..\..\js20051231\src\jsarena.c': No such file or directory
jsarray.c
c1 : fatal error C1083: Cannot open source file: '..\..\js20051231\src\jsarray.c': No such file or directory
jsatom.c
c1 : fatal error C1083: Cannot open source file: '..\..\js20051231\src\jsatom.c': No such file or directory
jsbool.c
c1 : fatal error C1083: Cannot open source file: '..\..\js20051231\src\jsbool.c': No such file or directory
jscntxt.c
c1 : fatal error C1083: Cannot open source file: '..\..\js20051231\src\jscntxt.c': No such file or directory
jsdate.c
c1 : fatal error C1083: Cannot open source file: '..\..\js20051231\src\jsdate.c': No such file or directory
jsdbgapi.c
c1 : fatal error C1083: Cannot open source file: '..\..\js20051231\src\jsdbgapi.c': No such file or directory
jsdhash.c
c1 : fatal error C1083: Cannot open source file: '..\..\js20051231\src\jsdhash.c': No such file or directory
jsdtoa.c
c1 : fatal error C1083: Cannot open source file: '..\..\js20051231\src\jsdtoa.c': No such file or directory
jsemit.c
c1 : fatal error C1083: Cannot open source file: '..\..\js20051231\src\jsemit.c': No such file or directory
jsexn.c
c1 : fatal error C1083: Cannot open source file: '..\..\js20051231\src\jsexn.c': No such file or directory
jsfun.c
c1 : fatal error C1083: Cannot open source file: '..\..\js20051231\src\jsfun.c': No such file or directory
jsgc.c
c1 : fatal error C1083: Cannot open source file: '..\..\js20051231\src\jsgc.c': No such file or directory
jshash.c
c1 : fatal error C1083: Cannot open source file: '..\..\js20051231\src\jshash.c': No such file or directory
jsinterp.c
c1 : fatal error C1083: Cannot open source file: '..\..\js20051231\src\jsinterp.c': No such file or directory
jslock.c
c1 : fatal error C1083: Cannot open source file: '..\..\js20051231\src\jslock.c': No such file or directory
jslog2.c
c1 : fatal error C1083: Cannot open source file: '..\..\js20051231\src\jslog2.c': No such file or directory
jslong.c
c1 : fatal error C1083: Cannot open source file: '..\..\js20051231\src\jslong.c': No such file or directory
jsmath.c
c1 : fatal error C1083: Cannot open source file: '..\..\js20051231\src\jsmath.c': No such file or directory
Generating Code...
Compiling...
jsnum.c
c1 : fatal error C1083: Cannot open source file: '..\..\js20051231\src\jsnum.c': No such file or directory
jsobj.c
c1 : fatal error C1083: Cannot open source file: '..\..\js20051231\src\jsobj.c': No such file or directory
jsopcode.c
c1 : fatal error C1083: Cannot open source file: '..\..\js20051231\src\jsopcode.c': No such file or directory
jsparse.c
c1 : fatal error C1083: Cannot open source file: '..\..\js20051231\src\jsparse.c': No such file or directory
jsprf.c
c1 : fatal error C1083: Cannot open source file: '..\..\js20051231\src\jsprf.c': No such file or directory
jsregexp.c
c1 : fatal error C1083: Cannot open source file: '..\..\js20051231\src\jsregexp.c': No such file or directory
jsscan.c
c1 : fatal error C1083: Cannot open source file: '..\..\js20051231\src\jsscan.c': No such file or directory
jsscope.c
c1 : fatal error C1083: Cannot open source file: '..\..\js20051231\src\jsscope.c': No such file or directory
jsscript.c
c1 : fatal error C1083: Cannot open source file: '..\..\js20051231\src\jsscript.c': No such file or directory
jsstr.c
c1 : fatal error C1083: Cannot open source file: '..\..\js20051231\src\jsstr.c': No such file or directory
jsutil.c
c1 : fatal error C1083: Cannot open source file: '..\..\js20051231\src\jsutil.c': No such file or directory
jsxdrapi.c
c1 : fatal error C1083: Cannot open source file: '..\..\js20051231\src\jsxdrapi.c': No such file or directory
jsxml.c
c1 : fatal error C1083: Cannot open source file: '..\..\js20051231\src\jsxml.c': No such file or directory
prmjtime.c
c1 : fatal error C1083: Cannot open source file: '..\..\js20051231\src\prmjtime.c': No such file or directory
Generating Code...
Build log was saved at "file://c:\Documents and Settings\michael\Desktop\freeswitch\libs\win32\js\Debug\BuildLog.htm"
js - 34 error(s), 0 warning(s)
------ Build started: Project: libteletone, Configuration: Debug Win32 ------
Compiling...
libteletone_detect.c
libteletone_generate.c
Generating Code...
Linking...
Creating library Debug\libteletone.lib and object Debug\libteletone.exp
Embedding manifest...
Build log was saved at "file://c:\Documents and Settings\michael\Desktop\freeswitch\libs\libteletone\Debug\BuildLog.htm"
libteletone - 0 error(s), 0 warning(s)
------ Build started: Project: mod_sndfile, Configuration: Debug Win32 ------
Compiling...
mod_sndfile.c
c:\Documents and Settings\michael\Desktop\freeswitch\src\include\switch_apr.h(42) : fatal error C1083: Cannot open include file: 'apr.h': No such file or directory
Build log was saved at "file://c:\Documents and Settings\michael\Desktop\freeswitch\src\mod\formats\mod_sndfile\Debug\BuildLog.htm"
mod_sndfile - 1 error(s), 0 warning(s)
------ Build started: Project: mod_xmpp_event, Configuration: Debug Win32 ------
Compiling...
mod_xmpp_event.c
c:\Documents and Settings\michael\Desktop\freeswitch\src\include\switch_apr.h(42) : fatal error C1083: Cannot open include file: 'apr.h': No such file or directory
Build log was saved at "file://c:\Documents and Settings\michael\Desktop\freeswitch\src\mod\event_handlers\mod_xmpp_event\Debug\BuildLog.htm"
mod_xmpp_event - 1 error(s), 0 warning(s)
------ Build started: Project: libg7xx, Configuration: Debug Win32 ------
Compiling...
g711.c
g722_decode.c
g722_encode.c
g726.c
Generating Code...
Creating library...
Build log was saved at "file://c:\Documents and Settings\michael\Desktop\freeswitch\libs\codec\g7xx\Debug\BuildLog.htm"
libg7xx - 0 error(s), 0 warning(s)
------ Build started: Project: mod_gsm, Configuration: Debug Win32 ------
Compiling...
mod_gsm.c
c:\Documents and Settings\michael\Desktop\freeswitch\src\include\switch_apr.h(42) : fatal error C1083: Cannot open include file: 'apr.h': No such file or directory
Build log was saved at "file://c:\Documents and Settings\michael\Desktop\freeswitch\src\mod\codecs\mod_gsm\Debug\BuildLog.htm"
mod_gsm - 1 error(s), 0 warning(s)
------ Build started: Project: libsofia_sip_ua_static, Configuration: Debug Win32 ------
Performing Pre-Build Event...
c:\Documents and Settings\michael\Desktop\freeswitch\libs\win32\util.vbs(188, 2) Microsoft VBScript runtime error: Path not found
The system cannot find the path specified.
The system cannot find the path specified.
Project : error PRJ0019: A tool returned an error code from "Performing Pre-Build Event..."
Creating browse information file...
Microsoft Browse Information Maintenance Utility Version 8.00.50727
Copyright (C) Microsoft Corporation. All rights reserved.
BSCMAKE: error BK1506 : cannot open file '.\debug\inet_ntop.sbr': No such file or directory
Build log was saved at "file://c:\Documents and Settings\michael\Desktop\freeswitch\libs\win32\sofia\Debug\BuildLog.htm"
libsofia_sip_ua_static - 2 error(s), 0 warning(s)
------ Build started: Project: mod_event_test, Configuration: Debug Win32 ------
Compiling...
mod_event_test.c
c:\Documents and Settings\michael\Desktop\freeswitch\src\include\switch_apr.h(42) : fatal error C1083: Cannot open include file: 'apr.h': No such file or directory
Build log was saved at "file://c:\Documents and Settings\michael\Desktop\freeswitch\src\mod\event_handlers\mod_event_test\Debug\BuildLog.htm"
mod_event_test - 1 error(s), 0 warning(s)
------ Build started: Project: FreeSwitchConsole, Configuration: Debug Win32 ------
Compiling...
switch.c
c:\Documents and Settings\michael\Desktop\freeswitch\src\include\switch_apr.h(42) : fatal error C1083: Cannot open include file: 'apr.h': No such file or directory
Build log was saved at "file://c:\Documents and Settings\michael\Desktop\freeswitch\w32\Console\Debug\BuildLog FreeSwitchConsole.htm"
FreeSwitchConsole - 1 error(s), 0 warning(s)
------ Build started: Project: mod_exosip, Configuration: Debug Win32 ------
Compiling...
mod_exosip.c
c:\Documents and Settings\michael\Desktop\freeswitch\src\include\switch_apr.h(42) : fatal error C1083: Cannot open include file: 'apr.h': No such file or directory
Build log was saved at "file://c:\Documents and Settings\michael\Desktop\freeswitch\src\mod\endpoints\mod_exosip\Debug\BuildLog.htm"
mod_exosip - 1 error(s), 0 warning(s)
------ Build started: Project: mod_dptools, Configuration: Debug Win32 ------
Compiling...
mod_dptools.c
c:\Documents and Settings\michael\Desktop\freeswitch\src\include\switch_apr.h(42) : fatal error C1083: Cannot open include file: 'apr.h': No such file or directory
Build log was saved at "file://c:\Documents and Settings\michael\Desktop\freeswitch\src\mod\applications\mod_dptools\Debug\BuildLog.htm"
mod_dptools - 1 error(s), 0 warning(s)
------ Build started: Project: mod_conference, Configuration: Debug Win32 ------
Compiling...
mod_conference.c
c:\Documents and Settings\michael\Desktop\freeswitch\src\include\switch_apr.h(42) : fatal error C1083: Cannot open include file: 'apr.h': No such file or directory
Build log was saved at "file://c:\Documents and Settings\michael\Desktop\freeswitch\src\mod\applications\mod_conference\Debug\BuildLog.htm"
mod_conference - 1 error(s), 0 warning(s)
------ Build started: Project: mod_rss, Configuration: Debug Win32 ------
Compiling...
mod_rss.c
c:\Documents and Settings\michael\Desktop\freeswitch\src\include\switch_apr.h(42) : fatal error C1083: Cannot open include file: 'apr.h': No such file or directory
Build log was saved at "file://c:\Documents and Settings\michael\Desktop\freeswitch\src\mod\applications\mod_rss\Debug\BuildLog.htm"
mod_rss - 1 error(s), 0 warning(s)
------ Build started: Project: mod_xml_rpc, Configuration: Debug Win32 ------
Compiling...
mod_xml_rpc.c
c:\Documents and Settings\michael\Desktop\freeswitch\src\include\switch_apr.h(42) : fatal error C1083: Cannot open include file: 'apr.h': No such file or directory
Build log was saved at "file://c:\Documents and Settings\michael\Desktop\freeswitch\src\mod\xml_int\mod_xml_rpc\Debug\BuildLog.htm"
mod_xml_rpc - 1 error(s), 0 warning(s)
------ Build started: Project: mod_g711, Configuration: Debug Win32 ------
Compiling...
g711.c
mod_g711.c
c:\Documents and Settings\michael\Desktop\freeswitch\src\include\switch_apr.h(42) : fatal error C1083: Cannot open include file: 'apr.h': No such file or directory
Generating Code...
Build log was saved at "file://c:\Documents and Settings\michael\Desktop\freeswitch\src\mod\codecs\mod_g711\Debug\BuildLog.htm"
mod_g711 - 1 error(s), 0 warning(s)
------ Build started: Project: mod_console, Configuration: Debug Win32 ------
Compiling...
mod_console.c
c:\Documents and Settings\michael\Desktop\freeswitch\src\include\switch_apr.h(42) : fatal error C1083: Cannot open include file: 'apr.h': No such file or directory
Build log was saved at "file://c:\Documents and Settings\michael\Desktop\freeswitch\src\mod\loggers\mod_console\Debug\BuildLog.htm"
mod_console - 1 error(s), 0 warning(s)
------ Build started: Project: mod_iax, Configuration: Debug Win32 ------
Compiling...
mod_iax.c
c:\Documents and Settings\michael\Desktop\freeswitch\src\include\switch_apr.h(42) : fatal error C1083: Cannot open include file: 'apr.h': No such file or directory
Build log was saved at "file://c:\Documents and Settings\michael\Desktop\freeswitch\src\mod\endpoints\mod_iax\Debug\BuildLog.htm"
mod_iax - 1 error(s), 0 warning(s)
------ Build started: Project: mod_commands, Configuration: Debug Win32 ------
Compiling...
mod_commands.c
c:\Documents and Settings\michael\Desktop\freeswitch\src\include\switch_apr.h(42) : fatal error C1083: Cannot open include file: 'apr.h': No such file or directory
Build log was saved at "file://c:\Documents and Settings\michael\Desktop\freeswitch\src\mod\applications\mod_commands\Debug\BuildLog.htm"
mod_commands - 1 error(s), 0 warning(s)
------ Build started: Project: mod_dingaling, Configuration: Debug Win32 ------
Compiling...
mod_dingaling.c
c:\Documents and Settings\michael\Desktop\freeswitch\src\include\switch_apr.h(42) : fatal error C1083: Cannot open include file: 'apr.h': No such file or directory
Build log was saved at "file://c:\Documents and Settings\michael\Desktop\freeswitch\src\mod\endpoints\mod_dingaling\Debug\BuildLog.htm"
mod_dingaling - 1 error(s), 0 warning(s)
------ Build started: Project: mod_ilbc, Configuration: Debug Win32 ------
Compiling...
mod_ilbc.c
c:\Documents and Settings\michael\Desktop\freeswitch\src\include\switch_apr.h(42) : fatal error C1083: Cannot open include file: 'apr.h': No such file or directory
Build log was saved at "file://c:\Documents and Settings\michael\Desktop\freeswitch\src\mod\codecs\mod_ilbc\Debug\BuildLog.htm"
mod_ilbc - 1 error(s), 0 warning(s)
------ Build started: Project: mod_echo, Configuration: Debug Win32 ------
Compiling...
mod_echo.c
c:\Documents and Settings\michael\Desktop\freeswitch\src\include\switch_apr.h(42) : fatal error C1083: Cannot open include file: 'apr.h': No such file or directory
Build log was saved at "file://c:\Documents and Settings\michael\Desktop\freeswitch\src\mod\applications\mod_echo\Debug\BuildLog.htm"
mod_echo - 1 error(s), 0 warning(s)
------ Build started: Project: mod_playback, Configuration: Debug Win32 ------
Compiling...
mod_playback.c
c:\Documents and Settings\michael\Desktop\freeswitch\src\include\switch_apr.h(42) : fatal error C1083: Cannot open include file: 'apr.h': No such file or directory
Build log was saved at "file://c:\Documents and Settings\michael\Desktop\freeswitch\src\mod\applications\mod_playback\Debug\BuildLog.htm"
mod_playback - 1 error(s), 0 warning(s)
------ Build started: Project: mod_PortAudio, Configuration: Debug Win32 ------
Compiling...
mod_portaudio.c
c:\Documents and Settings\michael\Desktop\freeswitch\src\include\switch_apr.h(42) : fatal error C1083: Cannot open include file: 'apr.h': No such file or directory
pablio.c
.\pablio.c(48) : fatal error C1083: Cannot open include file: 'portaudio.h': No such file or directory
ringbuffer.c
Generating Code...
Build log was saved at "file://c:\Documents and Settings\michael\Desktop\freeswitch\src\mod\endpoints\mod_portaudio\Debug\BuildLog.htm"
mod_PortAudio - 2 error(s), 0 warning(s)
------ Build started: Project: mod_l16, Configuration: Debug Win32 ------
Compiling...
mod_l16.c
c:\Documents and Settings\michael\Desktop\freeswitch\src\include\switch_apr.h(42) : fatal error C1083: Cannot open include file: 'apr.h': No such file or directory
Build log was saved at "file://c:\Documents and Settings\michael\Desktop\freeswitch\src\mod\codecs\mod_l16\Debug\BuildLog.htm"
mod_l16 - 1 error(s), 0 warning(s)
------ Build started: Project: mod_softtimer, Configuration: Debug Win32 ------
Compiling...
mod_softtimer.c
c:\Documents and Settings\michael\Desktop\freeswitch\src\include\switch_apr.h(42) : fatal error C1083: Cannot open include file: 'apr.h': No such file or directory
Build log was saved at "file://c:\Documents and Settings\michael\Desktop\freeswitch\src\mod\timers\mod_softtimer\Debug\BuildLog.htm"
mod_softtimer - 1 error(s), 0 warning(s)
------ Build started: Project: mod_spidermonkey, Configuration: Debug Win32 ------
Compiling...
mod_spidermonkey.c
c:\Documents and Settings\michael\Desktop\freeswitch\src\include\switch_apr.h(42) : fatal error C1083: Cannot open include file: 'apr.h': No such file or directory
Build log was saved at "file://c:\Documents and Settings\michael\Desktop\freeswitch\src\mod\languages\mod_spidermonkey\Debug\BuildLog.htm"
mod_spidermonkey - 1 error(s), 0 warning(s)
------ Build started: Project: mod_speex, Configuration: Debug Win32 ------
Compiling...
mod_speex.c
c:\Documents and Settings\michael\Desktop\freeswitch\src\include\switch_apr.h(42) : fatal error C1083: Cannot open include file: 'apr.h': No such file or directory
Build log was saved at "file://c:\Documents and Settings\michael\Desktop\freeswitch\src\mod\codecs\mod_speex\Debug\BuildLog.htm"
mod_speex - 1 error(s), 0 warning(s)
------ Build started: Project: mod_bridgecall, Configuration: Debug Win32 ------
Compiling...
mod_bridgecall.c
c:\Documents and Settings\michael\Desktop\freeswitch\src\include\switch_apr.h(42) : fatal error C1083: Cannot open include file: 'apr.h': No such file or directory
Build log was saved at "file://c:\Documents and Settings\michael\Desktop\freeswitch\src\mod\applications\mod_bridgecall\Debug\BuildLog.htm"
mod_bridgecall - 1 error(s), 0 warning(s)
------ Build started: Project: mod_event_multicast, Configuration: Debug Win32 ------
Compiling...
mod_event_multicast.c
c:\Documents and Settings\michael\Desktop\freeswitch\src\include\switch_apr.h(42) : fatal error C1083: Cannot open include file: 'apr.h': No such file or directory
Build log was saved at "file://c:\Documents and Settings\michael\Desktop\freeswitch\src\mod\event_handlers\mod_event_multicast\Debug\BuildLog.htm"
mod_event_multicast - 1 error(s), 0 warning(s)
------ Build started: Project: mod_zeroconf, Configuration: Debug Win32 ------
Compiling...
mod_zeroconf.c
c:\Documents and Settings\michael\Desktop\freeswitch\src\include\switch_apr.h(42) : fatal error C1083: Cannot open include file: 'apr.h': No such file or directory
Build log was saved at "file://c:\Documents and Settings\michael\Desktop\freeswitch\src\mod\event_handlers\mod_zeroconf\Debug\BuildLog.htm"
mod_zeroconf - 1 error(s), 0 warning(s)
------ Build started: Project: mod_dialplan_directory, Configuration: Debug Win32 ------
Compiling...
mod_dialplan_directory.c
c:\Documents and Settings\michael\Desktop\freeswitch\src\include\switch_apr.h(42) : fatal error C1083: Cannot open include file: 'apr.h': No such file or directory
Build log was saved at "file://c:\Documents and Settings\michael\Desktop\freeswitch\src\mod\dialplans\mod_dialplan_directory\Debug\BuildLog.htm"
mod_dialplan_directory - 1 error(s), 0 warning(s)
------ Build started: Project: mod_ldap, Configuration: Debug MS-LDAP Win32 ------
Compiling...
mod_ldap.c
c:\Documents and Settings\michael\Desktop\freeswitch\src\include\switch_apr.h(42) : fatal error C1083: Cannot open include file: 'apr.h': No such file or directory
Build log was saved at "file://c:\Documents and Settings\michael\Desktop\freeswitch\src\mod\directories\mod_ldap\Debug MS-LDAP\BuildLog.htm"
mod_ldap - 1 error(s), 0 warning(s)
------ Build started: Project: mod_woomera, Configuration: Debug Win32 ------
Compiling...
mod_woomera.c
c:\Documents and Settings\michael\Desktop\freeswitch\src\include\switch_apr.h(42) : fatal error C1083: Cannot open include file: 'apr.h': No such file or directory
Build log was saved at "file://c:\Documents and Settings\michael\Desktop\freeswitch\src\mod\endpoints\mod_woomera\Debug\BuildLog.htm"
mod_woomera - 1 error(s), 0 warning(s)
------ Build started: Project: mod_dialplan_xml, Configuration: Debug Win32 ------
Compiling...
mod_dialplan_xml.c
c:\Documents and Settings\michael\Desktop\freeswitch\src\include\switch_apr.h(42) : fatal error C1083: Cannot open include file: 'apr.h': No such file or directory
Build log was saved at "file://c:\Documents and Settings\michael\Desktop\freeswitch\src\mod\dialplans\mod_dialplan_xml\Debug\BuildLog.htm"
mod_dialplan_xml - 1 error(s), 0 warning(s)
------ Build started: Project: mod_ivrtest, Configuration: Debug Win32 ------
Compiling...
mod_ivrtest.c
c:\Documents and Settings\michael\Desktop\freeswitch\src\include\switch_apr.h(42) : fatal error C1083: Cannot open include file: 'apr.h': No such file or directory
Build log was saved at "file://c:\Documents and Settings\michael\Desktop\freeswitch\src\mod\applications\mod_ivrtest\Debug\BuildLog.htm"
mod_ivrtest - 1 error(s), 0 warning(s)
------ Skipped Build: Project: FreeSwitchSetup, Configuration: Debug ------
Project not selected to build for this solution configuration
------ Skipped Build: Project: docs (Docs\docs), Configuration: Debug Win32 ------
Project not selected to build for this solution configuration
------ Skipped Build: Project: mod_cepstral, Configuration: Debug Win32 ------
Project not selected to build for this solution configuration
------ Skipped Build: Project: fs_perl, Configuration: Debug Win32 ------
Project not selected to build for this solution configuration
------ Skipped Build: Project: mod_perl, Configuration: Debug Win32 ------
Project not selected to build for this solution configuration
------ Build started: Project: mod_event_socket, Configuration: Debug Win32 ------
Compiling...
mod_event_socket.c
c:\Documents and Settings\michael\Desktop\freeswitch\src\include\switch_apr.h(42) : fatal error C1083: Cannot open include file: 'apr.h': No such file or directory
Build log was saved at "file://c:\Documents and Settings\michael\Desktop\freeswitch\src\mod\event_handlers\mod_event_socket\Debug\BuildLog.htm"
mod_event_socket - 1 error(s), 0 warning(s)
------ Skipped Build: Project: mod_sofia, Configuration: Debug Win32 ------
Project not selected to build for this solution configuration
------ Build started: Project: libg726, Configuration: Debug Win32 ------
Compiling...
g711.c
g726_16.c
g726_24.c
g726_32.c
g726_40.c
g72x.c
Generating Code...
Creating library...
Build log was saved at "file://c:\Documents and Settings\michael\Desktop\freeswitch\libs\codec\g726\Debug\BuildLog.htm"
libg726 - 0 error(s), 0 warning(s)
------ Build started: Project: mod_g722, Configuration: Debug Win32 ------
Compiling...
mod_g722.c
c:\Documents and Settings\michael\Desktop\freeswitch\src\include\switch_apr.h(42) : fatal error C1083: Cannot open include file: 'apr.h': No such file or directory
Build log was saved at "file://c:\Documents and Settings\michael\Desktop\freeswitch\src\mod\codecs\mod_g722\Debug\BuildLog.htm"
mod_g722 - 1 error(s), 0 warning(s)
------ Build started: Project: mod_g729, Configuration: Debug Passthrough Win32 ------
Compiling...
mod_g729.c
c:\Documents and Settings\michael\Desktop\freeswitch\src\include\switch_apr.h(42) : fatal error C1083: Cannot open include file: 'apr.h': No such file or directory
Build log was saved at "file://c:\Documents and Settings\michael\Desktop\freeswitch\src\mod\codecs\mod_g729\Debug Passthrough\BuildLog.htm"
mod_g729 - 1 error(s), 0 warning(s)
------ Build started: Project: mod_park, Configuration: Debug Win32 ------
Compiling...
mod_park.c
c:\Documents and Settings\michael\Desktop\freeswitch\src\include\switch_apr.h(42) : fatal error C1083: Cannot open include file: 'apr.h': No such file or directory
Build log was saved at "file://c:\Documents and Settings\michael\Desktop\freeswitch\src\mod\applications\mod_park\Debug\BuildLog.htm"
mod_park - 1 error(s), 0 warning(s)
------ Build started: Project: mod_cdr, Configuration: Debug Win32 ------
Compiling...
basecdr.cpp
c:\Documents and Settings\michael\Desktop\freeswitch\src\include\switch_apr.h(42) : fatal error C1083: Cannot open include file: 'apr.h': No such file or directory
baseregistry.cpp
c:\Documents and Settings\michael\Desktop\freeswitch\src\include\switch_apr.h(42) : fatal error C1083: Cannot open include file: 'apr.h': No such file or directory
cdrcontainer.cpp
c:\Documents and Settings\michael\Desktop\freeswitch\src\include\switch_apr.h(42) : fatal error C1083: Cannot open include file: 'apr.h': No such file or directory
csvcdr.cpp
c:\Documents and Settings\michael\Desktop\freeswitch\src\include\switch_apr.h(42) : fatal error C1083: Cannot open include file: 'apr.h': No such file or directory
mod_cdr.cpp
c:\Documents and Settings\michael\Desktop\freeswitch\src\include\switch_apr.h(42) : fatal error C1083: Cannot open include file: 'apr.h': No such file or directory
pddcdr.cpp
c:\Documents and Settings\michael\Desktop\freeswitch\src\include\switch_apr.h(42) : fatal error C1083: Cannot open include file: 'apr.h': No such file or directory
Generating Code...
Build log was saved at "file://c:\Documents and Settings\michael\Desktop\freeswitch\src\mod\event_handlers\mod_cdr\Debug\BuildLog.htm"
mod_cdr - 6 error(s), 0 warning(s)
========== Build: 24 succeeded, 62 failed, 0 up-to-date, 6 skipped ==========