All pastes #167088 Raw Edit

Mine

public text v1 · immutable
·published 2006-09-11 17:22 UTC
rendered paste body
[jtate@dhcp245 cherrypy-trunk]$ PYTHONPATH=`pwd` python cherrypy/test/test.py --ssl
Python version used to run this test script: 2.4.1
CherryPy version 3.0.0beta
HTTP server version HTTP/1.1 (ssl)


Running tests: cherrypy._cpwsgi.WSGIServer
No handlers could be found for logger "cherrypy.error"
testProxy (test_proxy.ProxyTest) ... ok
testCaching (test_caching.CacheTest) ... ok
testExpiresTool (test_caching.CacheTest) ... ok
testConfig (test_config.ConfigTests) ... ok
testCustomNamespaces (test_config.ConfigTests) ... ok
test_100_Continue (test_conn.ConnectionTests) ... ok
test_Chunked_Encoding (test_conn.ConnectionTests) ... ok
test_HTTP10 (test_conn.ConnectionTests) ... ok
test_HTTP11 (test_conn.ConnectionTests) ... ok
test_HTTP11_Timeout (test_conn.ConnectionTests) ... FAIL
test_HTTP11_pipelining (test_conn.ConnectionTests) ... ok

======================================================================
FAIL: test_HTTP11_Timeout (test_conn.ConnectionTests)
----------------------------------------------------------------------
Traceback (most recent call last):
  File "/home/jtate/devel/cherrypy-trunk/cherrypy/test/webtest.py", line 262, in __call__
    testMethod()
  File "/home/jtate/devel/cherrypy-trunk/cherrypy/test/test_conn.py", line 172, in test_HTTP11_Timeout
    self.fail("Writing to timed out socket didn't fail"
AssertionError: Writing to timed out socket didn't fail as it should have: Hello, world!

FAILED (failures=1)
testCookies (test_core.CoreRequestHandlingTest) ... ok
testDefaultContentType (test_core.CoreRequestHandlingTest) ... ok
testEmptyThreadlocals (test_core.CoreRequestHandlingTest) ... ok
testErrorHandling (test_core.CoreRequestHandlingTest) ... ok
testExpect (test_core.CoreRequestHandlingTest) ... ok
testFavicon (test_core.CoreRequestHandlingTest) ... ok
testFlatten (test_core.CoreRequestHandlingTest) ... ok
testHTTPMethods (test_core.CoreRequestHandlingTest) ... ok
testHeaderElements (test_core.CoreRequestHandlingTest) ... ok
testHeaders (test_core.CoreRequestHandlingTest) ... ok
testLogging (test_core.CoreRequestHandlingTest) ... ok
testMaxRequestSize (test_core.CoreRequestHandlingTest) ... ok
testParams (test_core.CoreRequestHandlingTest) ... ok
testRanges (test_core.CoreRequestHandlingTest) ... ok
testRedirect (test_core.CoreRequestHandlingTest) ... ok
testStatus (test_core.CoreRequestHandlingTest) ... ok
testBareHooks (test_tools.ToolTests) ... ok
testCombinedTools (test_tools.ToolTests) ... ok
testDemo (test_tools.ToolTests) ... ok
testGuaranteedHooks (test_tools.ToolTests) ... ok
testDecodingEncoding (test_decodingencoding.DecodingEncodingTest) ... ok
testETags (test_etags.ETagTest) ... ok
testGzip (test_gzip.GzipTest) ... ok
testExpose (test_objectmapping.ObjectMappingTest) ... ok
testMethodDispatch (test_objectmapping.ObjectMappingTest) ... ok
testObjectMapping (test_objectmapping.ObjectMappingTest) ... ok
testPositionalParams (test_objectmapping.ObjectMappingTest) ... ok
testReferer (test_misc_tools.RefererTest) ... ok
testResponseHeaders (test_misc_tools.ResponseHeadersTest) ... ok
testResponseHeadersDecorator (test_misc_tools.ResponseHeadersTest) ... ok
testStatic (test_static.StaticTest) ... ok
test01HelloWorld (test_tutorials.TutorialTest) ... ok
test02ExposeMethods (test_tutorials.TutorialTest) ... ok
test03GetAndPost (test_tutorials.TutorialTest) ... ok
test04ComplexSite (test_tutorials.TutorialTest) ... ok
test05DerivedObjects (test_tutorials.TutorialTest) ... ok
test06DefaultMethod (test_tutorials.TutorialTest) ... ok
test07Sessions (test_tutorials.TutorialTest) ... ok
test08GeneratorsAndYield (test_tutorials.TutorialTest) ... ok
test09Files (test_tutorials.TutorialTest) ... ok
test10HTTPErrors (test_tutorials.TutorialTest) ... ok
testVirtualHost (test_virtualhost.VirtualHostTest) ... ok
test_0_Session (test_session.SessionTest) ... ok
test_1_Ram_Concurrency (test_session.SessionTest) ... Exception in thread CP WSGIServer Thread-5:
Traceback (most recent call last):
  File "/usr/lib/python2.4/threading.py", line 442, in __bootstrap
    self.run()
  File "/home/jtate/devel/cherrypy-trunk/cherrypy/_cpwsgiserver.py", line 495, in run
    conn.communicate()
  File "/home/jtate/devel/cherrypy-trunk/cherrypy/_cpwsgiserver.py", line 460, in communicate
    req.simple_response("500 Internal Server Error", format_exc())
  File "/home/jtate/devel/cherrypy-trunk/cherrypy/_cpwsgiserver.py", line 290, in simple_response
    wfile.flush()
  File "/home/jtate/devel/cherrypy-trunk/cherrypy/_cpwsgiserver.py", line 354, in ssl_method_wrapper
    return method(self, *args, **kwargs)
  File "/usr/lib/python2.4/socket.py", line 243, in flush
    self._sock.sendall(buffer)
Error: [('SSL routines', 'SSL3_GET_MESSAGE', 'excessive message size')]

Exception in thread CP WSGIServer Thread-7:
Traceback (most recent call last):
  File "/usr/lib/python2.4/threading.py", line 442, in __bootstrap
    self.run()
  File "/home/jtate/devel/cherrypy-trunk/cherrypy/_cpwsgiserver.py", line 495, in run
    conn.communicate()
  File "/home/jtate/devel/cherrypy-trunk/cherrypy/_cpwsgiserver.py", line 460, in communicate
    req.simple_response("500 Internal Server Error", format_exc())
  File "/home/jtate/devel/cherrypy-trunk/cherrypy/_cpwsgiserver.py", line 290, in simple_response
    wfile.flush()
  File "/home/jtate/devel/cherrypy-trunk/cherrypy/_cpwsgiserver.py", line 354, in ssl_method_wrapper
    return method(self, *args, **kwargs)
  File "/usr/lib/python2.4/socket.py", line 243, in flush
    self._sock.sendall(buffer)
Error: [('SSL routines', 'SSL3_GET_MESSAGE', 'excessive message size')]

Exception in thread CP WSGIServer Thread-9:
Traceback (most recent call last):
  File "/usr/lib/python2.4/threading.py", line 442, in __bootstrap
    self.run()
  File "/home/jtate/devel/cherrypy-trunk/cherrypy/_cpwsgiserver.py", line 495, in run
    conn.communicate()
  File "/home/jtate/devel/cherrypy-trunk/cherrypy/_cpwsgiserver.py", line 460, in communicate
    req.simple_response("500 Internal Server Error", format_exc())
  File "/home/jtate/devel/cherrypy-trunk/cherrypy/_cpwsgiserver.py", line 290, in simple_response
    wfile.flush()
  File "/home/jtate/devel/cherrypy-trunk/cherrypy/_cpwsgiserver.py", line 354, in ssl_method_wrapper
    return method(self, *args, **kwargs)
  File "/usr/lib/python2.4/socket.py", line 243, in flush
    self._sock.sendall(buffer)
Error: [('SSL routines', 'SSL3_GET_MESSAGE', 'excessive message size')]

Exception in thread CP WSGIServer Thread-8:
Traceback (most recent call last):
  File "/usr/lib/python2.4/threading.py", line 442, in __bootstrap
    self.run()
  File "/home/jtate/devel/cherrypy-trunk/cherrypy/_cpwsgiserver.py", line 495, in run
    conn.communicate()
  File "/home/jtate/devel/cherrypy-trunk/cherrypy/_cpwsgiserver.py", line 460, in communicate
    req.simple_response("500 Internal Server Error", format_exc())
  File "/home/jtate/devel/cherrypy-trunk/cherrypy/_cpwsgiserver.py", line 290, in simple_response
    wfile.flush()
  File "/home/jtate/devel/cherrypy-trunk/cherrypy/_cpwsgiserver.py", line 354, in ssl_method_wrapper
    return method(self, *args, **kwargs)
  File "/usr/lib/python2.4/socket.py", line 243, in flush
    self._sock.sendall(buffer)
Error: [('SSL routines', 'SSL3_GET_MESSAGE', 'excessive message size')]

Exception in thread CP WSGIServer Thread-10:
Traceback (most recent call last):
  File "/usr/lib/python2.4/threading.py", line 442, in __bootstrap
    self.run()
  File "/home/jtate/devel/cherrypy-trunk/cherrypy/_cpwsgiserver.py", line 495, in run
    conn.communicate()
  File "/home/jtate/devel/cherrypy-trunk/cherrypy/_cpwsgiserver.py", line 460, in communicate
    req.simple_response("500 Internal Server Error", format_exc())
  File "/home/jtate/devel/cherrypy-trunk/cherrypy/_cpwsgiserver.py", line 290, in simple_response
    wfile.flush()
  File "/home/jtate/devel/cherrypy-trunk/cherrypy/_cpwsgiserver.py", line 354, in ssl_method_wrapper
    return method(self, *args, **kwargs)
  File "/usr/lib/python2.4/socket.py", line 243, in flush
    self._sock.sendall(buffer)
Error: [('SSL routines', 'SSL3_GET_MESSAGE', 'excessive message size')]

Exception in thread CP WSGIServer Thread-3:
Traceback (most recent call last):
  File "/usr/lib/python2.4/threading.py", line 442, in __bootstrap
    self.run()
  File "/home/jtate/devel/cherrypy-trunk/cherrypy/_cpwsgiserver.py", line 495, in run
    conn.communicate()
  File "/home/jtate/devel/cherrypy-trunk/cherrypy/_cpwsgiserver.py", line 460, in communicate
    req.simple_response("500 Internal Server Error", format_exc())
  File "/home/jtate/devel/cherrypy-trunk/cherrypy/_cpwsgiserver.py", line 290, in simple_response
    wfile.flush()
  File "/home/jtate/devel/cherrypy-trunk/cherrypy/_cpwsgiserver.py", line 354, in ssl_method_wrapper
    return method(self, *args, **kwargs)
  File "/usr/lib/python2.4/socket.py", line 243, in flush
    self._sock.sendall(buffer)
Error: [('SSL routines', 'SSL3_GET_MESSAGE', 'excessive message size')]

Exception in thread CP WSGIServer Thread-11:
Traceback (most recent call last):
  File "/usr/lib/python2.4/threading.py", line 442, in __bootstrap
    self.run()
  File "/home/jtate/devel/cherrypy-trunk/cherrypy/_cpwsgiserver.py", line 495, in run
    conn.communicate()
  File "/home/jtate/devel/cherrypy-trunk/cherrypy/_cpwsgiserver.py", line 460, in communicate
    req.simple_response("500 Internal Server Error", format_exc())
  File "/home/jtate/devel/cherrypy-trunk/cherrypy/_cpwsgiserver.py", line 290, in simple_response
    wfile.flush()
  File "/home/jtate/devel/cherrypy-trunk/cherrypy/_cpwsgiserver.py", line 354, in ssl_method_wrapper
    return method(self, *args, **kwargs)
  File "/usr/lib/python2.4/socket.py", line 243, in flush
    self._sock.sendall(buffer)
Error: [('SSL routines', 'SSL3_GET_MESSAGE', 'excessive message size')]

Exception in thread CP WSGIServer Thread-4:
Traceback (most recent call last):
  File "/usr/lib/python2.4/threading.py", line 442, in __bootstrap
    self.run()
  File "/home/jtate/devel/cherrypy-trunk/cherrypy/_cpwsgiserver.py", line 495, in run
    conn.communicate()
  File "/home/jtate/devel/cherrypy-trunk/cherrypy/_cpwsgiserver.py", line 460, in communicate
    req.simple_response("500 Internal Server Error", format_exc())
  File "/home/jtate/devel/cherrypy-trunk/cherrypy/_cpwsgiserver.py", line 290, in simple_response
    wfile.flush()
  File "/home/jtate/devel/cherrypy-trunk/cherrypy/_cpwsgiserver.py", line 354, in ssl_method_wrapper
    return method(self, *args, **kwargs)
  File "/usr/lib/python2.4/socket.py", line 243, in flush
    self._sock.sendall(buffer)
Error: [('SSL routines', 'SSL3_GET_MESSAGE', 'excessive message size')]

Exception in thread CP WSGIServer Thread-2:
Traceback (most recent call last):
  File "/usr/lib/python2.4/threading.py", line 442, in __bootstrap
    self.run()
  File "/home/jtate/devel/cherrypy-trunk/cherrypy/_cpwsgiserver.py", line 495, in run
    conn.communicate()
  File "/home/jtate/devel/cherrypy-trunk/cherrypy/_cpwsgiserver.py", line 460, in communicate
    req.simple_response("500 Internal Server Error", format_exc())
  File "/home/jtate/devel/cherrypy-trunk/cherrypy/_cpwsgiserver.py", line 290, in simple_response
    wfile.flush()
  File "/home/jtate/devel/cherrypy-trunk/cherrypy/_cpwsgiserver.py", line 354, in ssl_method_wrapper
    return method(self, *args, **kwargs)
  File "/usr/lib/python2.4/socket.py", line 243, in flush
    self._sock.sendall(buffer)
Error: [('SSL routines', 'SSL3_GET_MESSAGE', 'excessive message size')]

ok
test_2_File_Concurrency (test_session.SessionTest) ... ok
testSessionAuthenticate (test_sessionauthenticate.SessionAuthenticateTest) ... ok
testXmlRpc (test_xmlrpc.XmlRpcTest) ... ok
test_01_standard_app (test_wsgiapps.WSGIAppTest) ... ok
test_02_wrapped_wsgi (test_wsgiapps.WSGIAppTest) ... ok
test_03_static_subdir (test_wsgiapps.WSGIAppTest) ... ok
test_04_pure_wsgi (test_wsgiapps.WSGIAppTest) ... ok
test_05_wrapped_cp_app (test_wsgiapps.WSGIAppTest) ... ok
test_pipeline (test_wsgi_ns.WSGI_Namespace_Test) ... ok

hit enter