rendered paste bodyneoclock4x.c; \
then mv -f ".deps/refclock_neoclock4x.Tpo" ".deps/refclock_neoclock4x.Po"; else rm -f ".deps/refclock_neoclock4x.Tpo"; exit 1; fi
if i686-pc-linux-gnu-gcc -DHAVE_CONFIG_H -I. -I. -I.. -I../include -I../include -I/usr/include -O2 -march=athlon-xp -fomit-frame-pointer -pipe -Wall -Wcast-qual -Wmissing-prototypes -Wshadow -Wstrict-prototypes -MT cmd_args.o -MD -MP -MF ".deps/cmd_args.Tpo" -c -o cmd_args.o cmd_args.c; \
then mv -f ".deps/cmd_args.Tpo" ".deps/cmd_args.Po"; else rm -f ".deps/cmd_args.Tpo"; exit 1; fi
if i686-pc-linux-gnu-gcc -DHAVE_CONFIG_H -I. -I. -I.. -I../include -I../include -I/usr/include -O2 -march=athlon-xp -fomit-frame-pointer -pipe -Wall -Wcast-qual -Wmissing-prototypes -Wshadow -Wstrict-prototypes -MT ntp_config.o -MD -MP -MF ".deps/ntp_config.Tpo" -c -o ntp_config.o ntp_config.c; \
then mv -f ".deps/ntp_config.Tpo" ".deps/ntp_config.Po"; else rm -f ".deps/ntp_config.Tpo"; exit 1; fi
*** glibc detected *** free(): invalid pointer: 0x08465198 ***
In file included from /usr/include/openssl/crypto.h:62,
from /usr/include/openssl/bio.h:67,
from /usr/include/openssl/evp.h:75,
from ../include/ntp_crypto.h:5,
from ../include/ntp.h:10,
from ../include/ntpd.h:7,
from ntp_config.c:34:
/usr/include/stdlib.h:602: internal compiler error: Aborted
Please submit a full bug report,
with preprocessed source if appropriate.
See <URL:http://bugs.gentoo.org/> for instructions.
if i686-pc-linux-gnu-gcc -DHAVE_CONFIG_H -I. -I. -I.. -I../include -I../include -I/usr/include -O2 -march=athlon-xp -fomit-frame-pointer -pipe -Wall -Wcast-qual -Wmissing-prototypes -Wshadow -Wstrict-prototypes -MT ntp_io.o -MD -MP -MF ".deps/ntp_io.Tpo" -c -o ntp_io.o ntp_io.c; \
then mv -f ".deps/ntp_io.Tpo" ".deps/ntp_io.Po"; else rm -f ".deps/ntp_io.Tpo"; exit 1; fi
ntp_io.c: In function `input_handler':
ntp_io.c:1805: warning: suggest parentheses around && within ||
The bug is not reproducible, so it is likely a hardware or OS problem.
make[2]: *** [ntp_config.o] Error 1
make[2]: *** Waiting for unfinished jobs....
make[2]: Leaving directory `/var/tmp/portage/ntp-4.2.0.20040617-r2/work/ntp-stable-4.2.0a-20040617/ntpd'
make[1]: *** [all-recursive] Error 1
make[1]: Leaving directory `/var/tmp/portage/ntp-4.2.0.20040617-r2/work/ntp-stable-4.2.0a-20040617'
make: *** [all] Error 2
!!! ERROR: net-misc/ntp-4.2.0.20040617-r2 failed.
!!! Function src_compile, Line 77, Exitcode 2
!!! (no error message)
!!! If you need support, post the topmost build error, NOT this status message.