rendered paste bodyThis file contains any messages produced by compilers while
running configure, to aid debugging if configure makes a mistake.
It was created by advance configure source, which was
generated by GNU Autoconf 2.59. Invocation command line was
$ ./configure --prefix=/usr --host=i686-pc-linux-gnu --mandir=/usr/share/man --infodir=/usr/share/info --datadir=/usr/share --sysconfdir=/etc --localstatedir=/var/lib --prefix=/usr/games --libdir=/usr/games/lib --datadir=/usr/share/games --sysconfdir=/etc/games --localstatedir=/var/games --enable-alsa --disable-expat --disable-fb --disable-oss --disable-sdl --disable-slang --disable-static --disable-svgalib --disable-freetype --enable-zlib --enable-asm --with-emu=mame --build=i686-pc-linux-gnu
## --------- ##
## Platform. ##
## --------- ##
hostname = GentooPowered
uname -m = i686
uname -r = 2.6.17-gentoo-r7
uname -s = Linux
uname -v = #1 Sun Sep 3 05:25:48 EDT 2006
/usr/bin/uname -p = AMD Sempron(tm) 2800+
/bin/uname -X = unknown
/bin/arch = i686
/usr/bin/arch -k = unknown
/usr/convex/getsysinfo = unknown
hostinfo = unknown
/bin/machine = unknown
/usr/bin/oslevel = unknown
/bin/universe = unknown
PATH: /usr/local/sbin
PATH: /sbin
PATH: /usr/sbin
PATH: /usr/lib/portage/bin
PATH: /usr/local/bin
PATH: /bin
PATH: /usr/bin
PATH: /opt/bin
PATH: /usr/i686-pc-linux-gnu/gcc-bin/4.1.1
PATH: /opt/vmware/workstation/bin
PATH: /var/tmp/portage/advancemame-0.106.0/temp
## ----------- ##
## Core tests. ##
## ----------- ##
configure:1404: checking build system type
configure:1422: result: i686-pc-linux-gnu
configure:1430: checking host system type
configure:1444: result: i686-pc-linux-gnu
configure:1567: checking for i686-pc-linux-gnu-gcc
configure:1583: found /usr/bin/i686-pc-linux-gnu-gcc
configure:1593: result: i686-pc-linux-gnu-gcc
configure:1875: checking for C compiler version
configure:1878: i686-pc-linux-gnu-gcc --version </dev/null >&5
i686-pc-linux-gnu-gcc (GCC) 4.1.1 (Gentoo 4.1.1)
Copyright (C) 2006 Free Software Foundation, Inc.
This is free software; see the source for copying conditions. There is NO
warranty; not even for MERCHANTABILITY or FITNESS FOR A PARTICULAR PURPOSE.
configure:1881: $? = 0
configure:1883: i686-pc-linux-gnu-gcc -v </dev/null >&5
Using built-in specs.
Target: i686-pc-linux-gnu
Configured with: /var/tmp/portage/gcc-4.1.1/work/gcc-4.1.1/configure --prefix=/usr --bindir=/usr/i686-pc-linux-gnu/gcc-bin/4.1.1 --includedir=/usr/lib/gcc/i686-pc-linux-gnu/4.1.1/include --datadir=/usr/share/gcc-data/i686-pc-linux-gnu/4.1.1 --mandir=/usr/share/gcc-data/i686-pc-linux-gnu/4.1.1/man --infodir=/usr/share/gcc-data/i686-pc-linux-gnu/4.1.1/info --with-gxx-include-dir=/usr/lib/gcc/i686-pc-linux-gnu/4.1.1/include/g++-v4 --host=i686-pc-linux-gnu --build=i686-pc-linux-gnu --disable-altivec --enable-nls --without-included-gettext --with-system-zlib --disable-checking --disable-werror --disable-libunwind-exceptions --disable-multilib --disable-libmudflap --disable-libssp --disable-libgcj --enable-languages=c,c++,fortran --enable-shared --enable-threads=posix --enable-__cxa_atexit --enable-clocale=gnu
Thread model: posix
gcc version 4.1.1 (Gentoo 4.1.1)
configure:1886: $? = 0
configure:1888: i686-pc-linux-gnu-gcc -V </dev/null >&5
i686-pc-linux-gnu-gcc: '-V' option must have argument
configure:1891: $? = 1
configure:1914: checking for C compiler default output file name
configure:1917: i686-pc-linux-gnu-gcc -O2 -march=athlon-xp -pipe conftest.c >&5
configure:1920: $? = 0
configure:1966: result: a.out
configure:1971: checking whether the C compiler works
configure:1977: ./a.out
configure:1980: $? = 0
configure:1997: result: yes
configure:2004: checking whether we are cross compiling
configure:2006: result: no
configure:2009: checking for suffix of executables
configure:2011: i686-pc-linux-gnu-gcc -o conftest -O2 -march=athlon-xp -pipe conftest.c >&5
configure:2014: $? = 0
configure:2039: result:
configure:2045: checking for suffix of object files
configure:2066: i686-pc-linux-gnu-gcc -c -O2 -march=athlon-xp -pipe conftest.c >&5
configure:2069: $? = 0
configure:2091: result: o
configure:2095: checking whether we are using the GNU C compiler
configure:2119: i686-pc-linux-gnu-gcc -c -O2 -march=athlon-xp -pipe conftest.c >&5
configure:2125: $? = 0
configure:2129: test -z
|| test ! -s conftest.err
configure:2132: $? = 0
configure:2135: test -s conftest.o
configure:2138: $? = 0
configure:2151: result: yes
configure:2157: checking whether i686-pc-linux-gnu-gcc accepts -g
configure:2178: i686-pc-linux-gnu-gcc -c -g conftest.c >&5
configure:2184: $? = 0
configure:2188: test -z
|| test ! -s conftest.err
configure:2191: $? = 0
configure:2194: test -s conftest.o
configure:2197: $? = 0
configure:2208: result: yes
configure:2225: checking for i686-pc-linux-gnu-gcc option to accept ANSI C
configure:2295: i686-pc-linux-gnu-gcc -c -O2 -march=athlon-xp -pipe conftest.c >&5
configure:2301: $? = 0
configure:2305: test -z
|| test ! -s conftest.err
configure:2308: $? = 0
configure:2311: test -s conftest.o
configure:2314: $? = 0
configure:2332: result: none needed
configure:2350: i686-pc-linux-gnu-gcc -c -O2 -march=athlon-xp -pipe conftest.c >&5
conftest.c:2: error: expected '=', ',', ';', 'asm' or '__attribute__' before 'me'
configure:2356: $? = 1
configure: failed program was:
| #ifndef __cplusplus
| choke me
| #endif
configure:2499: checking for i686-pc-linux-gnu-g++
configure:2515: found /usr/bin/i686-pc-linux-gnu-g++
configure:2525: result: i686-pc-linux-gnu-g++
configure:2583: checking for C++ compiler version
configure:2586: i686-pc-linux-gnu-g++ --version </dev/null >&5
i686-pc-linux-gnu-g++ (GCC) 4.1.1 (Gentoo 4.1.1)
Copyright (C) 2006 Free Software Foundation, Inc.
This is free software; see the source for copying conditions. There is NO
warranty; not even for MERCHANTABILITY or FITNESS FOR A PARTICULAR PURPOSE.
configure:2589: $? = 0
configure:2591: i686-pc-linux-gnu-g++ -v </dev/null >&5
Using built-in specs.
Target: i686-pc-linux-gnu
Configured with: /var/tmp/portage/gcc-4.1.1/work/gcc-4.1.1/configure --prefix=/usr --bindir=/usr/i686-pc-linux-gnu/gcc-bin/4.1.1 --includedir=/usr/lib/gcc/i686-pc-linux-gnu/4.1.1/include --datadir=/usr/share/gcc-data/i686-pc-linux-gnu/4.1.1 --mandir=/usr/share/gcc-data/i686-pc-linux-gnu/4.1.1/man --infodir=/usr/share/gcc-data/i686-pc-linux-gnu/4.1.1/info --with-gxx-include-dir=/usr/lib/gcc/i686-pc-linux-gnu/4.1.1/include/g++-v4 --host=i686-pc-linux-gnu --build=i686-pc-linux-gnu --disable-altivec --enable-nls --without-included-gettext --with-system-zlib --disable-checking --disable-werror --disable-libunwind-exceptions --disable-multilib --disable-libmudflap --disable-libssp --disable-libgcj --enable-languages=c,c++,fortran --enable-shared --enable-threads=posix --enable-__cxa_atexit --enable-clocale=gnu
Thread model: posix
gcc version 4.1.1 (Gentoo 4.1.1)
configure:2594: $? = 0
configure:2596: i686-pc-linux-gnu-g++ -V </dev/null >&5
i686-pc-linux-gnu-g++: '-V' option must have argument
configure:2599: $? = 1
configure:2602: checking whether we are using the GNU C++ compiler
configure:2626: i686-pc-linux-gnu-g++ -c -O2 -march=athlon-xp -pipe conftest.cc >&5
configure:2632: $? = 0
configure:2636: test -z
|| test ! -s conftest.err
configure:2639: $? = 0
configure:2642: test -s conftest.o
configure:2645: $? = 0
configure:2658: result: yes
configure:2664: checking whether i686-pc-linux-gnu-g++ accepts -g
configure:2685: i686-pc-linux-gnu-g++ -c -g conftest.cc >&5
configure:2691: $? = 0
configure:2695: test -z
|| test ! -s conftest.err
configure:2698: $? = 0
configure:2701: test -s conftest.o
configure:2704: $? = 0
configure:2715: result: yes
configure:2757: i686-pc-linux-gnu-g++ -c -O2 -march=athlon-xp -pipe conftest.cc >&5
configure:2763: $? = 0
configure:2767: test -z
|| test ! -s conftest.err
configure:2770: $? = 0
configure:2773: test -s conftest.o
configure:2776: $? = 0
configure:2802: i686-pc-linux-gnu-g++ -c -O2 -march=athlon-xp -pipe conftest.cc >&5
conftest.cc: In function 'int main()':
conftest.cc:13: error: 'exit' was not declared in this scope
configure:2808: $? = 1
configure: failed program was:
| /* confdefs.h. */
|
| #define PACKAGE_NAME "advance"
| #define PACKAGE_TARNAME "advance"
| #define PACKAGE_VERSION "source"
| #define PACKAGE_STRING "advance source"
| #define PACKAGE_BUGREPORT ""
| /* end confdefs.h. */
|
| int
| main ()
| {
| exit (42);
| ;
| return 0;
| }
configure:2757: i686-pc-linux-gnu-g++ -c -O2 -march=athlon-xp -pipe conftest.cc >&5
configure:2763: $? = 0
configure:2767: test -z
|| test ! -s conftest.err
configure:2770: $? = 0
configure:2773: test -s conftest.o
configure:2776: $? = 0
configure:2802: i686-pc-linux-gnu-g++ -c -O2 -march=athlon-xp -pipe conftest.cc >&5
configure:2808: $? = 0
configure:2812: test -z
|| test ! -s conftest.err
configure:2815: $? = 0
configure:2818: test -s conftest.o
configure:2821: $? = 0
configure:2857: checking for a BSD-compatible install
configure:2912: result: /bin/install -c
configure:2923: checking whether ln -s works
configure:2927: result: yes
configure:2939: checking for i686-pc-linux-gnu-ar
configure:2955: found /usr/bin/i686-pc-linux-gnu-ar
configure:2965: result: i686-pc-linux-gnu-ar
configure:3025: checking for i686-pc-linux-gnu-windres
configure:3054: result: no
configure:3067: checking for windres
configure:3096: result: no
configure:3110: checking for rm
configure:3126: found /bin/rm
configure:3136: result: rm
configure:3150: checking for cp
configure:3166: found /bin/cp
configure:3176: result: cp
configure:3190: checking for mkdir
configure:3206: found /bin/mkdir
configure:3216: result: mkdir
configure:3230: checking for echo
configure:3246: found /bin/echo
configure:3256: result: echo
configure:3270: checking for tar
configure:3286: found /bin/tar
configure:3296: result: tar
configure:3310: checking for gzip
configure:3326: found /bin/gzip
configure:3336: result: gzip
configure:3350: checking for zip
configure:3366: found /usr/bin/zip
configure:3376: result: zip
configure:3725: checking whether byte ordering is bigendian
configure:3752: i686-pc-linux-gnu-gcc -c -O2 -march=athlon-xp -pipe conftest.c >&5
configure:3758: $? = 0
configure:3762: test -z
|| test ! -s conftest.err
configure:3765: $? = 0
configure:3768: test -s conftest.o
configure:3771: $? = 0
configure:3795: i686-pc-linux-gnu-gcc -c -O2 -march=athlon-xp -pipe conftest.c >&5
conftest.c: In function 'main':
conftest.c:19: error: 'not' undeclared (first use in this function)
conftest.c:19: error: (Each undeclared identifier is reported only once
conftest.c:19: error: for each function it appears in.)
conftest.c:19: error: expected ';' before 'big'
configure:3801: $? = 1
configure: failed program was:
| /* confdefs.h. */
|
| #define PACKAGE_NAME "advance"
| #define PACKAGE_TARNAME "advance"
| #define PACKAGE_VERSION "source"
| #define PACKAGE_STRING "advance source"
| #define PACKAGE_BUGREPORT ""
| #ifdef __cplusplus
| extern "C" void std::exit (int) throw (); using std::exit;
| #endif
| /* end confdefs.h. */
| #include <sys/types.h>
| #include <sys/param.h>
|
| int
| main ()
| {
| #if BYTE_ORDER != BIG_ENDIAN
| not big endian
| #endif
|
| ;
| return 0;
| }
configure:3936: result: no
configure:3963: checking how to run the C preprocessor
configure:3998: i686-pc-linux-gnu-gcc -E conftest.c
configure:4004: $? = 0
configure:4036: i686-pc-linux-gnu-gcc -E conftest.c
conftest.c:12:28: error: ac_nonexistent.h: No such file or directory
configure:4042: $? = 1
configure: failed program was:
| /* confdefs.h. */
|
| #define PACKAGE_NAME "advance"
| #define PACKAGE_TARNAME "advance"
| #define PACKAGE_VERSION "source"
| #define PACKAGE_STRING "advance source"
| #define PACKAGE_BUGREPORT ""
| #ifdef __cplusplus
| extern "C" void std::exit (int) throw (); using std::exit;
| #endif
| /* end confdefs.h. */
| #include <ac_nonexistent.h>
configure:4081: result: i686-pc-linux-gnu-gcc -E
configure:4105: i686-pc-linux-gnu-gcc -E conftest.c
configure:4111: $? = 0
configure:4143: i686-pc-linux-gnu-gcc -E conftest.c
conftest.c:12:28: error: ac_nonexistent.h: No such file or directory
configure:4149: $? = 1
configure: failed program was:
| /* confdefs.h. */
|
| #define PACKAGE_NAME "advance"
| #define PACKAGE_TARNAME "advance"
| #define PACKAGE_VERSION "source"
| #define PACKAGE_STRING "advance source"
| #define PACKAGE_BUGREPORT ""
| #ifdef __cplusplus
| extern "C" void std::exit (int) throw (); using std::exit;
| #endif
| /* end confdefs.h. */
| #include <ac_nonexistent.h>
configure:4193: checking for egrep
configure:4203: result: grep -E
configure:4208: checking for ANSI C header files
configure:4233: i686-pc-linux-gnu-gcc -c -O2 -march=athlon-xp -pipe conftest.c >&5
configure:4239: $? = 0
configure:4243: test -z
|| test ! -s conftest.err
configure:4246: $? = 0
configure:4249: test -s conftest.o
configure:4252: $? = 0
configure:4341: i686-pc-linux-gnu-gcc -o conftest -O2 -march=athlon-xp -pipe conftest.c >&5
conftest.c: In function 'main':
conftest.c:29: warning: incompatible implicit declaration of built-in function 'exit'
configure:4344: $? = 0
configure:4346: ./conftest
configure:4349: $? = 0
configure:4364: result: yes
configure:4388: checking for sys/types.h
configure:4404: i686-pc-linux-gnu-gcc -c -O2 -march=athlon-xp -pipe conftest.c >&5
configure:4410: $? = 0
configure:4414: test -z
|| test ! -s conftest.err
configure:4417: $? = 0
configure:4420: test -s conftest.o
configure:4423: $? = 0
configure:4434: result: yes
configure:4388: checking for sys/stat.h
configure:4404: i686-pc-linux-gnu-gcc -c -O2 -march=athlon-xp -pipe conftest.c >&5
configure:4410: $? = 0
configure:4414: test -z
|| test ! -s conftest.err
configure:4417: $? = 0
configure:4420: test -s conftest.o
configure:4423: $? = 0
configure:4434: result: yes
configure:4388: checking for stdlib.h
configure:4404: i686-pc-linux-gnu-gcc -c -O2 -march=athlon-xp -pipe conftest.c >&5
configure:4410: $? = 0
configure:4414: test -z
|| test ! -s conftest.err
configure:4417: $? = 0
configure:4420: test -s conftest.o
configure:4423: $? = 0
configure:4434: result: yes
configure:4388: checking for string.h
configure:4404: i686-pc-linux-gnu-gcc -c -O2 -march=athlon-xp -pipe conftest.c >&5
configure:4410: $? = 0
configure:4414: test -z
|| test ! -s conftest.err
configure:4417: $? = 0
configure:4420: test -s conftest.o
configure:4423: $? = 0
configure:4434: result: yes
configure:4388: checking for memory.h
configure:4404: i686-pc-linux-gnu-gcc -c -O2 -march=athlon-xp -pipe conftest.c >&5
configure:4410: $? = 0
configure:4414: test -z
|| test ! -s conftest.err
configure:4417: $? = 0
configure:4420: test -s conftest.o
configure:4423: $? = 0
configure:4434: result: yes
configure:4388: checking for strings.h
configure:4404: i686-pc-linux-gnu-gcc -c -O2 -march=athlon-xp -pipe conftest.c >&5
configure:4410: $? = 0
configure:4414: test -z
|| test ! -s conftest.err
configure:4417: $? = 0
configure:4420: test -s conftest.o
configure:4423: $? = 0
configure:4434: result: yes
configure:4388: checking for inttypes.h
configure:4404: i686-pc-linux-gnu-gcc -c -O2 -march=athlon-xp -pipe conftest.c >&5
configure:4410: $? = 0
configure:4414: test -z
|| test ! -s conftest.err
configure:4417: $? = 0
configure:4420: test -s conftest.o
configure:4423: $? = 0
configure:4434: result: yes
configure:4388: checking for stdint.h
configure:4404: i686-pc-linux-gnu-gcc -c -O2 -march=athlon-xp -pipe conftest.c >&5
configure:4410: $? = 0
configure:4414: test -z
|| test ! -s conftest.err
configure:4417: $? = 0
configure:4420: test -s conftest.o
configure:4423: $? = 0
configure:4434: result: yes
configure:4388: checking for unistd.h
configure:4404: i686-pc-linux-gnu-gcc -c -O2 -march=athlon-xp -pipe conftest.c >&5
configure:4410: $? = 0
configure:4414: test -z
|| test ! -s conftest.err
configure:4417: $? = 0
configure:4420: test -s conftest.o
configure:4423: $? = 0
configure:4434: result: yes
configure:4446: checking for char
configure:4470: i686-pc-linux-gnu-gcc -c -O2 -march=athlon-xp -pipe conftest.c >&5
configure:4476: $? = 0
configure:4480: test -z
|| test ! -s conftest.err
configure:4483: $? = 0
configure:4486: test -s conftest.o
configure:4489: $? = 0
configure:4500: result: yes
configure:4503: checking size of char
configure:4822: i686-pc-linux-gnu-gcc -o conftest -O2 -march=athlon-xp -pipe conftest.c >&5
configure:4825: $? = 0
configure:4827: ./conftest
configure:4830: $? = 0
configure:4853: result: 1
configure:4860: checking for short
configure:4884: i686-pc-linux-gnu-gcc -c -O2 -march=athlon-xp -pipe conftest.c >&5
configure:4890: $? = 0
configure:4894: test -z
|| test ! -s conftest.err
configure:4897: $? = 0
configure:4900: test -s conftest.o
configure:4903: $? = 0
configure:4914: result: yes
configure:4917: checking size of short
configure:5236: i686-pc-linux-gnu-gcc -o conftest -O2 -march=athlon-xp -pipe conftest.c >&5
configure:5239: $? = 0
configure:5241: ./conftest
configure:5244: $? = 0
configure:5267: result: 2
configure:5274: checking for int
configure:5298: i686-pc-linux-gnu-gcc -c -O2 -march=athlon-xp -pipe conftest.c >&5
configure:5304: $? = 0
configure:5308: test -z
|| test ! -s conftest.err
configure:5311: $? = 0
configure:5314: test -s conftest.o
configure:5317: $? = 0
configure:5328: result: yes
configure:5331: checking size of int
configure:5650: i686-pc-linux-gnu-gcc -o conftest -O2 -march=athlon-xp -pipe conftest.c >&5
configure:5653: $? = 0
configure:5655: ./conftest
configure:5658: $? = 0
configure:5681: result: 4
configure:5688: checking for long
configure:5712: i686-pc-linux-gnu-gcc -c -O2 -march=athlon-xp -pipe conftest.c >&5
configure:5718: $? = 0
configure:5722: test -z
|| test ! -s conftest.err
configure:5725: $? = 0
configure:5728: test -s conftest.o
configure:5731: $? = 0
configure:5742: result: yes
configure:5745: checking size of long
configure:6064: i686-pc-linux-gnu-gcc -o conftest -O2 -march=athlon-xp -pipe conftest.c >&5
configure:6067: $? = 0
configure:6069: ./conftest
configure:6072: $? = 0
configure:6095: result: 4
configure:6102: checking for long long
configure:6126: i686-pc-linux-gnu-gcc -c -O2 -march=athlon-xp -pipe conftest.c >&5
configure:6132: $? = 0
configure:6136: test -z
|| test ! -s conftest.err
configure:6139: $? = 0
configure:6142: test -s conftest.o
configure:6145: $? = 0
configure:6156: result: yes
configure:6159: checking size of long long
configure:6478: i686-pc-linux-gnu-gcc -o conftest -O2 -march=athlon-xp -pipe conftest.c >&5
configure:6481: $? = 0
configure:6483: ./conftest
configure:6486: $? = 0
configure:6509: result: 8
configure:6516: checking for void*
configure:6540: i686-pc-linux-gnu-gcc -c -O2 -march=athlon-xp -pipe conftest.c >&5
configure:6546: $? = 0
configure:6550: test -z
|| test ! -s conftest.err
configure:6553: $? = 0
configure:6556: test -s conftest.o
configure:6559: $? = 0
configure:6570: result: yes
configure:6573: checking size of void*
configure:6892: i686-pc-linux-gnu-gcc -o conftest -O2 -march=athlon-xp -pipe conftest.c >&5
configure:6895: $? = 0
configure:6897: ./conftest
configure:6900: $? = 0
configure:6923: result: 4
configure:7047: checking for i686-pc-linux-gnu-nasm
configure:7063: found /var/tmp/portage/advancemame-0.106.0/temp/i686-pc-linux-gnu-nasm
configure:7073: result: i686-pc-linux-gnu-nasm
configure:7195: checking for ANSI C header files
configure:7351: result: yes
configure:7361: checking for sys/wait.h that is POSIX.1 compatible
configure:7392: i686-pc-linux-gnu-gcc -c -O2 -march=athlon-xp -pipe conftest.c >&5
configure:7398: $? = 0
configure:7402: test -z
|| test ! -s conftest.err
configure:7405: $? = 0
configure:7408: test -s conftest.o
configure:7411: $? = 0
configure:7422: result: yes
configure:7440: checking for dirent.h that defines DIR
configure:7464: i686-pc-linux-gnu-gcc -c -O2 -march=athlon-xp -pipe conftest.c >&5
configure:7470: $? = 0
configure:7474: test -z
|| test ! -s conftest.err
configure:7477: $? = 0
configure:7480: test -s conftest.o
configure:7483: $? = 0
configure:7494: result: yes
configure:7507: checking for library containing opendir
configure:7537: i686-pc-linux-gnu-gcc -o conftest -O2 -march=athlon-xp -pipe conftest.c >&5
configure:7543: $? = 0
configure:7547: test -z
|| test ! -s conftest.err
configure:7550: $? = 0
configure:7553: test -s conftest
configure:7556: $? = 0
configure:7626: result: none required
configure:7762: checking whether time.h and sys/time.h may both be included
configure:7787: i686-pc-linux-gnu-gcc -c -O2 -march=athlon-xp -pipe conftest.c >&5
configure:7793: $? = 0
configure:7797: test -z
|| test ! -s conftest.err
configure:7800: $? = 0
configure:7803: test -s conftest.o
configure:7806: $? = 0
configure:7817: result: yes
configure:7827: checking whether termios.h defines TIOCGWINSZ
configure:7854: result: no
configure:7858: checking whether sys/ioctl.h defines TIOCGWINSZ
configure:7885: result: yes
configure:7906: checking for unistd.h
configure:7911: result: yes
configure:7915: checking sched.h usability
configure:7927: i686-pc-linux-gnu-gcc -c -O2 -march=athlon-xp -pipe conftest.c >&5
configure:7933: $? = 0
configure:7937: test -z
|| test ! -s conftest.err
configure:7940: $? = 0
configure:7943: test -s conftest.o
configure:7946: $? = 0
configure:7956: result: yes
configure:7960: checking sched.h presence
configure:7970: i686-pc-linux-gnu-gcc -E conftest.c
configure:7976: $? = 0
configure:7996: result: yes
configure:8031: checking for sched.h
configure:8038: result: yes
configure:7915: checking netdb.h usability
configure:7927: i686-pc-linux-gnu-gcc -c -O2 -march=athlon-xp -pipe conftest.c >&5
configure:7933: $? = 0
configure:7937: test -z
|| test ! -s conftest.err
configure:7940: $? = 0
configure:7943: test -s conftest.o
configure:7946: $? = 0
configure:7956: result: yes
configure:7960: checking netdb.h presence
configure:7970: i686-pc-linux-gnu-gcc -E conftest.c
configure:7976: $? = 0
configure:7996: result: yes
configure:8031: checking for netdb.h
configure:8038: result: yes
configure:7915: checking termios.h usability
configure:7927: i686-pc-linux-gnu-gcc -c -O2 -march=athlon-xp -pipe conftest.c >&5
configure:7933: $? = 0
configure:7937: test -z
|| test ! -s conftest.err
configure:7940: $? = 0
configure:7943: test -s conftest.o
configure:7946: $? = 0
configure:7956: result: yes
configure:7960: checking termios.h presence
configure:7970: i686-pc-linux-gnu-gcc -E conftest.c
configure:7976: $? = 0
configure:7996: result: yes
configure:8031: checking for termios.h
configure:8038: result: yes
configure:7915: checking execinfo.h usability
configure:7927: i686-pc-linux-gnu-gcc -c -O2 -march=athlon-xp -pipe conftest.c >&5
configure:7933: $? = 0
configure:7937: test -z
|| test ! -s conftest.err
configure:7940: $? = 0
configure:7943: test -s conftest.o
configure:7946: $? = 0
configure:7956: result: yes
configure:7960: checking execinfo.h presence
configure:7970: i686-pc-linux-gnu-gcc -E conftest.c
configure:7976: $? = 0
configure:7996: result: yes
configure:8031: checking for execinfo.h
configure:8038: result: yes
configure:8075: checking sys/utsname.h usability
configure:8087: i686-pc-linux-gnu-gcc -c -O2 -march=athlon-xp -pipe conftest.c >&5
configure:8093: $? = 0
configure:8097: test -z
|| test ! -s conftest.err
configure:8100: $? = 0
configure:8103: test -s conftest.o
configure:8106: $? = 0
configure:8116: result: yes
configure:8120: checking sys/utsname.h presence
configure:8130: i686-pc-linux-gnu-gcc -E conftest.c
configure:8136: $? = 0
configure:8156: result: yes
configure:8191: checking for sys/utsname.h
configure:8198: result: yes
configure:8066: checking for sys/types.h
configure:8071: result: yes
configure:8066: checking for sys/stat.h
configure:8071: result: yes
configure:8075: checking sys/socket.h usability
configure:8087: i686-pc-linux-gnu-gcc -c -O2 -march=athlon-xp -pipe conftest.c >&5
configure:8093: $? = 0
configure:8097: test -z
|| test ! -s conftest.err
configure:8100: $? = 0
configure:8103: test -s conftest.o
configure:8106: $? = 0
configure:8116: result: yes
configure:8120: checking sys/socket.h presence
configure:8130: i686-pc-linux-gnu-gcc -E conftest.c
configure:8136: $? = 0
configure:8156: result: yes
configure:8191: checking for sys/socket.h
configure:8198: result: yes
configure:8075: checking sys/select.h usability
configure:8087: i686-pc-linux-gnu-gcc -c -O2 -march=athlon-xp -pipe conftest.c >&5
configure:8093: $? = 0
configure:8097: test -z
|| test ! -s conftest.err
configure:8100: $? = 0
configure:8103: test -s conftest.o
configure:8106: $? = 0
configure:8116: result: yes
configure:8120: checking sys/select.h presence
configure:8130: i686-pc-linux-gnu-gcc -E conftest.c
configure:8136: $? = 0
configure:8156: result: yes
configure:8191: checking for sys/select.h
configure:8198: result: yes
configure:8075: checking sys/ioctl.h usability
configure:8087: i686-pc-linux-gnu-gcc -c -O2 -march=athlon-xp -pipe conftest.c >&5
configure:8093: $? = 0
configure:8097: test -z
|| test ! -s conftest.err
configure:8100: $? = 0
configure:8103: test -s conftest.o
configure:8106: $? = 0
configure:8116: result: yes
configure:8120: checking sys/ioctl.h presence
configure:8130: i686-pc-linux-gnu-gcc -E conftest.c
configure:8136: $? = 0
configure:8156: result: yes
configure:8191: checking for sys/ioctl.h
configure:8198: result: yes
configure:8075: checking sys/time.h usability
configure:8087: i686-pc-linux-gnu-gcc -c -O2 -march=athlon-xp -pipe conftest.c >&5
configure:8093: $? = 0
configure:8097: test -z
|| test ! -s conftest.err
configure:8100: $? = 0
configure:8103: test -s conftest.o
configure:8106: $? = 0
configure:8116: result: yes
configure:8120: checking sys/time.h presence
configure:8130: i686-pc-linux-gnu-gcc -E conftest.c
configure:8136: $? = 0
configure:8156: result: yes
configure:8191: checking for sys/time.h
configure:8198: result: yes
configure:8075: checking sys/mman.h usability
configure:8087: i686-pc-linux-gnu-gcc -c -O2 -march=athlon-xp -pipe conftest.c >&5
configure:8093: $? = 0
configure:8097: test -z
|| test ! -s conftest.err
configure:8100: $? = 0
configure:8103: test -s conftest.o
configure:8106: $? = 0
configure:8116: result: yes
configure:8120: checking sys/mman.h presence
configure:8130: i686-pc-linux-gnu-gcc -E conftest.c
configure:8136: $? = 0
configure:8156: result: yes
configure:8191: checking for sys/mman.h
configure:8198: result: yes
configure:8075: checking sys/io.h usability
configure:8087: i686-pc-linux-gnu-gcc -c -O2 -march=athlon-xp -pipe conftest.c >&5
configure:8093: $? = 0
configure:8097: test -z
|| test ! -s conftest.err
configure:8100: $? = 0
configure:8103: test -s conftest.o
configure:8106: $? = 0
configure:8116: result: yes
configure:8120: checking sys/io.h presence
configure:8130: i686-pc-linux-gnu-gcc -E conftest.c
configure:8136: $? = 0
configure:8156: result: yes
configure:8191: checking for sys/io.h
configure:8198: result: yes
configure:8075: checking sys/kd.h usability
configure:8087: i686-pc-linux-gnu-gcc -c -O2 -march=athlon-xp -pipe conftest.c >&5
configure:8093: $? = 0
configure:8097: test -z
|| test ! -s conftest.err
configure:8100: $? = 0
configure:8103: test -s conftest.o
configure:8106: $? = 0
configure:8116: result: yes
configure:8120: checking sys/kd.h presence
configure:8130: i686-pc-linux-gnu-gcc -E conftest.c
configure:8136: $? = 0
configure:8156: result: yes
configure:8191: checking for sys/kd.h
configure:8198: result: yes
configure:8075: checking sys/vt.h usability
configure:8087: i686-pc-linux-gnu-gcc -c -O2 -march=athlon-xp -pipe conftest.c >&5
configure:8093: $? = 0
configure:8097: test -z
|| test ! -s conftest.err
configure:8100: $? = 0
configure:8103: test -s conftest.o
configure:8106: $? = 0
configure:8116: result: yes
configure:8120: checking sys/vt.h presence
configure:8130: i686-pc-linux-gnu-gcc -E conftest.c
configure:8136: $? = 0
configure:8156: result: yes
configure:8191: checking for sys/vt.h
configure:8198: result: yes
configure:8226: checking netinet/in.h usability
configure:8238: i686-pc-linux-gnu-gcc -c -O2 -march=athlon-xp -pipe conftest.c >&5
configure:8244: $? = 0
configure:8248: test -z
|| test ! -s conftest.err
configure:8251: $? = 0
configure:8254: test -s conftest.o
configure:8257: $? = 0
configure:8267: result: yes
configure:8271: checking netinet/in.h presence
configure:8281: i686-pc-linux-gnu-gcc -E conftest.c
configure:8287: $? = 0
configure:8307: result: yes
configure:8342: checking for netinet/in.h
configure:8349: result: yes
configure:8226: checking ucontext.h usability
configure:8238: i686-pc-linux-gnu-gcc -c -O2 -march=athlon-xp -pipe conftest.c >&5
configure:8244: $? = 0
configure:8248: test -z
|| test ! -s conftest.err
configure:8251: $? = 0
configure:8254: test -s conftest.o
configure:8257: $? = 0
configure:8267: result: yes
configure:8271: checking ucontext.h presence
configure:8281: i686-pc-linux-gnu-gcc -E conftest.c
configure:8287: $? = 0
configure:8307: result: yes
configure:8342: checking for ucontext.h
configure:8349: result: yes
configure:8362: checking for an ANSI C-conforming const
configure:8429: i686-pc-linux-gnu-gcc -c -O2 -march=athlon-xp -pipe conftest.c >&5
configure:8435: $? = 0
configure:8439: test -z
|| test ! -s conftest.err
configure:8442: $? = 0
configure:8445: test -s conftest.o
configure:8448: $? = 0
configure:8459: result: yes
configure:8469: checking for C/C++ restrict keyword
configure:8487: i686-pc-linux-gnu-gcc -c -O2 -march=athlon-xp -pipe conftest.c >&5
conftest.c:51: error: expected '=', ',', ';', 'asm' or '__attribute__' before 'x'
configure:8493: $? = 1
configure: failed program was:
| /* confdefs.h. */
|
| #define PACKAGE_NAME "advance"
| #define PACKAGE_TARNAME "advance"
| #define PACKAGE_VERSION "source"
| #define PACKAGE_STRING "advance source"
| #define PACKAGE_BUGREPORT ""
| #ifdef __cplusplus
| extern "C" void std::exit (int) throw (); using std::exit;
| #endif
| #define STDC_HEADERS 1
| #define HAVE_SYS_TYPES_H 1
| #define HAVE_SYS_STAT_H 1
| #define HAVE_STDLIB_H 1
| #define HAVE_STRING_H 1
| #define HAVE_MEMORY_H 1
| #define HAVE_STRINGS_H 1
| #define HAVE_INTTYPES_H 1
| #define HAVE_STDINT_H 1
| #define HAVE_UNISTD_H 1
| #define SIZEOF_CHAR 1
| #define SIZEOF_SHORT 2
| #define SIZEOF_INT 4
| #define SIZEOF_LONG 4
| #define SIZEOF_LONG_LONG 8
| #define SIZEOF_VOIDP 4
| #define STDC_HEADERS 1
| #define HAVE_SYS_WAIT_H 1
| #define HAVE_DIRENT_H 1
| #define TIME_WITH_SYS_TIME 1
| #define GWINSZ_IN_SYS_IOCTL 1
| #define HAVE_UNISTD_H 1
| #define HAVE_SCHED_H 1
| #define HAVE_NETDB_H 1
| #define HAVE_TERMIOS_H 1
| #define HAVE_EXECINFO_H 1
| #define HAVE_SYS_UTSNAME_H 1
| #define HAVE_SYS_TYPES_H 1
| #define HAVE_SYS_STAT_H 1
| #define HAVE_SYS_SOCKET_H 1
| #define HAVE_SYS_SELECT_H 1
| #define HAVE_SYS_IOCTL_H 1
| #define HAVE_SYS_TIME_H 1
| #define HAVE_SYS_MMAN_H 1
| #define HAVE_SYS_IO_H 1
| #define HAVE_SYS_KD_H 1
| #define HAVE_SYS_VT_H 1
| #define HAVE_NETINET_IN_H 1
| #define HAVE_UCONTEXT_H 1
| /* end confdefs.h. */
| float * restrict x;
configure:8487: i686-pc-linux-gnu-gcc -c -O2 -march=athlon-xp -pipe conftest.c >&5
configure:8493: $? = 0
configure:8497: test -z
|| test ! -s conftest.err
configure:8500: $? = 0
configure:8503: test -s conftest.o
configure:8506: $? = 0
configure:8518: result: __restrict
configure:8533: checking for inline
configure:8554: i686-pc-linux-gnu-gcc -c -O2 -march=athlon-xp -pipe conftest.c >&5
configure:8560: $? = 0
configure:8564: test -z
|| test ! -s conftest.err
configure:8567: $? = 0
configure:8570: test -s conftest.o
configure:8573: $? = 0
configure:8585: result: inline
configure:8606: checking for working alloca.h
configure:8627: i686-pc-linux-gnu-gcc -o conftest -O2 -march=athlon-xp -pipe conftest.c >&5
configure:8633: $? = 0
configure:8637: test -z
|| test ! -s conftest.err
configure:8640: $? = 0
configure:8643: test -s conftest
configure:8646: $? = 0
configure:8658: result: yes
configure:8668: checking for alloca
configure:8709: i686-pc-linux-gnu-gcc -o conftest -O2 -march=athlon-xp -pipe conftest.c >&5
configure:8715: $? = 0
configure:8719: test -z
|| test ! -s conftest.err
configure:8722: $? = 0
configure:8725: test -s conftest
configure:8728: $? = 0
configure:8740: result: yes
configure:8969: checking for stdlib.h
configure:8974: result: yes
configure:8969: checking for unistd.h
configure:8974: result: yes
configure:9118: checking for getpagesize
configure:9175: i686-pc-linux-gnu-gcc -o conftest -O2 -march=athlon-xp -pipe conftest.c >&5
configure:9181: $? = 0
configure:9185: test -z
|| test ! -s conftest.err
configure:9188: $? = 0
configure:9191: test -s conftest
configure:9194: $? = 0
configure:9206: result: yes
configure:9216: checking for working mmap
configure:9358: i686-pc-linux-gnu-gcc -o conftest -O2 -march=athlon-xp -pipe conftest.c >&5
configure:9361: $? = 0
configure:9363: ./conftest
configure:9366: $? = 0
configure:9380: result: yes
configure:9397: checking for sys/select.h
configure:9402: result: yes
configure:9397: checking for sys/socket.h
configure:9402: result: yes
configure:9542: checking types of arguments for select
configure:9575: i686-pc-linux-gnu-gcc -c -O2 -march=athlon-xp -pipe conftest.c >&5
configure:9581: $? = 0
configure:9585: test -z
|| test ! -s conftest.err
configure:9588: $? = 0
configure:9591: test -s conftest.o
configure:9594: $? = 0
configure:9610: result: int,fd_set *,struct timeval *
configure:9637: checking for vprintf
configure:9694: i686-pc-linux-gnu-gcc -o conftest -O2 -march=athlon-xp -pipe conftest.c >&5
conftest.c:87: warning: conflicting types for built-in function 'vprintf'
configure:9700: $? = 0
configure:9704: test -z
|| test ! -s conftest.err
configure:9707: $? = 0
configure:9710: test -s conftest
configure:9713: $? = 0
configure:9725: result: yes
configure:9732: checking for _doprnt
configure:9789: i686-pc-linux-gnu-gcc -o conftest -O2 -march=athlon-xp -pipe conftest.c >&5
/var/tmp/portage/advancemame-0.106.0/temp/ccObsPKO.o: In function `main':
conftest.c:(.text+0x16): undefined reference to `_doprnt'
/var/tmp/portage/advancemame-0.106.0/temp/ccObsPKO.o:(.data+0x0): undefined reference to `_doprnt'
collect2: ld returned 1 exit status
configure:9795: $? = 1
configure: failed program was:
| /* confdefs.h. */
|
| #define PACKAGE_NAME "advance"
| #define PACKAGE_TARNAME "advance"
| #define PACKAGE_VERSION "source"
| #define PACKAGE_STRING "advance source"
| #define PACKAGE_BUGREPORT ""
| #ifdef __cplusplus
| extern "C" void std::exit (int) throw (); using std::exit;
| #endif
| #define STDC_HEADERS 1
| #define HAVE_SYS_TYPES_H 1
| #define HAVE_SYS_STAT_H 1
| #define HAVE_STDLIB_H 1
| #define HAVE_STRING_H 1
| #define HAVE_MEMORY_H 1
| #define HAVE_STRINGS_H 1
| #define HAVE_INTTYPES_H 1
| #define HAVE_STDINT_H 1
| #define HAVE_UNISTD_H 1
| #define SIZEOF_CHAR 1
| #define SIZEOF_SHORT 2
| #define SIZEOF_INT 4
| #define SIZEOF_LONG 4
| #define SIZEOF_LONG_LONG 8
| #define SIZEOF_VOIDP 4
| #define STDC_HEADERS 1
| #define HAVE_SYS_WAIT_H 1
| #define HAVE_DIRENT_H 1
| #define TIME_WITH_SYS_TIME 1
| #define GWINSZ_IN_SYS_IOCTL 1
| #define HAVE_UNISTD_H 1
| #define HAVE_SCHED_H 1
| #define HAVE_NETDB_H 1
| #define HAVE_TERMIOS_H 1
| #define HAVE_EXECINFO_H 1
| #define HAVE_SYS_UTSNAME_H 1
| #define HAVE_SYS_TYPES_H 1
| #define HAVE_SYS_STAT_H 1
| #define HAVE_SYS_SOCKET_H 1
| #define HAVE_SYS_SELECT_H 1
| #define HAVE_SYS_IOCTL_H 1
| #define HAVE_SYS_TIME_H 1
| #define HAVE_SYS_MMAN_H 1
| #define HAVE_SYS_IO_H 1
| #define HAVE_SYS_KD_H 1
| #define HAVE_SYS_VT_H 1
| #define HAVE_NETINET_IN_H 1
| #define HAVE_UCONTEXT_H 1
| #define restrict __restrict
| #define HAVE_ALLOCA_H 1
| #define HAVE_ALLOCA 1
| #define HAVE_STDLIB_H 1
| #define HAVE_UNISTD_H 1
| #define HAVE_GETPAGESIZE 1
| #define HAVE_MMAP 1
| #define HAVE_SYS_SELECT_H 1
| #define HAVE_SYS_SOCKET_H 1
| #define SELECT_TYPE_ARG1 int
| #define SELECT_TYPE_ARG234 (fd_set *)
| #define SELECT_TYPE_ARG5 (struct timeval *)
| #define HAVE_VPRINTF 1
| /* end confdefs.h. */
| /* Define _doprnt to an innocuous variant, in case <limits.h> declares _doprnt.
| For example, HP-UX 11i <limits.h> declares gettimeofday. */
| #define _doprnt innocuous__doprnt
|
| /* System header to define __stub macros and hopefully few prototypes,
| which can conflict with char _doprnt (); below.
| Prefer <limits.h> to <assert.h> if __STDC__ is defined, since
| <limits.h> exists even on freestanding compilers. */
|
| #ifdef __STDC__
| # include <limits.h>
| #else
| # include <assert.h>
| #endif
|
| #undef _doprnt
|
| /* Override any gcc2 internal prototype to avoid an error. */
| #ifdef __cplusplus
| extern "C"
| {
| #endif
| /* We use char because int might match the return type of a gcc2
| builtin and then its argument prototype would still apply. */
| char _doprnt ();
| /* The GNU C library defines this for functions which it implements
| to always fail with ENOSYS. Some functions are actually named
| something starting with __ and the normal name is an alias. */
| #if defined (__stub__doprnt) || defined (__stub____doprnt)
| choke me
| #else
| char (*f) () = _doprnt;
| #endif
| #ifdef __cplusplus
| }
| #endif
|
| int
| main ()
| {
| return f != _doprnt;
| ;
| return 0;
| }
configure:9820: result: no
configure:9839: checking for strcasecmp
configure:9896: i686-pc-linux-gnu-gcc -o conftest -O2 -march=athlon-xp -pipe conftest.c >&5
conftest.c:88: warning: conflicting types for built-in function 'strcasecmp'
configure:9902: $? = 0
configure:9906: test -z
|| test ! -s conftest.err
configure:9909: $? = 0
configure:9912: test -s conftest
configure:9915: $? = 0
configure:9927: result: yes
configure:9839: checking for strerror
configure:9896: i686-pc-linux-gnu-gcc -o conftest -O2 -march=athlon-xp -pipe conftest.c >&5
configure:9902: $? = 0
configure:9906: test -z
|| test ! -s conftest.err
configure:9909: $? = 0
configure:9912: test -s conftest
configure:9915: $? = 0
configure:9927: result: yes
configure:9944: checking for uname
configure:10001: i686-pc-linux-gnu-gcc -o conftest -O2 -march=athlon-xp -pipe conftest.c >&5
configure:10007: $? = 0
configure:10011: test -z
|| test ! -s conftest.err
configure:10014: $? = 0
configure:10017: test -s conftest
configure:10020: $? = 0
configure:10032: result: yes
configure:9944: checking for sysconf
configure:10001: i686-pc-linux-gnu-gcc -o conftest -O2 -march=athlon-xp -pipe conftest.c >&5
configure:10007: $? = 0
configure:10011: test -z
|| test ! -s conftest.err
configure:10014: $? = 0
configure:10017: test -s conftest
configure:10020: $? = 0
configure:10032: result: yes
configure:9944: checking for backtrace
configure:10001: i686-pc-linux-gnu-gcc -o conftest -O2 -march=athlon-xp -pipe conftest.c >&5
configure:10007: $? = 0
configure:10011: test -z
|| test ! -s conftest.err
configure:10014: $? = 0
configure:10017: test -s conftest
configure:10020: $? = 0
configure:10032: result: yes
configure:9944: checking for backtrace_symbols
configure:10001: i686-pc-linux-gnu-gcc -o conftest -O2 -march=athlon-xp -pipe conftest.c >&5
configure:10007: $? = 0
configure:10011: test -z
|| test ! -s conftest.err
configure:10014: $? = 0
configure:10017: test -s conftest
configure:10020: $? = 0
configure:10032: result: yes
configure:10051: checking for flockfile
configure:10108: i686-pc-linux-gnu-gcc -o conftest -O2 -march=athlon-xp -pipe conftest.c >&5
configure:10114: $? = 0
configure:10118: test -z
|| test ! -s conftest.err
configure:10121: $? = 0
configure:10124: test -s conftest
configure:10127: $? = 0
configure:10139: result: yes
configure:10051: checking for funlockfile
configure:10108: i686-pc-linux-gnu-gcc -o conftest -O2 -march=athlon-xp -pipe conftest.c >&5
configure:10114: $? = 0
configure:10118: test -z
|| test ! -s conftest.err
configure:10121: $? = 0
configure:10124: test -s conftest
configure:10127: $? = 0
configure:10139: result: yes
configure:10051: checking for fread_unlocked
configure:10108: i686-pc-linux-gnu-gcc -o conftest -O2 -march=athlon-xp -pipe conftest.c >&5
configure:10114: $? = 0
configure:10118: test -z
|| test ! -s conftest.err
configure:10121: $? = 0
configure:10124: test -s conftest
configure:10127: $? = 0
configure:10139: result: yes
configure:10051: checking for fwrite_unlocked
configure:10108: i686-pc-linux-gnu-gcc -o conftest -O2 -march=athlon-xp -pipe conftest.c >&5
conftest.c:97: warning: conflicting types for built-in function 'fwrite_unlocked'
configure:10114: $? = 0
configure:10118: test -z
|| test ! -s conftest.err
configure:10121: $? = 0
configure:10124: test -s conftest
configure:10127: $? = 0
configure:10139: result: yes
configure:10051: checking for fgetc_unlocked
configure:10108: i686-pc-linux-gnu-gcc -o conftest -O2 -march=athlon-xp -pipe conftest.c >&5
configure:10114: $? = 0
configure:10118: test -z
|| test ! -s conftest.err
configure:10121: $? = 0
configure:10124: test -s conftest
configure:10127: $? = 0
configure:10139: result: yes
configure:10051: checking for feof_unlocked
configure:10108: i686-pc-linux-gnu-gcc -o conftest -O2 -march=athlon-xp -pipe conftest.c >&5
configure:10114: $? = 0
configure:10118: test -z
|| test ! -s conftest.err
configure:10121: $? = 0
configure:10124: test -s conftest
configure:10127: $? = 0
configure:10139: result: yes
configure:10154: checking for iopl
configure:10211: i686-pc-linux-gnu-gcc -o conftest -O2 -march=athlon-xp -pipe conftest.c >&5
configure:10217: $? = 0
configure:10221: test -z
|| test ! -s conftest.err
configure:10224: $? = 0
configure:10227: test -s conftest
configure:10230: $? = 0
configure:10242: result: yes
configure:10154: checking for mprotect
configure:10211: i686-pc-linux-gnu-gcc -o conftest -O2 -march=athlon-xp -pipe conftest.c >&5
configure:10217: $? = 0
configure:10221: test -z
|| test ! -s conftest.err
configure:10224: $? = 0
configure:10227: test -s conftest
configure:10230: $? = 0
configure:10242: result: yes
configure:10252: checking for port in/out
configure:10274: i686-pc-linux-gnu-gcc -o conftest -O2 -march=athlon-xp -pipe conftest.c >&5
configure:10280: $? = 0
configure:10284: test -z
|| test ! -s conftest.err
configure:10287: $? = 0
configure:10290: test -s conftest
configure:10293: $? = 0
configure:10304: result: yes
configure:11076: checking for snd_pcm_open in -lasound
configure:11107: i686-pc-linux-gnu-gcc -o conftest -O2 -march=athlon-xp -pipe conftest.c -lasound -lm
>&5
configure:11113: $? = 0
configure:11117: test -z
|| test ! -s conftest.err
configure:11120: $? = 0
configure:11123: test -s conftest
configure:11126: $? = 0
configure:11139: result: yes
configure:11154: checking for ALSA version
configure:11178: i686-pc-linux-gnu-gcc -c -O2 -march=athlon-xp -pipe conftest.c >&5
configure:11184: $? = 0
configure:11188: test -z
|| test ! -s conftest.err
configure:11191: $? = 0
configure:11194: test -s conftest.o
configure:11197: $? = 0
configure:11209: result: yes
configure:11356: checking for pthread_create in -lpthread
configure:11387: i686-pc-linux-gnu-gcc -o conftest -O2 -march=athlon-xp -pipe conftest.c -lpthread
-lasound >&5
configure:11393: $? = 0
configure:11397: test -z
|| test ! -s conftest.err
configure:11400: $? = 0
configure:11403: test -s conftest
configure:11406: $? = 0
configure:11419: result: yes
configure:11844: checking for endwin in -lncurses
configure:11875: i686-pc-linux-gnu-gcc -o conftest -O2 -march=athlon-xp -pipe conftest.c -lncurses
-lasound >&5
configure:11881: $? = 0
configure:11885: test -z
|| test ! -s conftest.err
configure:11888: $? = 0
configure:11891: test -s conftest
configure:11894: $? = 0
configure:11907: result: yes
configure:12659: checking for raw keyboard interface
configure:12686: i686-pc-linux-gnu-gcc -c -O2 -march=athlon-xp -pipe conftest.c >&5
configure:12692: $? = 0
configure:12696: test -z
|| test ! -s conftest.err
configure:12699: $? = 0
configure:12702: test -s conftest.o
configure:12705: $? = 0
configure:12715: result: yes
configure:12796: checking for raw joystick interface
configure:12820: i686-pc-linux-gnu-gcc -c -O2 -march=athlon-xp -pipe conftest.c >&5
configure:12826: $? = 0
configure:12830: test -z
|| test ! -s conftest.err
configure:12833: $? = 0
configure:12836: test -s conftest.o
configure:12839: $? = 0
configure:12849: result: yes
configure:12926: checking for raw mouse interface
configure:12948: i686-pc-linux-gnu-gcc -c -O2 -march=athlon-xp -pipe conftest.c >&5
configure:12954: $? = 0
configure:12958: test -z
|| test ! -s conftest.err
configure:12961: $? = 0
configure:12964: test -s conftest.o
configure:12967: $? = 0
configure:12977: result: yes
configure:13052: checking for event mouse interface
configure:13074: i686-pc-linux-gnu-gcc -c -O2 -march=athlon-xp -pipe conftest.c >&5
configure:13080: $? = 0
configure:13084: test -z
|| test ! -s conftest.err
configure:13087: $? = 0
configure:13090: test -s conftest.o
configure:13093: $? = 0
configure:13103: result: yes
configure:13178: checking for event keyboard interface
configure:13200: i686-pc-linux-gnu-gcc -c -O2 -march=athlon-xp -pipe conftest.c >&5
configure:13206: $? = 0
configure:13210: test -z
|| test ! -s conftest.err
configure:13213: $? = 0
configure:13216: test -s conftest.o
configure:13219: $? = 0
configure:13229: result: yes
configure:13305: checking for event joystick interface
configure:13327: i686-pc-linux-gnu-gcc -c -O2 -march=athlon-xp -pipe conftest.c >&5
configure:13333: $? = 0
configure:13337: test -z
|| test ! -s conftest.err
configure:13340: $? = 0
configure:13343: test -s conftest.o
configure:13346: $? = 0
configure:13356: result: yes
configure:13521: creating ./config.status
## ---------------------- ##
## Running config.status. ##
## ---------------------- ##
This file was extended by advance config.status source, which was
generated by GNU Autoconf 2.59. Invocation command line was
CONFIG_FILES =
CONFIG_HEADERS =
CONFIG_LINKS =
CONFIG_COMMANDS =
$ ./config.status
on GentooPowered
config.status:716: creating Makefile
config.status:820: creating advance/lib/config.h
configure:14648: error: no video library found. If you have the SDL library installed somewhere try using the --with-sdl-prefix option.
## ---------------- ##
## Cache variables. ##
## ---------------- ##
ac_cv_build=i686-pc-linux-gnu
ac_cv_build_alias=i686-pc-linux-gnu
ac_cv_c_bigendian=no
ac_cv_c_compiler_gnu=yes
ac_cv_c_const=yes
ac_cv_c_inline=inline
ac_cv_c_restrict=__restrict
ac_cv_cxx_compiler_gnu=yes
ac_cv_env_CC_set=
ac_cv_env_CC_value=
ac_cv_env_CFLAGS_set=set
ac_cv_env_CFLAGS_value='-O2 -march=athlon-xp -pipe'
ac_cv_env_CPPFLAGS_set=
ac_cv_env_CPPFLAGS_value=
ac_cv_env_CPP_set=
ac_cv_env_CPP_value=
ac_cv_env_CXXFLAGS_set=set
ac_cv_env_CXXFLAGS_value='-O2 -march=athlon-xp -pipe'
ac_cv_env_CXX_set=
ac_cv_env_CXX_value=
ac_cv_env_LDFLAGS_set=
ac_cv_env_LDFLAGS_value=
ac_cv_env_build_alias_set=set
ac_cv_env_build_alias_value=i686-pc-linux-gnu
ac_cv_env_host_alias_set=set
ac_cv_env_host_alias_value=i686-pc-linux-gnu
ac_cv_env_target_alias_set=
ac_cv_env_target_alias_value=
ac_cv_exeext=
ac_cv_func__doprnt=no
ac_cv_func_alloca_works=yes
ac_cv_func_backtrace=yes
ac_cv_func_backtrace_symbols=yes
ac_cv_func_feof_unlocked=yes
ac_cv_func_fgetc_unlocked=yes
ac_cv_func_flockfile=yes
ac_cv_func_fread_unlocked=yes
ac_cv_func_funlockfile=yes
ac_cv_func_fwrite_unlocked=yes
ac_cv_func_getpagesize=yes
ac_cv_func_iopl=yes
ac_cv_func_mmap_fixed_mapped=yes
ac_cv_func_mprotect=yes
ac_cv_func_select_args='int,fd_set *,struct timeval *'
ac_cv_func_strcasecmp=yes
ac_cv_func_strerror=yes
ac_cv_func_sysconf=yes
ac_cv_func_uname=yes
ac_cv_func_vprintf=yes
ac_cv_header_dirent_dirent_h=yes
ac_cv_header_execinfo_h=yes
ac_cv_header_inttypes_h=yes
ac_cv_header_memory_h=yes
ac_cv_header_netdb_h=yes
ac_cv_header_netinet_in_h=yes
ac_cv_header_sched_h=yes
ac_cv_header_stdc=yes
ac_cv_header_stdint_h=yes
ac_cv_header_stdlib_h=yes
ac_cv_header_string_h=yes
ac_cv_header_strings_h=yes
ac_cv_header_sys_io_h=yes
ac_cv_header_sys_ioctl_h=yes
ac_cv_header_sys_kd_h=yes
ac_cv_header_sys_mman_h=yes
ac_cv_header_sys_select_h=yes
ac_cv_header_sys_socket_h=yes
ac_cv_header_sys_stat_h=yes
ac_cv_header_sys_time_h=yes
ac_cv_header_sys_types_h=yes
ac_cv_header_sys_utsname_h=yes
ac_cv_header_sys_vt_h=yes
ac_cv_header_sys_wait_h=yes
ac_cv_header_termios_h=yes
ac_cv_header_time=yes
ac_cv_header_ucontext_h=yes
ac_cv_header_unistd_h=yes
ac_cv_host=i686-pc-linux-gnu
ac_cv_host_alias=i686-pc-linux-gnu
ac_cv_lib_asound_snd_pcm_open=yes
ac_cv_lib_ncurses_endwin=yes
ac_cv_lib_pthread_pthread_create=yes
ac_cv_objext=o
ac_cv_path_install='/bin/install -c'
ac_cv_prog_AR=i686-pc-linux-gnu-ar
ac_cv_prog_ASM=i686-pc-linux-gnu-nasm
ac_cv_prog_CC=i686-pc-linux-gnu-gcc
ac_cv_prog_CP=cp
ac_cv_prog_CPP='i686-pc-linux-gnu-gcc -E'
ac_cv_prog_CXX=i686-pc-linux-gnu-g++
ac_cv_prog_ECHO=echo
ac_cv_prog_GZIP=gzip
ac_cv_prog_MKDIR=mkdir
ac_cv_prog_RM=rm
ac_cv_prog_TAR=tar
ac_cv_prog_ZIP=zip
ac_cv_prog_cc_g=yes
ac_cv_prog_cc_stdc=
ac_cv_prog_cxx_g=yes
ac_cv_prog_egrep='grep -E'
ac_cv_search_opendir='none required'
ac_cv_sizeof_char=1
ac_cv_sizeof_int=4
ac_cv_sizeof_long=4
ac_cv_sizeof_long_long=8
ac_cv_sizeof_short=2
ac_cv_sizeof_voidp=4
ac_cv_sys_tiocgwinsz_in_sys_ioctl_h=yes
ac_cv_sys_tiocgwinsz_in_termios_h=no
ac_cv_type_char=yes
ac_cv_type_int=yes
ac_cv_type_long=yes
ac_cv_type_long_long=yes
ac_cv_type_short=yes
ac_cv_type_voidp=yes
ac_cv_working_alloca_h=yes
## ----------------- ##
## Output variables. ##
## ----------------- ##
ALLOCA=''
AR='i686-pc-linux-gnu-ar'
ASM='i686-pc-linux-gnu-nasm'
ASMFLAGS='-f elf'
CC='i686-pc-linux-gnu-gcc'
CC_FOR_BUILD='i686-pc-linux-gnu-gcc'
CFLAGS='-O2 -march=athlon-xp -pipe'
CFLAGS_FOR_BUILD='-O0 -DUSE_COMPILER_GNUC -DUSE_OBJ_ELF -DUSE_OS_UNIX'
CONF_BUILD='linux'
CONF_CFLAGS_ARCH=' -DUSE_LSB -DUSE_ASM_INLINE -DUSE_ASM_EMUMIPS3'
CONF_CFLAGS_OPT='-O2 -march=athlon-xp -pipe'
CONF_DEBUG='no'
CONF_DEBUGGER='no'
CONF_EMU='mame'
CONF_HOST='linux'
CONF_LDFLAGS=''
CONF_LIB_ALSA='yes'
CONF_LIB_DIRECT='no'
CONF_LIB_EXPAT='no'
CONF_LIB_FB='no'
CONF_LIB_FREETYPE='no'
CONF_LIB_JEVENT='yes'
CONF_LIB_JRAW='yes'
CONF_LIB_KEVENT='yes'
CONF_LIB_KRAW='yes'
CONF_LIB_MCPN='no'
CONF_LIB_MEVENT='yes'
CONF_LIB_MRAW='yes'
CONF_LIB_MRAWINPUT='no'
CONF_LIB_NCURSES='yes'
CONF_LIB_OSS='no'
CONF_LIB_PTHREAD='yes'
CONF_LIB_SDL='no'
CONF_LIB_SLANG='no'
CONF_LIB_SVGALIB='no'
CONF_LIB_SVGAWIN='no'
CONF_LIB_ZLIB='yes'
CONF_SYSTEM='unix'
CP='cp'
CPP='i686-pc-linux-gnu-gcc -E'
CPPFLAGS=''
CXX='i686-pc-linux-gnu-g++'
CXXFLAGS='-O2 -march=athlon-xp -pipe'
CXX_FOR_BUILD='i686-pc-linux-gnu-g++'
DEFS='-DHAVE_CONFIG_H'
ECHO='echo'
ECHO_C=''
ECHO_N='-n'
ECHO_T=''
EGREP='grep -E'
EXE=''
EXEEXT=''
EXE_FOR_BUILD=''
FREETYPECFLAGS=''
FREETYPELIBS=''
GZIP='gzip'
INSTALL_DATA='${INSTALL} -m 644'
INSTALL_PROGRAM='${INSTALL}'
INSTALL_SCRIPT='${INSTALL}'
LDFLAGS=''
LIBOBJS=''
LIBS='-lasound '
LN_S='ln -s'
LTLIBOBJS=''
MKDIR='mkdir'
OBJEXT='o'
PACKAGE_BUGREPORT=''
PACKAGE_NAME='advance'
PACKAGE_STRING='advance source'
PACKAGE_TARNAME='advance'
PACKAGE_VERSION='source'
PATH_SEPARATOR=':'
RC=''
RM='rm'
SDLCFLAGS=''
SDLLIBS=''
SHELL='/bin/sh'
TAR='tar'
ZIP='zip'
ac_ct_AR=''
ac_ct_CC=''
ac_ct_CXX=''
ac_ct_RC=''
ac_lib_freetype_config=''
ac_lib_sdl_config=''
bindir='${exec_prefix}/bin'
build='i686-pc-linux-gnu'
build_alias='i686-pc-linux-gnu'
build_cpu='i686'
build_os='linux-gnu'
build_vendor='pc'
datadir='/usr/share/games'
exec_prefix='${prefix}'
host='i686-pc-linux-gnu'
host_alias='i686-pc-linux-gnu'
host_cpu='i686'
host_os='linux-gnu'
host_vendor='pc'
includedir='${prefix}/include'
infodir='/usr/share/info'
libdir='/usr/games/lib'
libexecdir='${exec_prefix}/libexec'
localstatedir='/var/games'
mandir='/usr/share/man'
oldincludedir='/usr/include'
prefix='/usr/games'
program_transform_name='s,x,x,'
sbindir='${exec_prefix}/sbin'
sharedstatedir='${prefix}/com'
sysconfdir='/etc/games'
target_alias=''
## ----------- ##
## confdefs.h. ##
## ----------- ##
#define GWINSZ_IN_SYS_IOCTL 1
#define HAVE_ALLOCA 1
#define HAVE_ALLOCA_H 1
#define HAVE_BACKTRACE 1
#define HAVE_BACKTRACE_SYMBOLS 1
#define HAVE_DIRENT_H 1
#define HAVE_EXECINFO_H 1
#define HAVE_FEOF_UNLOCKED 1
#define HAVE_FGETC_UNLOCKED 1
#define HAVE_FLOCKFILE 1
#define HAVE_FREAD_UNLOCKED 1
#define HAVE_FUNLOCKFILE 1
#define HAVE_FWRITE_UNLOCKED 1
#define HAVE_GETPAGESIZE 1
#define HAVE_INOUT 1
#define HAVE_INTTYPES_H 1
#define HAVE_IOPL 1
#define HAVE_LIBASOUND 1
#define HAVE_MEMORY_H 1
#define HAVE_MMAP 1
#define HAVE_MPROTECT 1
#define HAVE_NETDB_H 1
#define HAVE_NETINET_IN_H 1
#define HAVE_SCHED_H 1
#define HAVE_STDINT_H 1
#define HAVE_STDLIB_H 1
#define HAVE_STDLIB_H 1
#define HAVE_STRCASECMP 1
#define HAVE_STRERROR 1
#define HAVE_STRINGS_H 1
#define HAVE_STRING_H 1
#define HAVE_SYSCONF 1
#define HAVE_SYS_IOCTL_H 1
#define HAVE_SYS_IO_H 1
#define HAVE_SYS_KD_H 1
#define HAVE_SYS_MMAN_H 1
#define HAVE_SYS_SELECT_H 1
#define HAVE_SYS_SELECT_H 1
#define HAVE_SYS_SOCKET_H 1
#define HAVE_SYS_SOCKET_H 1
#define HAVE_SYS_STAT_H 1
#define HAVE_SYS_STAT_H 1
#define HAVE_SYS_TIME_H 1
#define HAVE_SYS_TYPES_H 1
#define HAVE_SYS_TYPES_H 1
#define HAVE_SYS_UTSNAME_H 1
#define HAVE_SYS_VT_H 1
#define HAVE_SYS_WAIT_H 1
#define HAVE_TERMIOS_H 1
#define HAVE_UCONTEXT_H 1
#define HAVE_UNAME 1
#define HAVE_UNISTD_H 1
#define HAVE_UNISTD_H 1
#define HAVE_UNISTD_H 1
#define HAVE_VPRINTF 1
#define PACKAGE_BUGREPORT ""
#define PACKAGE_NAME "advance"
#define PACKAGE_STRING "advance source"
#define PACKAGE_TARNAME "advance"
#define PACKAGE_VERSION "source"
#define SELECT_TYPE_ARG1 int
#define SELECT_TYPE_ARG234 (fd_set *)
#define SELECT_TYPE_ARG5 (struct timeval *)
#define SIZEOF_CHAR 1
#define SIZEOF_INT 4
#define SIZEOF_LONG 4
#define SIZEOF_LONG_LONG 8
#define SIZEOF_SHORT 2
#define SIZEOF_VOIDP 4
#define STDC_HEADERS 1
#define STDC_HEADERS 1
#define TIME_WITH_SYS_TIME 1
#define restrict __restrict
#endif
#ifdef __cplusplus
extern "C" void std::exit (int) throw (); using std::exit;
configure: exit 1