rendered paste bodyLAST LOGLINES FROM /tmp/easy_e17/install_logs/calendar.log:
-----------------------------------------------------------------------------
make[3]: Entering directory `/root/e17_cvs/e_modules/calendar/src'
if /bin/sh ../libtool --tag=CC --mode=compile gcc -DHAVE_CONFIG_H -I. -I. -I.. -I. -I.. -I/opt/e17/include -I/opt/e17/include/enlightenment -DUSE_E_CONFIG_H -I/opt/e17/include -I/opt/e17/include -I/opt/e17/include -I/opt/e17/include -I/opt/e17/include -I/opt/e17/include -I/opt/e17/include -I/opt/e17/include -g -O2 -MT add_event_dialog.lo -MD -MP -MF ".deps/add_event_dialog.Tpo" -c -o add_event_dialog.lo add_event_dialog.c; \
then mv -f ".deps/add_event_dialog.Tpo" ".deps/add_event_dialog.Plo"; else rm -f ".deps/add_event_dialog.Tpo"; exit 1; fi
mkdir .libs
gcc -DHAVE_CONFIG_H -I. -I. -I.. -I. -I.. -I/opt/e17/include -I/opt/e17/include/enlightenment -DUSE_E_CONFIG_H -I/opt/e17/include -I/opt/e17/include -I/opt/e17/include -I/opt/e17/include -I/opt/e17/include -I/opt/e17/include -I/opt/e17/include -I/opt/e17/include -g -O2 -MT add_event_dialog.lo -MD -MP -MF .deps/add_event_dialog.Tpo -c add_event_dialog.c -fPIC -DPIC -o .libs/add_event_dialog.o
In file included from add_event_dialog.c:2:
e_mod_main.h:218: error: expected specifier-qualifier-list before 'E_Gadman_Client'
In file included from e_mod_main.h:327,
from add_event_dialog.c:2:
dialog_func.h:33: error: expected ')' before '*' token
dialog_func.h:35: error: expected ')' before '*' token
dialog_func.h:37: error: expected ')' before '*' token
In file included from e_mod_main.h:329,
from add_event_dialog.c:2:
cal_face_func.h:16: error: expected declaration specifiers or '...' before 'E_Gadman_Client'
cal_face_func.h:16: error: expected declaration specifiers or '...' before 'E_Gadman_Change'
add_event_dialog.c: In function '_add_event_basic_create_widgets':
add_event_dialog.c:130: warning: passing argument 2 of 'e_widget_entry_add' from incompatible pointer type
make[3]: *** [add_event_dialog.lo] Error 1
make[3]: Leaving directory `/root/e17_cvs/e_modules/calendar/src'
make[2]: *** [all-recursive] Error 1
make[2]: Leaving directory `/root/e17_cvs/e_modules/calendar/src'
make[1]: *** [all-recursive] Error 1
make[1]: Leaving directory `/root/e17_cvs/e_modules/calendar'
make: *** [all] Error 2
-----------------------------------------------------------------------------