All pastes #16476 Raw Edit

Mine

public text v1 · immutable
#16476 ·published 2005-06-30 12:28 UTC
rendered paste body
bash-2.05b$ make
make -C /usr/src/linux SUBDIRS=/home/max/33/src/2.6.x modules
make[1]: Entering directory `/usr/src/linux-2.6.9-gentoo-r13'
make[1]: Warning: File `.vmlinux.cmd' has modification time 9.6e+05 s in the future
make[2]: Warning: File `scripts/Makefile.lib' has modification time 7.7e+04 s in the future
  CC [M]  /home/max/33/src/2.6.x/iteraid.o
In file included from /home/max/33/src/2.6.x/iteraid.c:259:
/usr/src/linux-2.4.26-gentoo-r14/drivers/scsi/hosts.h:100: error: syntax error before '*' token
/usr/src/linux-2.4.26-gentoo-r14/drivers/scsi/hosts.h:100: warning: function declaration isn't a prototype
/usr/src/linux-2.4.26-gentoo-r14/drivers/scsi/hosts.h:107: warning: `struct Scsi_Host' declared inside parameter list
/usr/src/linux-2.4.26-gentoo-r14/drivers/scsi/hosts.h:107: warning: its scope is only this definition or declaration, which is probably not what you want
/usr/src/linux-2.4.26-gentoo-r14/drivers/scsi/hosts.h:114: warning: `struct Scsi_Host' declared inside parameter list
/usr/src/linux-2.4.26-gentoo-r14/drivers/scsi/hosts.h:119: error: syntax error before '*' token
/usr/src/linux-2.4.26-gentoo-r14/drivers/scsi/hosts.h:119: warning: function declaration isn't a prototype
/usr/src/linux-2.4.26-gentoo-r14/drivers/scsi/hosts.h:132: error: syntax error before '*' token
/usr/src/linux-2.4.26-gentoo-r14/drivers/scsi/hosts.h:132: warning: function declaration isn't a prototype
/usr/src/linux-2.4.26-gentoo-r14/drivers/scsi/hosts.h:145: error: syntax error before '*' token
/usr/src/linux-2.4.26-gentoo-r14/drivers/scsi/hosts.h:145: error: syntax error before '*' token
/usr/src/linux-2.4.26-gentoo-r14/drivers/scsi/hosts.h:145: warning: function declaration isn't a prototype
/usr/src/linux-2.4.26-gentoo-r14/drivers/scsi/hosts.h:145: error: `queuecommand' declared as function returning a function
/usr/src/linux-2.4.26-gentoo-r14/drivers/scsi/hosts.h:145: warning: function declaration isn't a prototype
/usr/src/linux-2.4.26-gentoo-r14/drivers/scsi/hosts.h:145: warning: no semicolon at end of struct or union
/usr/src/linux-2.4.26-gentoo-r14/drivers/scsi/hosts.h:162: warning: `struct Scsi_Host' declared inside parameter list
/usr/src/linux-2.4.26-gentoo-r14/drivers/scsi/hosts.h:163: error: syntax error before '*' token
/usr/src/linux-2.4.26-gentoo-r14/drivers/scsi/hosts.h:163: warning: function declaration isn't a prototype
/usr/src/linux-2.4.26-gentoo-r14/drivers/scsi/hosts.h:164: error: syntax error before '*' token
/usr/src/linux-2.4.26-gentoo-r14/drivers/scsi/hosts.h:164: warning: function declaration isn't a prototype
/usr/src/linux-2.4.26-gentoo-r14/drivers/scsi/hosts.h:165: error: syntax error before '*' token
/usr/src/linux-2.4.26-gentoo-r14/drivers/scsi/hosts.h:165: warning: function declaration isn't a prototype
/usr/src/linux-2.4.26-gentoo-r14/drivers/scsi/hosts.h:166: error: syntax error before '*' token
/usr/src/linux-2.4.26-gentoo-r14/drivers/scsi/hosts.h:166: warning: function declaration isn't a prototype
/usr/src/linux-2.4.26-gentoo-r14/drivers/scsi/hosts.h:185: error: syntax error before '*' token
/usr/src/linux-2.4.26-gentoo-r14/drivers/scsi/hosts.h:185: warning: function declaration isn't a prototype
/usr/src/linux-2.4.26-gentoo-r14/drivers/scsi/hosts.h:185: error: `abort' redeclared as different kind of symbol
<built-in>:0: error: previous declaration of `abort'
/usr/src/linux-2.4.26-gentoo-r14/drivers/scsi/hosts.h:200: error: syntax error before '*' token
/usr/src/linux-2.4.26-gentoo-r14/drivers/scsi/hosts.h:200: warning: function declaration isn't a prototype
/usr/src/linux-2.4.26-gentoo-r14/drivers/scsi/hosts.h:215: error: syntax error before "kdev_t"
/usr/src/linux-2.4.26-gentoo-r14/drivers/scsi/hosts.h:215: warning: function declaration isn't a prototype
/usr/src/linux-2.4.26-gentoo-r14/drivers/scsi/hosts.h:221: error: syntax error before "Scsi_Device"
/usr/src/linux-2.4.26-gentoo-r14/drivers/scsi/hosts.h:221: warning: `struct Scsi_Host' declared inside parameter list
/usr/src/linux-2.4.26-gentoo-r14/drivers/scsi/hosts.h:221: warning: function declaration isn't a prototype
/usr/src/linux-2.4.26-gentoo-r14/drivers/scsi/hosts.h:270: error: syntax error before ':' token
/usr/src/linux-2.4.26-gentoo-r14/drivers/scsi/hosts.h:280: error: syntax error before ':' token
/usr/src/linux-2.4.26-gentoo-r14/drivers/scsi/hosts.h:287: error: syntax error before ':' token
/usr/src/linux-2.4.26-gentoo-r14/drivers/scsi/hosts.h:292: error: syntax error before ':' token
/usr/src/linux-2.4.26-gentoo-r14/drivers/scsi/hosts.h:297: error: syntax error before ':' token
/usr/src/linux-2.4.26-gentoo-r14/drivers/scsi/hosts.h:304: error: syntax error before '}' token
/usr/src/linux-2.4.26-gentoo-r14/drivers/scsi/hosts.h:304: warning: type defaults to `int' in declaration of `Scsi_Host_Template'
/usr/src/linux-2.4.26-gentoo-r14/drivers/scsi/hosts.h:304: warning: data definition has no type or storage class
/usr/src/linux-2.4.26-gentoo-r14/drivers/scsi/hosts.h:323: error: syntax error before "Scsi_Device"
/usr/src/linux-2.4.26-gentoo-r14/drivers/scsi/hosts.h:323: warning: no semicolon at end of struct or union
/usr/src/linux-2.4.26-gentoo-r14/drivers/scsi/hosts.h:332: error: syntax error before ':' token
/usr/src/linux-2.4.26-gentoo-r14/drivers/scsi/hosts.h:335: error: syntax error before '*' token
/usr/src/linux-2.4.26-gentoo-r14/drivers/scsi/hosts.h:335: warning: type defaults to `int' in declaration of `hostt'
/usr/src/linux-2.4.26-gentoo-r14/drivers/scsi/hosts.h:335: warning: data definition has no type or storage class
/usr/src/linux-2.4.26-gentoo-r14/drivers/scsi/hosts.h:395: error: syntax error before ':' token
/usr/src/linux-2.4.26-gentoo-r14/drivers/scsi/hosts.h:396: error: syntax error before ':' token
/usr/src/linux-2.4.26-gentoo-r14/drivers/scsi/hosts.h:397: error: syntax error before ':' token
/usr/src/linux-2.4.26-gentoo-r14/drivers/scsi/hosts.h:398: error: syntax error before ':' token
/usr/src/linux-2.4.26-gentoo-r14/drivers/scsi/hosts.h:403: error: syntax error before ':' token
/usr/src/linux-2.4.26-gentoo-r14/drivers/scsi/hosts.h:408: error: syntax error before ':' token
/usr/src/linux-2.4.26-gentoo-r14/drivers/scsi/hosts.h:414: error: syntax error before ':' token
/usr/src/linux-2.4.26-gentoo-r14/drivers/scsi/hosts.h:420: error: syntax error before ':' token
/usr/src/linux-2.4.26-gentoo-r14/drivers/scsi/hosts.h:426: error: syntax error before ':' token
/usr/src/linux-2.4.26-gentoo-r14/drivers/scsi/hosts.h:428: error: syntax error before "Scsi_Device"
/usr/src/linux-2.4.26-gentoo-r14/drivers/scsi/hosts.h:428: warning: function declaration isn't a prototype
/usr/src/linux-2.4.26-gentoo-r14/drivers/scsi/hosts.h:443: error: syntax error before '}' token
/usr/src/linux-2.4.26-gentoo-r14/drivers/scsi/hosts.h:452: error: syntax error before '*' token
/usr/src/linux-2.4.26-gentoo-r14/drivers/scsi/hosts.h:452: warning: function declaration isn't a prototype
/usr/src/linux-2.4.26-gentoo-r14/drivers/scsi/hosts.h:453: error: syntax error before '*' token
/usr/src/linux-2.4.26-gentoo-r14/drivers/scsi/hosts.h:453: warning: type defaults to `int' in declaration of `scsi_get_host_dev'
/usr/src/linux-2.4.26-gentoo-r14/drivers/scsi/hosts.h:453: warning: data definition has no type or storage class
/usr/src/linux-2.4.26-gentoo-r14/drivers/scsi/hosts.h:472: error: syntax error before '*' token
/usr/src/linux-2.4.26-gentoo-r14/drivers/scsi/hosts.h:472: warning: type defaults to `int' in declaration of `scsi_hosts'
/usr/src/linux-2.4.26-gentoo-r14/drivers/scsi/hosts.h:472: warning: data definition has no type or storage class
/usr/src/linux-2.4.26-gentoo-r14/drivers/scsi/hosts.h:474: error: syntax error before '*' token
/usr/src/linux-2.4.26-gentoo-r14/drivers/scsi/hosts.h:474: warning: function declaration isn't a prototype
/usr/src/linux-2.4.26-gentoo-r14/drivers/scsi/hosts.h:483: error: syntax error before '*' token
/usr/src/linux-2.4.26-gentoo-r14/drivers/scsi/hosts.h:483: warning: function declaration isn't a prototype
/usr/src/linux-2.4.26-gentoo-r14/drivers/scsi/hosts.h: In function `scsi_set_pci_device':
/usr/src/linux-2.4.26-gentoo-r14/drivers/scsi/hosts.h:492: error: dereferencing pointer to incomplete type
/usr/src/linux-2.4.26-gentoo-r14/drivers/scsi/hosts.h: At top level:
/usr/src/linux-2.4.26-gentoo-r14/drivers/scsi/hosts.h:523: error: syntax error before '*' token
/usr/src/linux-2.4.26-gentoo-r14/drivers/scsi/hosts.h:523: warning: function declaration isn't a prototype
/usr/src/linux-2.4.26-gentoo-r14/drivers/scsi/hosts.h:527: error: syntax error before '*' token
/usr/src/linux-2.4.26-gentoo-r14/drivers/scsi/hosts.h:527: warning: function declaration isn't a prototype
/usr/src/linux-2.4.26-gentoo-r14/drivers/scsi/hosts.h:528: error: syntax error before '*' token
/usr/src/linux-2.4.26-gentoo-r14/drivers/scsi/hosts.h:528: warning: function declaration isn't a prototype
/usr/src/linux-2.4.26-gentoo-r14/drivers/scsi/hosts.h:529: error: syntax error before '*' token
/usr/src/linux-2.4.26-gentoo-r14/drivers/scsi/hosts.h:529: warning: function declaration isn't a prototype
/usr/src/linux-2.4.26-gentoo-r14/drivers/scsi/hosts.h:533: error: syntax error before '*' token
/usr/src/linux-2.4.26-gentoo-r14/drivers/scsi/hosts.h:533: warning: function declaration isn't a prototype
In file included from /home/max/33/src/2.6.x/iteraid.c:263:
/home/max/33/src/2.6.x/iteraid.h:945: error: syntax error before "Scsi_Cmnd"
/home/max/33/src/2.6.x/iteraid.h:945: warning: no semicolon at end of struct or union
/home/max/33/src/2.6.x/iteraid.h:946: warning: type defaults to `int' in declaration of `SCSI_REQUEST_BLOCK'
/home/max/33/src/2.6.x/iteraid.h:946: warning: type defaults to `int' in declaration of `PSCSI_REQUEST_BLOCK'
/home/max/33/src/2.6.x/iteraid.h:946: warning: data definition has no type or storage class
/home/max/33/src/2.6.x/iteraid.h:1200: error: syntax error before "PSCSI_REQUEST_BLOCK"
/home/max/33/src/2.6.x/iteraid.h:1200: warning: no semicolon at end of struct or union
/home/max/33/src/2.6.x/iteraid.h:1205: warning: type defaults to `int' in declaration of `OriginalSrb'
/home/max/33/src/2.6.x/iteraid.h:1205: warning: data definition has no type or storage class
/home/max/33/src/2.6.x/iteraid.h:1210: error: syntax error before "_Srb"
/home/max/33/src/2.6.x/iteraid.h:1210: warning: type defaults to `int' in declaration of `_Srb'
/home/max/33/src/2.6.x/iteraid.h:1210: warning: data definition has no type or storage class
/home/max/33/src/2.6.x/iteraid.h:1221: error: syntax error before '}' token
/home/max/33/src/2.6.x/iteraid.h:1221: warning: type defaults to `int' in declaration of `Channel'
/home/max/33/src/2.6.x/iteraid.h:1221: warning: type defaults to `int' in declaration of `PChannel'
/home/max/33/src/2.6.x/iteraid.h:1221: warning: data definition has no type or storage class
/home/max/33/src/2.6.x/iteraid.h:1237: error: syntax error before "Channel"
/home/max/33/src/2.6.x/iteraid.h:1237: warning: no semicolon at end of struct or union
/home/max/33/src/2.6.x/iteraid.h:1239: error: syntax error before '}' token
/home/max/33/src/2.6.x/iteraid.h:1240: warning: type defaults to `int' in declaration of `ITE_ADAPTER'
/home/max/33/src/2.6.x/iteraid.h:1240: warning: type defaults to `int' in declaration of `PITE_ADAPTER'
/home/max/33/src/2.6.x/iteraid.h:1240: warning: data definition has no type or storage class
/home/max/33/src/2.6.x/iteraid.h:1488: error: syntax error before '*' token
/home/max/33/src/2.6.x/iteraid.h:1488: warning: function declaration isn't a prototype
/home/max/33/src/2.6.x/iteraid.h:1490: error: syntax error before '*' token
/home/max/33/src/2.6.x/iteraid.h:1490: warning: function declaration isn't a prototype
/home/max/33/src/2.6.x/iteraid.h:1491: error: syntax error before '*' token
/home/max/33/src/2.6.x/iteraid.h:1491: error: syntax error before '*' token
/home/max/33/src/2.6.x/iteraid.h:1492: warning: `struct scsi_device' declared inside parameter list
/home/max/33/src/2.6.x/iteraid.h:1496: error: syntax error before '*' token
/home/max/33/src/2.6.x/iteraid.h:1496: warning: function declaration isn't a prototype
/home/max/33/src/2.6.x/iteraid.h:1498: warning: parameter names (without types) in function declaration
/home/max/33/src/2.6.x/iteraid.h:1499: warning: parameter names (without types) in function declaration
/home/max/33/src/2.6.x/iteraid.h:1500: error: syntax error before "PChannel"
/home/max/33/src/2.6.x/iteraid.h:1500: warning: function declaration isn't a prototype
/home/max/33/src/2.6.x/iteraid.h:1501: error: syntax error before "unsigned"
/home/max/33/src/2.6.x/iteraid.h:1501: warning: function declaration isn't a prototype
/home/max/33/src/2.6.x/iteraid.h:1502: error: syntax error before '*' token
/home/max/33/src/2.6.x/iteraid.h:1502: warning: function declaration isn't a prototype
/home/max/33/src/2.6.x/iteraid.h:1503: error: syntax error before "u8"
/home/max/33/src/2.6.x/iteraid.h:1503: warning: function declaration isn't a prototype
/home/max/33/src/2.6.x/iteraid.h:1504: warning: parameter names (without types) in function declaration
/home/max/33/src/2.6.x/iteraid.h:1505: warning: parameter names (without types) in function declaration
/home/max/33/src/2.6.x/iteraid.h:1506: warning: parameter names (without types) in function declaration
/home/max/33/src/2.6.x/iteraid.h:1507: error: syntax error before "pAdap"
/home/max/33/src/2.6.x/iteraid.h:1507: warning: function declaration isn't a prototype
/home/max/33/src/2.6.x/iteraid.c:276: error: syntax error before '*' token
/home/max/33/src/2.6.x/iteraid.c:276: warning: type defaults to `int' in declaration of `it8212_req_last'
/home/max/33/src/2.6.x/iteraid.c:276: warning: data definition has no type or storage class
/home/max/33/src/2.6.x/iteraid.c:279: error: syntax error before "ite_adapters"
/home/max/33/src/2.6.x/iteraid.c:279: warning: type defaults to `int' in declaration of `ite_adapters'
/home/max/33/src/2.6.x/iteraid.c:279: warning: data definition has no type or storage class
/home/max/33/src/2.6.x/iteraid.c:343: error: syntax error before "pChan"
/home/max/33/src/2.6.x/iteraid.c:344: warning: function declaration isn't a prototype
/home/max/33/src/2.6.x/iteraid.c: In function `MapError':
/home/max/33/src/2.6.x/iteraid.c:353: error: `pChan' undeclared (first use in this function)
/home/max/33/src/2.6.x/iteraid.c:353: error: (Each undeclared identifier is reported only once
/home/max/33/src/2.6.x/iteraid.c:353: error: for each function it appears in.)
/home/max/33/src/2.6.x/iteraid.c:359: error: `Srb' undeclared (first use in this function)
/home/max/33/src/2.6.x/iteraid.c: At top level:
/home/max/33/src/2.6.x/iteraid.c:621: error: syntax error before "pAdap"
/home/max/33/src/2.6.x/iteraid.c:622: warning: function declaration isn't a prototype
/home/max/33/src/2.6.x/iteraid.c: In function `AtapiResetController':
/home/max/33/src/2.6.x/iteraid.c:628: error: syntax error before "srb"
/home/max/33/src/2.6.x/iteraid.c:631: error: `pChan' undeclared (first use in this function)
/home/max/33/src/2.6.x/iteraid.c:678: error: `srb' undeclared (first use in this function)
/home/max/33/src/2.6.x/iteraid.c:699: error: `pAdap' undeclared (first use in this function)
/home/max/33/src/2.6.x/iteraid.c: At top level:
/home/max/33/src/2.6.x/iteraid.c:724: error: syntax error before "pChan"
/home/max/33/src/2.6.x/iteraid.c:729: warning: function declaration isn't a prototype
/home/max/33/src/2.6.x/iteraid.c: In function `IdeStartTransfer':
/home/max/33/src/2.6.x/iteraid.c:737: error: `Srb' undeclared (first use in this function)
/home/max/33/src/2.6.x/iteraid.c:738: error: `pChan' undeclared (first use in this function)
/home/max/33/src/2.6.x/iteraid.c:743: error: `startingSector' undeclared (first use in this function)
/home/max/33/src/2.6.x/iteraid.c:743: error: `SectorNumber' undeclared (first use in this function)
/home/max/33/src/2.6.x/iteraid.c: At top level:
/home/max/33/src/2.6.x/iteraid.c:869: error: syntax error before "pChan"
/home/max/33/src/2.6.x/iteraid.c:870: warning: function declaration isn't a prototype
/home/max/33/src/2.6.x/iteraid.c: In function `IdeBuildSglist':
/home/max/33/src/2.6.x/iteraid.c:873: error: `Srb' undeclared (first use in this function)
/home/max/33/src/2.6.x/iteraid.c:875: error: `pChan' undeclared (first use in this function)
/home/max/33/src/2.6.x/iteraid.c: At top level:
/home/max/33/src/2.6.x/iteraid.c:902: error: syntax error before "pChan"
/home/max/33/src/2.6.x/iteraid.c:903: warning: function declaration isn't a prototype
/home/max/33/src/2.6.x/iteraid.c: In function `IdeBuildDmaTable':
/home/max/33/src/2.6.x/iteraid.c:905: error: `pChan' undeclared (first use in this function)
/home/max/33/src/2.6.x/iteraid.c:910: error: `Srb' undeclared (first use in this function)
/home/max/33/src/2.6.x/iteraid.c: At top level:
/home/max/33/src/2.6.x/iteraid.c:980: error: syntax error before "pChan"
/home/max/33/src/2.6.x/iteraid.c:981: warning: function declaration isn't a prototype
/home/max/33/src/2.6.x/iteraid.c: In function `IdeBuildDmaSgTable':
/home/max/33/src/2.6.x/iteraid.c:985: error: `pChan' undeclared (first use in this function)
/home/max/33/src/2.6.x/iteraid.c:986: error: `Srb' undeclared (first use in this function)
/home/max/33/src/2.6.x/iteraid.c: At top level:
/home/max/33/src/2.6.x/iteraid.c:1012: error: syntax error before "pChan"
/home/max/33/src/2.6.x/iteraid.c:1013: warning: function declaration isn't a prototype
/home/max/33/src/2.6.x/iteraid.c: In function `IdeSetupDma':
/home/max/33/src/2.6.x/iteraid.c:1015: error: `pChan' undeclared (first use in this function)
/home/max/33/src/2.6.x/iteraid.c:1015: error: `dma_base' undeclared (first use in this function)
/home/max/33/src/2.6.x/iteraid.c:1016: error: `num_ports' undeclared (first use in this function)
/home/max/33/src/2.6.x/iteraid.c: At top level:
/home/max/33/src/2.6.x/iteraid.c:1054: error: syntax error before "pChan"
/home/max/33/src/2.6.x/iteraid.c:1055: warning: function declaration isn't a prototype
/home/max/33/src/2.6.x/iteraid.c: In function `IT8212ReconfigChannel':
/home/max/33/src/2.6.x/iteraid.c:1058: error: `pChan' undeclared (first use in this function)
/home/max/33/src/2.6.x/iteraid.c:1062: error: `Operation' undeclared (first use in this function)
/home/max/33/src/2.6.x/iteraid.c:1064: error: `ArrayId' undeclared (first use in this function)
/home/max/33/src/2.6.x/iteraid.c: In function `IT8212GetChipStatus':
/home/max/33/src/2.6.x/iteraid.c:1100: error: syntax error before "pChan"
/home/max/33/src/2.6.x/iteraid.c:1110: error: `pAdap' undeclared (first use in this function)
/home/max/33/src/2.6.x/iteraid.c:1111: error: `pChan' undeclared (first use in this function)
/home/max/33/src/2.6.x/iteraid.c: In function `IT8212ErasePartition':
/home/max/33/src/2.6.x/iteraid.c:1245: error: syntax error before "pAdap"
/home/max/33/src/2.6.x/iteraid.c:1254: error: `pAdap' undeclared (first use in this function)
/home/max/33/src/2.6.x/iteraid.c:1258: error: `pChan' undeclared (first use in this function)
/home/max/33/src/2.6.x/iteraid.c: In function `IT8212CreateDiskArray':
/home/max/33/src/2.6.x/iteraid.c:1495: error: syntax error before "pChan"
/home/max/33/src/2.6.x/iteraid.c:1567: error: `pAdap' undeclared (first use in this function)
/home/max/33/src/2.6.x/iteraid.c:1568: error: `pChan' undeclared (first use in this function)
/home/max/33/src/2.6.x/iteraid.c: In function `IT8212IssueIdentify':
/home/max/33/src/2.6.x/iteraid.c:1807: error: syntax error before "pAdap"
/home/max/33/src/2.6.x/iteraid.c:1814: error: `pAdap' undeclared (first use in this function)
/home/max/33/src/2.6.x/iteraid.c:1823: error: `pChan' undeclared (first use in this function)
/home/max/33/src/2.6.x/iteraid.c: At top level:
/home/max/33/src/2.6.x/iteraid.c:1938: error: syntax error before "pAdap"
/home/max/33/src/2.6.x/iteraid.c:1939: warning: function declaration isn't a prototype
/home/max/33/src/2.6.x/iteraid.c: In function `IT8212ResetAdapter':
/home/max/33/src/2.6.x/iteraid.c:1946: error: syntax error before "pChan"
/home/max/33/src/2.6.x/iteraid.c:1953: error: `pChan' undeclared (first use in this function)
/home/max/33/src/2.6.x/iteraid.c:1953: error: `pAdap' undeclared (first use in this function)
/home/max/33/src/2.6.x/iteraid.c: In function `IT8212Rebuild':
/home/max/33/src/2.6.x/iteraid.c:2052: error: syntax error before "pAdap"
/home/max/33/src/2.6.x/iteraid.c:2061: error: `pAdap' undeclared (first use in this function)
/home/max/33/src/2.6.x/iteraid.c:2067: error: `pChan' undeclared (first use in this function)
/home/max/33/src/2.6.x/iteraid.c: At top level:
/home/max/33/src/2.6.x/iteraid.c:2149: error: syntax error before "pChan"
/home/max/33/src/2.6.x/iteraid.c:2150: warning: function declaration isn't a prototype
/home/max/33/src/2.6.x/iteraid.c: In function `IT8212SwitchDmaMode':
/home/max/33/src/2.6.x/iteraid.c:2157: error: `pChan' undeclared (first use in this function)
/home/max/33/src/2.6.x/iteraid.c:2170: error: `DeviceId' undeclared (first use in this function)
/home/max/33/src/2.6.x/iteraid.c: At top level:
/home/max/33/src/2.6.x/iteraid.c:2256: error: syntax error before "pChan"
/home/max/33/src/2.6.x/iteraid.c:2257: warning: function declaration isn't a prototype
/home/max/33/src/2.6.x/iteraid.c: In function `IT8212ReadWrite':
/home/max/33/src/2.6.x/iteraid.c:2263: error: syntax error before "pAdap"
/home/max/33/src/2.6.x/iteraid.c:2265: error: `Srb' undeclared (first use in this function)
/home/max/33/src/2.6.x/iteraid.c:2267: error: `pAdap' undeclared (first use in this function)
/home/max/33/src/2.6.x/iteraid.c:2268: error: `pChan' undeclared (first use in this function)
/home/max/33/src/2.6.x/iteraid.c: At top level:
/home/max/33/src/2.6.x/iteraid.c:2358: error: syntax error before "pChan"
/home/max/33/src/2.6.x/iteraid.c:2363: warning: function declaration isn't a prototype
/home/max/33/src/2.6.x/iteraid.c: In function `IT8212SetTransferMode':
/home/max/33/src/2.6.x/iteraid.c:2370: error: `DiskId' undeclared (first use in this function)
/home/max/33/src/2.6.x/iteraid.c:2370: error: `pChan' undeclared (first use in this function)
/home/max/33/src/2.6.x/iteraid.c:2397: error: `TransferMode' undeclared (first use in this function)
/home/max/33/src/2.6.x/iteraid.c:2397: error: `ModeNumber' undeclared (first use in this function)
/home/max/33/src/2.6.x/iteraid.c: At top level:
/home/max/33/src/2.6.x/iteraid.c:2423: error: syntax error before "pAdap"
/home/max/33/src/2.6.x/iteraid.c:2424: warning: function declaration isn't a prototype
/home/max/33/src/2.6.x/iteraid.c: In function `IT8212SetBestTransferMode':
/home/max/33/src/2.6.x/iteraid.c:2435: error: `pChan' undeclared (first use in this function)
/home/max/33/src/2.6.x/iteraid.c:2507: error: `channel' undeclared (first use in this function)
/home/max/33/src/2.6.x/iteraid.c:2572: error: `pAdap' undeclared (first use in this function)
/home/max/33/src/2.6.x/iteraid.c: At top level:
/home/max/33/src/2.6.x/iteraid.c:2796: error: syntax error before "pChan"
/home/max/33/src/2.6.x/iteraid.c:2797: warning: function declaration isn't a prototype
/home/max/33/src/2.6.x/iteraid.c: In function `IT8212Interrupt':
/home/max/33/src/2.6.x/iteraid.c:2803: error: syntax error before "Srb"
/home/max/33/src/2.6.x/iteraid.c:2806: error: `pChan' undeclared (first use in this function)
/home/max/33/src/2.6.x/iteraid.c:2807: error: `Srb' undeclared (first use in this function)
/home/max/33/src/2.6.x/iteraid.c:2839: error: `bypass_mode' undeclared (first use in this function)
/home/max/33/src/2.6.x/iteraid.c: At top level:
/home/max/33/src/2.6.x/iteraid.c:2917: error: syntax error before "pChan"
/home/max/33/src/2.6.x/iteraid.c:2918: warning: function declaration isn't a prototype
/home/max/33/src/2.6.x/iteraid.c: In function `AtapiInterrupt':
/home/max/33/src/2.6.x/iteraid.c:2927: error: syntax error before "srb"
/home/max/33/src/2.6.x/iteraid.c:2932: error: `srb' undeclared (first use in this function)
/home/max/33/src/2.6.x/iteraid.c:2932: error: `pChan' undeclared (first use in this function)
/home/max/33/src/2.6.x/iteraid.c:2937: error: `pAdap' undeclared (first use in this function)
/home/max/33/src/2.6.x/iteraid.c: In function `Irq_Handler':
/home/max/33/src/2.6.x/iteraid.c:3348: error: syntax error before "pAdap"
/home/max/33/src/2.6.x/iteraid.c:3357: error: `pAdap' undeclared (first use in this function)
/home/max/33/src/2.6.x/iteraid.c: At top level:
/home/max/33/src/2.6.x/iteraid.c:3377: error: syntax error before "pChan"
/home/max/33/src/2.6.x/iteraid.c:3378: warning: function declaration isn't a prototype
/home/max/33/src/2.6.x/iteraid.c: In function `IdeVerify':
/home/max/33/src/2.6.x/iteraid.c:3390: error: `Srb' undeclared (first use in this function)
/home/max/33/src/2.6.x/iteraid.c:3390: error: `pChan' undeclared (first use in this function)
/home/max/33/src/2.6.x/iteraid.c: At top level:
/home/max/33/src/2.6.x/iteraid.c:3582: error: syntax error before "pChan"
/home/max/33/src/2.6.x/iteraid.c:3583: warning: function declaration isn't a prototype
/home/max/33/src/2.6.x/iteraid.c: In function `Scsi2Atapi':
/home/max/33/src/2.6.x/iteraid.c:3588: error: `Srb' undeclared (first use in this function)
/home/max/33/src/2.6.x/iteraid.c:3599: error: `pChan' undeclared (first use in this function)
/home/max/33/src/2.6.x/iteraid.c: At top level:
/home/max/33/src/2.6.x/iteraid.c:3736: error: syntax error before "pChan"
/home/max/33/src/2.6.x/iteraid.c:3737: warning: function declaration isn't a prototype
/home/max/33/src/2.6.x/iteraid.c: In function `AtapiSendCommand':
/home/max/33/src/2.6.x/iteraid.c:3747: error: `pChan' undeclared (first use in this function)
/home/max/33/src/2.6.x/iteraid.c:3748: error: syntax error before "pAdap"
/home/max/33/src/2.6.x/iteraid.c:3762: error: `Srb' undeclared (first use in this function)
/home/max/33/src/2.6.x/iteraid.c:3933: error: `pAdap' undeclared (first use in this function)
/home/max/33/src/2.6.x/iteraid.c: At top level:
/home/max/33/src/2.6.x/iteraid.c:4123: error: syntax error before "pChan"
/home/max/33/src/2.6.x/iteraid.c:4124: warning: function declaration isn't a prototype
/home/max/33/src/2.6.x/iteraid.c: In function `IdeSendCommand':
/home/max/33/src/2.6.x/iteraid.c:4129: error: `Scsi_Cmnd' undeclared (first use in this function)
/home/max/33/src/2.6.x/iteraid.c:4129: error: `pREQ' undeclared (first use in this function)
/home/max/33/src/2.6.x/iteraid.c:4130: warning: ISO C90 forbids mixed declarations and code
/home/max/33/src/2.6.x/iteraid.c:4133: error: `Srb' undeclared (first use in this function)
/home/max/33/src/2.6.x/iteraid.c:4147: error: `pChan' undeclared (first use in this function)
/home/max/33/src/2.6.x/iteraid.c: At top level:
/home/max/33/src/2.6.x/iteraid.c:4273: error: syntax error before "pChan"
/home/max/33/src/2.6.x/iteraid.c:4274: warning: function declaration isn't a prototype
/home/max/33/src/2.6.x/iteraid.c: In function `AtapiStartIo':
/home/max/33/src/2.6.x/iteraid.c:4281: error: `Srb' undeclared (first use in this function)
/home/max/33/src/2.6.x/iteraid.c:4288: error: `pChan' undeclared (first use in this function)
/home/max/33/src/2.6.x/iteraid.c: At top level:
/home/max/33/src/2.6.x/iteraid.c:4362: error: syntax error before '*' token
/home/max/33/src/2.6.x/iteraid.c:4363: warning: function declaration isn't a prototype
/home/max/33/src/2.6.x/iteraid.c: In function `MapRequest':
/home/max/33/src/2.6.x/iteraid.c:4365: error: `Srb' undeclared (first use in this function)
/home/max/33/src/2.6.x/iteraid.c:4366: error: `pREQ' undeclared (first use in this function)
/home/max/33/src/2.6.x/iteraid.c: At top level:
/home/max/33/src/2.6.x/iteraid.c:4426: error: syntax error before "pChan"
/home/max/33/src/2.6.x/iteraid.c:4427: warning: function declaration isn't a prototype
/home/max/33/src/2.6.x/iteraid.c: In function `TaskDone':
/home/max/33/src/2.6.x/iteraid.c:4429: error: `Scsi_Cmnd' undeclared (first use in this function)
/home/max/33/src/2.6.x/iteraid.c:4429: error: `pREQ' undeclared (first use in this function)
/home/max/33/src/2.6.x/iteraid.c:4429: error: `Srb' undeclared (first use in this function)
/home/max/33/src/2.6.x/iteraid.c:4431: error: `pChan' undeclared (first use in this function)
/home/max/33/src/2.6.x/iteraid.c:4437: error: `DID_OK' undeclared (first use in this function)
/home/max/33/src/2.6.x/iteraid.c:4441: error: `DID_NO_CONNECT' undeclared (first use in this function)
/home/max/33/src/2.6.x/iteraid.c:4445: error: `DID_BUS_BUSY' undeclared (first use in this function)
/home/max/33/src/2.6.x/iteraid.c:4449: error: `DID_RESET' undeclared (first use in this function)
/home/max/33/src/2.6.x/iteraid.c:4456: error: `DID_BAD_TARGET' undeclared (first use in this function)
/home/max/33/src/2.6.x/iteraid.c:4464: error: `DRIVER_SENSE' undeclared (first use in this function)
/home/max/33/src/2.6.x/iteraid.c: At top level:
/home/max/33/src/2.6.x/iteraid.c:4488: error: syntax error before "pChan"
/home/max/33/src/2.6.x/iteraid.c:4489: warning: function declaration isn't a prototype
/home/max/33/src/2.6.x/iteraid.c: In function `TaskStart':
/home/max/33/src/2.6.x/iteraid.c:4491: error: syntax error before "Srb"
/home/max/33/src/2.6.x/iteraid.c:4495: error: `Srb' undeclared (first use in this function)
/home/max/33/src/2.6.x/iteraid.c:4495: error: `pChan' undeclared (first use in this function)
/home/max/33/src/2.6.x/iteraid.c:4505: error: `pREQ' undeclared (first use in this function)
/home/max/33/src/2.6.x/iteraid.c: In function `TaskQueue':
/home/max/33/src/2.6.x/iteraid.c:4523: error: `Scsi_Cmnd' undeclared (first use in this function)
/home/max/33/src/2.6.x/iteraid.c:4523: error: `SCpnt' undeclared (first use in this function)
/home/max/33/src/2.6.x/iteraid.c:4524: error: syntax error before "pChan"
/home/max/33/src/2.6.x/iteraid.c:4532: error: syntax error before ')' token
/home/max/33/src/2.6.x/iteraid.c:4540: error: request for member `SCp' in something not a structure or union
/home/max/33/src/2.6.x/iteraid.c:4555: error: `DID_BAD_TARGET' undeclared (first use in this function)
/home/max/33/src/2.6.x/iteraid.c:4563: error: `pAdap' undeclared (first use in this function)
/home/max/33/src/2.6.x/iteraid.c:4564: error: `pChan' undeclared (first use in this function)
/home/max/33/src/2.6.x/iteraid.c: At top level:
/home/max/33/src/2.6.x/iteraid.c:4588: error: syntax error before '*' token
/home/max/33/src/2.6.x/iteraid.c:4588: error: syntax error before '*' token
/home/max/33/src/2.6.x/iteraid.c:4609: warning: type defaults to `int' in declaration of `it8212_req_last'
/home/max/33/src/2.6.x/iteraid.c:4609: error: conflicting types for `it8212_req_last'
/home/max/33/src/2.6.x/iteraid.c:276: error: previous declaration of `it8212_req_last'
/home/max/33/src/2.6.x/iteraid.c:4609: error: `SCpnt' undeclared here (not in a function)
/home/max/33/src/2.6.x/iteraid.c:4609: warning: data definition has no type or storage class
/home/max/33/src/2.6.x/iteraid.c:4610: error: syntax error before "do"
/home/max/33/src/2.6.x/iteraid.c:4610: error: `flags' undeclared here (not in a function)
/home/max/33/src/2.6.x/iteraid.c:4610: warning: type defaults to `int' in declaration of `__dummy2'
/home/max/33/src/2.6.x/iteraid.c:4610: error: syntax error before "void"
/home/max/33/src/2.6.x/iteraid.c:4612: warning: type defaults to `int' in declaration of `TaskQueue'
/home/max/33/src/2.6.x/iteraid.c:4612: warning: function declaration isn't a prototype
/home/max/33/src/2.6.x/iteraid.c:4612: error: conflicting types for `TaskQueue'
/home/max/33/src/2.6.x/iteraid.c:4520: error: previous declaration of `TaskQueue'
/home/max/33/src/2.6.x/iteraid.c:4612: warning: data definition has no type or storage class
/home/max/33/src/2.6.x/iteraid.c:4614: error: syntax error before "do"
/home/max/33/src/2.6.x/iteraid.c:4626: error: syntax error before '*' token
/home/max/33/src/2.6.x/iteraid.c:4627: warning: function declaration isn't a prototype
/home/max/33/src/2.6.x/iteraid.c: In function `internal_done':
/home/max/33/src/2.6.x/iteraid.c:4629: error: `SCpnt' undeclared (first use in this function)
/home/max/33/src/2.6.x/iteraid.c: At top level:
/home/max/33/src/2.6.x/iteraid.c:4640: error: syntax error before '*' token
/home/max/33/src/2.6.x/iteraid.c:4641: warning: function declaration isn't a prototype
/home/max/33/src/2.6.x/iteraid.c: In function `iteraid_command':
/home/max/33/src/2.6.x/iteraid.c:4645: error: `SCpnt' undeclared (first use in this function)
/home/max/33/src/2.6.x/iteraid.c:4646: warning: implicit declaration of function `iteraid_queuecommand'
/home/max/33/src/2.6.x/iteraid.c:4657: error: `DID_ERROR' undeclared (first use in this function)
/home/max/33/src/2.6.x/iteraid.c: At top level:
/home/max/33/src/2.6.x/iteraid.c:4667: error: syntax error before "PChannel"
/home/max/33/src/2.6.x/iteraid.c:4668: warning: function declaration isn't a prototype
/home/max/33/src/2.6.x/iteraid.c: In function `IdeMediaStatus':
/home/max/33/src/2.6.x/iteraid.c:4675: error: `EnableMSN' undeclared (first use in this function)
/home/max/33/src/2.6.x/iteraid.c:4680: error: `pChan' undeclared (first use in this function)
/home/max/33/src/2.6.x/iteraid.c:4680: error: `Device' undeclared (first use in this function)
/home/max/33/src/2.6.x/iteraid.c: At top level:
/home/max/33/src/2.6.x/iteraid.c:4728: error: syntax error before "pChan"
/home/max/33/src/2.6.x/iteraid.c:4729: warning: function declaration isn't a prototype
/home/max/33/src/2.6.x/iteraid.c: In function `IssueIdentify':
/home/max/33/src/2.6.x/iteraid.c:4738: error: `pChan' undeclared (first use in this function)
/home/max/33/src/2.6.x/iteraid.c:4740: error: `Command' undeclared (first use in this function)
/home/max/33/src/2.6.x/iteraid.c:4760: error: `DeviceNumber' undeclared (first use in this function)
/home/max/33/src/2.6.x/iteraid.c: At top level:
/home/max/33/src/2.6.x/iteraid.c:4950: error: syntax error before "pChan"
/home/max/33/src/2.6.x/iteraid.c:4951: warning: function declaration isn't a prototype
/home/max/33/src/2.6.x/iteraid.c: In function `iteraid_find_device':
/home/max/33/src/2.6.x/iteraid.c:4962: error: `pChan' undeclared (first use in this function)
/home/max/33/src/2.6.x/iteraid.c:5005: error: `channel' undeclared (first use in this function)
/home/max/33/src/2.6.x/iteraid.c: At top level:
/home/max/33/src/2.6.x/iteraid.c:5084: error: syntax error before "pAdap"
/home/max/33/src/2.6.x/iteraid.c:5085: warning: function declaration isn't a prototype
/home/max/33/src/2.6.x/iteraid.c: In function `AtapiHwInitialize':
/home/max/33/src/2.6.x/iteraid.c:5098: error: `pAdap' undeclared (first use in this function)
/home/max/33/src/2.6.x/iteraid.c:5100: error: `pChan' undeclared (first use in this function)
/home/max/33/src/2.6.x/iteraid.c:5113: error: `channel' undeclared (first use in this function)
/home/max/33/src/2.6.x/iteraid.c: At top level:
/home/max/33/src/2.6.x/iteraid.c:5135: error: syntax error before "pAdap"
/home/max/33/src/2.6.x/iteraid.c:5136: warning: function declaration isn't a prototype
/home/max/33/src/2.6.x/iteraid.c: In function `iteraid_init':
/home/max/33/src/2.6.x/iteraid.c:5145: error: syntax error before "pChan"
/home/max/33/src/2.6.x/iteraid.c:5152: error: `pAdap' undeclared (first use in this function)
/home/max/33/src/2.6.x/iteraid.c:5163: error: syntax error before "kmalloc"
/home/max/33/src/2.6.x/iteraid.c:5176: error: invalid type argument of `->'
/home/max/33/src/2.6.x/iteraid.c:5197: error: `pChan' undeclared (first use in this function)
/home/max/33/src/2.6.x/iteraid.c: At top level:
/home/max/33/src/2.6.x/iteraid.c:5272: error: syntax error before '*' token
/home/max/33/src/2.6.x/iteraid.c:5273: warning: function declaration isn't a prototype
/home/max/33/src/2.6.x/iteraid.c: In function `iteraid_detect':
/home/max/33/src/2.6.x/iteraid.c:5279: error: syntax error before "pChan"
/home/max/33/src/2.6.x/iteraid.c:5296: error: `pAdap' undeclared (first use in this function)
/home/max/33/src/2.6.x/iteraid.c:5296: error: syntax error before "kmalloc"
/home/max/33/src/2.6.x/iteraid.c:5338: error: `pChan' undeclared (first use in this function)
/home/max/33/src/2.6.x/iteraid.c:5348: error: `tpnt' undeclared (first use in this function)
/home/max/33/src/2.6.x/iteraid.c:5350: error: dereferencing pointer to incomplete type
/home/max/33/src/2.6.x/iteraid.c:5351: error: dereferencing pointer to incomplete type
/home/max/33/src/2.6.x/iteraid.c:5352: error: dereferencing pointer to incomplete type
/home/max/33/src/2.6.x/iteraid.c:5353: error: dereferencing pointer to incomplete type
/home/max/33/src/2.6.x/iteraid.c:5354: error: dereferencing pointer to incomplete type
/home/max/33/src/2.6.x/iteraid.c: In function `iteraid_release':
/home/max/33/src/2.6.x/iteraid.c:5400: error: syntax error before "pAdap"
/home/max/33/src/2.6.x/iteraid.c:5416: error: `pAdap' undeclared (first use in this function)
/home/max/33/src/2.6.x/iteraid.c: At top level:
/home/max/33/src/2.6.x/iteraid.c:5441: error: syntax error before '*' token
/home/max/33/src/2.6.x/iteraid.c:5442: warning: function declaration isn't a prototype
/home/max/33/src/2.6.x/iteraid.c: In function `iteraid_reset_eh':
/home/max/33/src/2.6.x/iteraid.c:5446: error: syntax error before "pChan"
/home/max/33/src/2.6.x/iteraid.c:5449: error: `SCpnt' undeclared (first use in this function)
/home/max/33/src/2.6.x/iteraid.c:5452: error: `FAILED' undeclared (first use in this function)
/home/max/33/src/2.6.x/iteraid.c:5457: error: `pAdap' undeclared (first use in this function)
/home/max/33/src/2.6.x/iteraid.c:5460: error: `pChan' undeclared (first use in this function)
/home/max/33/src/2.6.x/iteraid.c:5465: error: `SUCCESS' undeclared (first use in this function)
/home/max/33/src/2.6.x/iteraid.c: At top level:
/home/max/33/src/2.6.x/iteraid.c:5473: error: syntax error before '*' token
/home/max/33/src/2.6.x/iteraid.c:5474: warning: function declaration isn't a prototype
/home/max/33/src/2.6.x/iteraid.c: In function `iteraid_abort_eh':
/home/max/33/src/2.6.x/iteraid.c:5476: error: `SCpnt' undeclared (first use in this function)
/home/max/33/src/2.6.x/iteraid.c:5479: error: `FAILED' undeclared (first use in this function)
/home/max/33/src/2.6.x/iteraid.c:5482: error: `SUCCESS' undeclared (first use in this function)
/home/max/33/src/2.6.x/iteraid.c: At top level:
/home/max/33/src/2.6.x/iteraid.c:5502: warning: `struct scsi_device' declared inside parameter list
/home/max/33/src/2.6.x/iteraid.c:5503: error: conflicting types for `iteraid_biosparam'
/home/max/33/src/2.6.x/iteraid.h:1492: error: previous declaration of `iteraid_biosparam'
/home/max/33/src/2.6.x/iteraid.c: In function `itedev_open':
/home/max/33/src/2.6.x/iteraid.c:5581: warning: `MOD_INC_USE_COUNT' is deprecated (declared at include/linux/module.h:555)
/home/max/33/src/2.6.x/iteraid.c: In function `itedev_ioctl':
/home/max/33/src/2.6.x/iteraid.c:5632: error: syntax error before "pAdap"
/home/max/33/src/2.6.x/iteraid.c:5700: error: `pAdap' undeclared (first use in this function)
/home/max/33/src/2.6.x/iteraid.c:5713: error: `pChan' undeclared (first use in this function)
/home/max/33/src/2.6.x/iteraid.c: In function `itedev_close':
/home/max/33/src/2.6.x/iteraid.c:5818: warning: `MOD_DEC_USE_COUNT' is deprecated (declared at include/linux/module.h:567)
/home/max/33/src/2.6.x/iteraid.c: At top level:
/home/max/33/src/2.6.x/iteraid.c:5827: error: syntax error before "driver_template"
/home/max/33/src/2.6.x/iteraid.c:5827: warning: type defaults to `int' in declaration of `driver_template'
/home/max/33/src/2.6.x/iteraid.c:5829: error: field name not in record or union initializer
/home/max/33/src/2.6.x/iteraid.c:5829: error: (near initialization for `driver_template')
/home/max/33/src/2.6.x/iteraid.c:5829: warning: initialization makes integer from pointer without a cast
/home/max/33/src/2.6.x/iteraid.c:5830: error: field name not in record or union initializer
/home/max/33/src/2.6.x/iteraid.c:5830: error: (near initialization for `driver_template')
/home/max/33/src/2.6.x/iteraid.c:5830: warning: excess elements in scalar initializer
/home/max/33/src/2.6.x/iteraid.c:5830: warning: (near initialization for `driver_template')
/home/max/33/src/2.6.x/iteraid.c:5831: error: field name not in record or union initializer
/home/max/33/src/2.6.x/iteraid.c:5831: error: (near initialization for `driver_template')
/home/max/33/src/2.6.x/iteraid.c:5831: warning: excess elements in scalar initializer
/home/max/33/src/2.6.x/iteraid.c:5831: warning: (near initialization for `driver_template')
/home/max/33/src/2.6.x/iteraid.c:5832: error: field name not in record or union initializer
/home/max/33/src/2.6.x/iteraid.c:5832: error: (near initialization for `driver_template')
/home/max/33/src/2.6.x/iteraid.c:5832: warning: excess elements in scalar initializer
/home/max/33/src/2.6.x/iteraid.c:5832: warning: (near initialization for `driver_template')
/home/max/33/src/2.6.x/iteraid.c:5833: error: field name not in record or union initializer
/home/max/33/src/2.6.x/iteraid.c:5833: error: (near initialization for `driver_template')
/home/max/33/src/2.6.x/iteraid.c:5833: warning: excess elements in scalar initializer
/home/max/33/src/2.6.x/iteraid.c:5833: warning: (near initialization for `driver_template')
/home/max/33/src/2.6.x/iteraid.c:5834: error: field name not in record or union initializer
/home/max/33/src/2.6.x/iteraid.c:5834: error: (near initialization for `driver_template')
/home/max/33/src/2.6.x/iteraid.c:5834: error: `iteraid_queuecommand' undeclared here (not in a function)
/home/max/33/src/2.6.x/iteraid.c:5834: warning: excess elements in scalar initializer
/home/max/33/src/2.6.x/iteraid.c:5834: warning: (near initialization for `driver_template')
/home/max/33/src/2.6.x/iteraid.c:5835: error: field name not in record or union initializer
/home/max/33/src/2.6.x/iteraid.c:5835: error: (near initialization for `driver_template')
/home/max/33/src/2.6.x/iteraid.c:5835: warning: excess elements in scalar initializer
/home/max/33/src/2.6.x/iteraid.c:5835: warning: (near initialization for `driver_template')
/home/max/33/src/2.6.x/iteraid.c:5836: error: field name not in record or union initializer
/home/max/33/src/2.6.x/iteraid.c:5836: error: (near initialization for `driver_template')
/home/max/33/src/2.6.x/iteraid.c:5836: warning: excess elements in scalar initializer
/home/max/33/src/2.6.x/iteraid.c:5836: warning: (near initialization for `driver_template')
/home/max/33/src/2.6.x/iteraid.c:5837: error: field name not in record or union initializer
/home/max/33/src/2.6.x/iteraid.c:5837: error: (near initialization for `driver_template')
/home/max/33/src/2.6.x/iteraid.c:5837: warning: excess elements in scalar initializer
/home/max/33/src/2.6.x/iteraid.c:5837: warning: (near initialization for `driver_template')
/home/max/33/src/2.6.x/iteraid.c:5838: error: field name not in record or union initializer
/home/max/33/src/2.6.x/iteraid.c:5838: error: (near initialization for `driver_template')
/home/max/33/src/2.6.x/iteraid.c:5838: warning: excess elements in scalar initializer
/home/max/33/src/2.6.x/iteraid.c:5838: warning: (near initialization for `driver_template')
/home/max/33/src/2.6.x/iteraid.c:5839: error: field name not in record or union initializer
/home/max/33/src/2.6.x/iteraid.c:5839: error: (near initialization for `driver_template')
/home/max/33/src/2.6.x/iteraid.c:5839: warning: excess elements in scalar initializer
/home/max/33/src/2.6.x/iteraid.c:5839: warning: (near initialization for `driver_template')
/home/max/33/src/2.6.x/iteraid.c:5840: error: field name not in record or union initializer
/home/max/33/src/2.6.x/iteraid.c:5840: error: (near initialization for `driver_template')
/home/max/33/src/2.6.x/iteraid.c:5840: warning: excess elements in scalar initializer
/home/max/33/src/2.6.x/iteraid.c:5840: warning: (near initialization for `driver_template')
/home/max/33/src/2.6.x/iteraid.c:5841: error: field name not in record or union initializer
/home/max/33/src/2.6.x/iteraid.c:5841: error: (near initialization for `driver_template')
/home/max/33/src/2.6.x/iteraid.c:5841: warning: excess elements in scalar initializer
/home/max/33/src/2.6.x/iteraid.c:5841: warning: (near initialization for `driver_template')
/home/max/33/src/2.6.x/iteraid.c:5842: error: field name not in record or union initializer
/home/max/33/src/2.6.x/iteraid.c:5842: error: (near initialization for `driver_template')
/home/max/33/src/2.6.x/iteraid.c:5842: warning: excess elements in scalar initializer
/home/max/33/src/2.6.x/iteraid.c:5842: warning: (near initialization for `driver_template')
/home/max/33/src/2.6.x/iteraid.c:5843: error: field name not in record or union initializer
/home/max/33/src/2.6.x/iteraid.c:5843: error: (near initialization for `driver_template')
/home/max/33/src/2.6.x/iteraid.c:5843: warning: excess elements in scalar initializer
/home/max/33/src/2.6.x/iteraid.c:5843: warning: (near initialization for `driver_template')
/home/max/33/src/2.6.x/iteraid.c:5844: error: field name not in record or union initializer
/home/max/33/src/2.6.x/iteraid.c:5844: error: (near initialization for `driver_template')
/home/max/33/src/2.6.x/iteraid.c:5845: warning: excess elements in scalar initializer
/home/max/33/src/2.6.x/iteraid.c:5845: warning: (near initialization for `driver_template')
/home/max/33/src/2.6.x/iteraid.c:5845: warning: data definition has no type or storage class
/home/max/33/src/2.6.x/iteraid.c:5846:25: scsi_module.c: No such file or directory
/home/max/33/src/2.6.x/iteraid.c:4668: warning: `IdeMediaStatus' defined but not used
make[2]: *** [/home/max/33/src/2.6.x/iteraid.o] Error 1
make[1]: *** [_module_/home/max/33/src/2.6.x] Error 2
make[1]: Leaving directory `/usr/src/linux-2.6.9-gentoo-r13'
make: *** [modules] Error 2