All pastes #164360 Raw Edit

Mine

public text v1 · immutable
·published 2006-09-08 15:28 UTC
rendered paste body
Automaton `athlon_fp'
    15522 NDFA states,          99908 NDFA arcs
    15522 DFA states,           99908 DFA arcs
      463 minimal DFA states,    3038 minimal DFA arcs
      273 all insns         21 insn equivalence classes
 3057 transition comb vector els,  9723 trans table els: use comb vect
 3057 state alts comb vector els,  9723 state alts table els: use comb vect
 9723 min delay table els, compression factor 1

17533 all allocated states,     102661 all allocated arcs
32710 all allocated alternative states
 6256 all transition comb vector els, 16780 all trans table els
 6256 all state alts comb vector els, 16780 all state alts table els
16780 all min delay table els
    0 locked states num

  transformation: 0.270000, building DFA: 271.230000
  DFA minimization: 6.910000, making insn equivalence: 0.060000
 all automaton generation: 285.250000, output: 2.260000
/bin/sh /var/tmp/portage/gcc-4.1.1/work/gcc-4.1.1/gcc/../move-if-change tmp-attrtab.c insn-attrtab.c
insn-attrtab.c is unchanged
echo timestamp > s-attrtab
stage1/xgcc -Bstage1/ -B/usr/i386-pc-linux-gnu/bin/   -O2 -mtune=i686 -pipe -fprofile-generate -DIN_GCC   -W -Wall -Wwrite-strings -Wstrict-prototypes -Wmissing-prototypes -pedantic -Wno-long-long -Wno-variadic-macros -Wold-style-definition -Wmissing-format-attribute     -DHAVE_CONFIG_H -I. -I. -I/var/tmp/portage/gcc-4.1.1/work/gcc-4.1.1/gcc -I/var/tmp/portage/gcc-4.1.1/work/gcc-4.1.1/gcc/. -I/var/tmp/portage/gcc-4.1.1/work/gcc-4.1.1/gcc/../include -I/var/tmp/portage/gcc-4.1.1/work/gcc-4.1.1/gcc/../libcpp/include     -c insn-attrtab.c \
  -o insn-attrtab.o
{standard input}: Assembler messages:
{standard input}:33467: Warning: end of file not at end of a line; newline inserted
xgcc: Internal error: Killed (program cc1)
Please submit a full bug report.
See <URL:http://bugs.gentoo.org/> for instructions.
make[2]: *** [insn-attrtab.o] Error 1
make[2]: Leaving directory `/var/tmp/portage/gcc-4.1.1/work/build/gcc'
make[1]: *** [stageprofile_build] Error 2
make[1]: Leaving directory `/var/tmp/portage/gcc-4.1.1/work/build/gcc'
make: *** [profiledbootstrap] Error 2

!!! ERROR: sys-devel/gcc-4.1.1 failed.
Call stack:
  ebuild.sh, line 1539:   Called dyn_compile
  ebuild.sh, line 939:   Called src_compile
  ebuild.sh, line 1248:   Called toolchain_src_compile
  toolchain.eclass, line 24:   Called gcc_src_compile
  toolchain.eclass, line 1529:   Called gcc_do_make
  toolchain.eclass, line 1403:   Called die

!!! emake failed with profiledbootstrap
!!! If you need support, post the topmost build error, and the call stack if relevant.