rendered paste bodycreating xineplug_decode_dxr3_video.la
video_out_dxr3.c:94: error: expected expression before '__attribute__'
video_out_dxr3.c: In function 'dxr3_vo_open_plugin':
video_out_dxr3.c:409: warning: passing argument 4 of 'config->register_enum' from incompatible pointer type
video_out_dxr3.c:464: warning: passing argument 4 of 'config->register_enum' from incompatible pointer type
video_out_dxr3.c: In function 'dxr3_update_frame_format':
video_out_dxr3.c:737: warning: passing argument 3 of 'xine_xmalloc_aligned' from incompatible pointer type
video_out_dxr3.c:765: warning: passing argument 3 of 'xine_xmalloc_aligned' from incompatible pointer type
make[3]: *** [xineplug_vo_out_dxr3_la-video_out_dxr3.lo] Error 1
make[3]: *** Waiting for unfinished jobs....
libtool-nofpic: link: warning: `/usr/lib/gcc/x86_64-pc-linux-gnu/4.1.1/../../..//libfreetype.la' seems to be moved
(cd .libs && rm -f xineplug_decode_dxr3_video.la && ln -s ../xineplug_decode_dxr3_video.la xineplug_decode_dxr3_video.la)
x86_64-pc-linux-gnu-gcc -shared .libs/xineplug_decode_dxr3_spu_la-dxr3_decode_spu.o .libs/xineplug_decode_dxr3_spu_la-nav_read.o -Wl,--rpath -Wl,/var/tmp/portage/xine-lib-1.1.2-r2/work/xine-lib-1.1.2/src/xine-engine/.libs ../../src/xine-engine/.libs/libxine.so -L/usr/lib/gcc/x86_64-pc-linux-gnu/4.1.1/../../../ -march=athlon64 -msse3 -Wl,-soname -Wl,xineplug_decode_dxr3_spu.so -o .libs/xineplug_decode_dxr3_spu.so
creating xineplug_decode_dxr3_spu.la
(cd .libs && rm -f xineplug_decode_dxr3_spu.la && ln -s ../xineplug_decode_dxr3_spu.la xineplug_decode_dxr3_spu.la)
make[3]: Leaving directory `/var/tmp/portage/xine-lib-1.1.2-r2/work/xine-lib-1.1.2/src/dxr3'
make[2]: *** [all-recursive] Error 1
make[2]: Leaving directory `/var/tmp/portage/xine-lib-1.1.2-r2/work/xine-lib-1.1.2/src'
make[1]: *** [all-recursive] Error 1
make[1]: Leaving directory `/var/tmp/portage/xine-lib-1.1.2-r2/work/xine-lib-1.1.2'
make: *** [all] Error 2
!!! ERROR: media-libs/xine-lib-1.1.2-r2 failed.
Call stack:
ebuild.sh, line 1539: Called dyn_compile
ebuild.sh, line 939: Called src_compile
xine-lib-1.1.2-r2.ebuild, line 227: Called die
!!! emake failed
!!! If you need support, post the topmost build error, and the call stack if relevant.