All pastes #1632837 Raw Edit

as

public text v1 · immutable
#1632837 ·published 2009-10-20 15:22 UTC
rendered paste body
init:

lib/apitooling-ant.jar:

properties:

init:

build.sources:

properties:

init:

src.zip:

zip.src.zip:
      [zip] Building zip: /home/eclipsebuild/eclipse-build/build/eclipse-R3_5_1-fetched-src/plugins/org.eclipse.pde.api.tools/src.zip

properties:

init:

lib/apitooling-antsrc.zip:

zip.lib/apitooling-antsrc.zip:
      [zip] Building zip: /home/eclipsebuild/eclipse-build/build/eclipse-R3_5_1-fetched-src/plugins/org.eclipse.pde.api.tools/lib/apitooling-antsrc.zip

properties:

init:

     [echo] org.eclipse.pde.build_3.5.1.R35x_20090820
  [symlink] ln -s org.eclipse.pde.build_3.5.1.R35x_20090820 bootstrap/plugins/org.eclipse.pde.build
      [jar] Building jar: /home/eclipsebuild/eclipse-build/bootstrap/plugins/org.eclipse.equinox.launcher.jar
      [jar] Building jar: /home/eclipsebuild/eclipse-build/bootstrap/plugins/org.eclipse.equinox.common.jar
      [jar] Building jar: /home/eclipsebuild/eclipse-build/bootstrap/plugins/org.eclipse.osgi.jar
      [jar] Building jar: /home/eclipsebuild/eclipse-build/bootstrap/plugins/org.eclipse.update.configurator.jar
  [symlink] Removing symlink: bootstrap/plugins/org.eclipse.osgi
  [symlink] Removing symlink: bootstrap/plugins/org.eclipse.equinox.common
  [symlink] Removing symlink: bootstrap/plugins/org.eclipse.update.configurator
  [symlink] Removing symlink: bootstrap/plugins/org.eclipse.equinox.launcher
   [delete] Deleting directory /home/eclipsebuild/eclipse-build/bootstrap/plugins/org.eclipse.equinox.common_3.5.1.R35x_v20090807-1100
   [delete] Deleting directory /home/eclipsebuild/eclipse-build/bootstrap/plugins/org.eclipse.equinox.launcher_1.0.201.R35x_v20090715
   [delete] Deleting directory /home/eclipsebuild/eclipse-build/bootstrap/plugins/org.eclipse.update.configurator_3.3.0.v20090312
   [delete] Deleting directory /home/eclipsebuild/eclipse-build/bootstrap/plugins/org.eclipse.osgi_3.5.1.R35x_v20090827
   [delete] DEPRECATED - Use of the implicit FileSet is deprecated.  Use a nested fileset element instead.
  [symlink] Removing symlink: bootstrap/plugins/org.eclipse.osgi_3.5.0.jar
  [symlink] ln -s org.eclipse.osgi.jar bootstrap/plugins/org.eclipse.osgi_3.5.0.jar

cleanBuild:

compilelibs:

properties:

init:

build.cfiles:
    [mkdir] Created dir: /home/eclipsebuild/eclipse-build/build/eclipse-R3_5_1-fetched-src/plugins/org.eclipse.swt.gtk.linux.ppc64/library
     [copy] Copying 77 files to /home/eclipsebuild/eclipse-build/build/eclipse-R3_5_1-fetched-src/plugins/org.eclipse.swt.gtk.linux.ppc64/library

build.nativeLibraries:
     [exec] libgnome-2.0 and libgnomeui-2.0 not found:
     [exec]     *** SWT Program support for GNOME will not be compiled.
     [exec] Cairo not found:
     [exec]     *** Advanced graphics support using cairo will not be compiled.
     [exec] None of the following libraries were found:  Mozilla/XPCOM, Firefox/XPCOM, or XULRunner/XPCOM
     [exec]     *** Mozilla embedding support will not be compiled.
     [exec] libjawt.so not found, the SWT/AWT integration library will not be compiled.
     [exec] Building SWT/GTK+ for linux ppc64
     [exec] gcc -O -Wall -DSWT_VERSION=3555  -DLINUX -DGTK -I/opt/ibm/java-ppc64-60/jre/include -I/opt/ibm/java-ppc64-60/jre/include/linux -fPIC -DJNI64 -c swt.c
     [exec] gcc -O -Wall -DSWT_VERSION=3555  -DLINUX -DGTK -I/opt/ibm/java-ppc64-60/jre/include -I/opt/ibm/java-ppc64-60/jre/include/linux -fPIC -DJNI64   -c -o c.o c.c
     [exec] gcc -O -Wall -DSWT_VERSION=3555  -DLINUX -DGTK -I/opt/ibm/java-ppc64-60/jre/include -I/opt/ibm/java-ppc64-60/jre/include/linux -fPIC -DJNI64   -c -o c_stats.o c_stats.c
     [exec] c.c: In function Java_org_eclipse_swt_internal_C_free:
     [exec] c.c:35: warning: cast to pointer from integer of different size
     [exec] c.c: In function Java_org_eclipse_swt_internal_C_getenv:
     [exec] c.c:48: warning: cast from pointer to integer of different size
     [exec] c.c: In function Java_org_eclipse_swt_internal_C_malloc:
     [exec] c.c:62: warning: cast from pointer to integer of different size
     [exec] c.c: In function Java_org_eclipse_swt_internal_C_memmove__JJJ:
     [exec] c.c:80: warning: cast to pointer from integer of different size
     [exec] c.c:80: warning: cast to pointer from integer of different size
     [exec] c.c: In function Java_org_eclipse_swt_internal_C_memmove__J_3BJ:
     [exec] c.c:110: warning: cast to pointer from integer of different size
     [exec] c.c: In function Java_org_eclipse_swt_internal_C_memmove__J_3CJ:
     [exec] c.c:149: warning: cast to pointer from integer of different size
     [exec] c.c: In function Java_org_eclipse_swt_internal_C_memmove__J_3DJ:
     [exec] c.c:188: warning: cast to pointer from integer of different size
     [exec] c.c: In function Java_org_eclipse_swt_internal_C_memmove__J_3FJ:
     [exec] c.c:227: warning: cast to pointer from integer of different size
     [exec] c.c: In function Java_org_eclipse_swt_internal_C_memmove__J_3IJ:
     [exec] c.c:266: warning: cast to pointer from integer of different size
     [exec] c.c: In function Java_org_eclipse_swt_internal_C_memmove__J_3JJ:
     [exec] c.c:305: warning: cast to pointer from integer of different size
     [exec] c.c: In function Java_org_eclipse_swt_internal_C_memmove__J_3SJ:
     [exec] c.c:344: warning: cast to pointer from integer of different size
     [exec] c.c: In function Java_org_eclipse_swt_internal_C_memmove___3BJJ:
     [exec] c.c:383: warning: cast to pointer from integer of different size
     [exec] c.c: In function Java_org_eclipse_swt_internal_C_memmove___3CJJ:
     [exec] c.c:466: warning: cast to pointer from integer of different size
     [exec] c.c: In function Java_org_eclipse_swt_internal_C_memmove___3DJJ:
     [exec] c.c:505: warning: cast to pointer from integer of different size
     [exec] c.c: In function Java_org_eclipse_swt_internal_C_memmove___3FJJ:
     [exec] c.c:544: warning: cast to pointer from integer of different size
     [exec] c.c: In function Java_org_eclipse_swt_internal_C_memmove___3IJJ:
     [exec] c.c:583: warning: cast to pointer from integer of different size
     [exec] c.c: In function Java_org_eclipse_swt_internal_C_memmove___3JJJ:
     [exec] c.c:664: warning: cast to pointer from integer of different size
     [exec] c.c: In function Java_org_eclipse_swt_internal_C_memmove___3SJJ:
     [exec] c.c:703: warning: cast to pointer from integer of different size
     [exec] c.c: In function Java_org_eclipse_swt_internal_C_memset:
     [exec] c.c:727: warning: cast to pointer from integer of different size
     [exec] c.c:727: warning: cast from pointer to integer of different size
     [exec] c.c: In function Java_org_eclipse_swt_internal_C_strlen:
     [exec] c.c:739: warning: cast to pointer from integer of different size
     [exec] gcc -O -Wall -DSWT_VERSION=3555  -DLINUX -DGTK -I/opt/ibm/java-ppc64-60/jre/include -I/opt/ibm/java-ppc64-60/jre/include/linux -fPIC -DJNI64 -DUSE_ASSEMBLER -c callback.c
     [exec] callback.c:446: error: initializer element is not constant
     [exec] callback.c:446: error: (near initialization for fnx_array[0][0])
     [exec] callback.c:446: error: initializer element is not constant
     [exec] callback.c:446: error: (near initialization for fnx_array[0][1])
     [exec] callback.c:446: error: initializer element is not constant
     [exec] callback.c:446: error: (near initialization for fnx_array[0][2])
     [exec] callback.c:446: error: initializer element is not constant
     [exec] callback.c:446: error: (near initialization for fnx_array[0][3])
     [exec] callback.c:446: error: initializer element is not constant
     [exec] callback.c:446: error: (near initialization for fnx_array[0][4])
     [exec] callback.c:446: error: initializer element is not constant
     [exec] callback.c:446: error: (near initialization for fnx_array[0][5])
     [exec] callback.c:446: error: initializer element is not constant
     [exec] callback.c:446: error: (near initialization for fnx_array[0][6])
     [exec] callback.c:446: error: initializer element is not constant
     [exec] callback.c:446: error: (near initialization for fnx_array[0][7])
     [exec] callback.c:446: error: initializer element is not constant
     [exec] callback.c:446: error: (near initialization for fnx_array[0][8])
     [exec] callback.c:446: error: initializer element is not constant
     [exec] callback.c:446: error: (near initialization for fnx_array[0][9])
     [exec] callback.c:446: error: initializer element is not constant
     [exec] callback.c:446: error: (near initialization for fnx_array[0][10])
     [exec] callback.c:446: error: initializer element is not constant
     [exec] callback.c:446: error: (near initialization for fnx_array[0][11])
     [exec] callback.c:446: error: initializer element is not constant
     [exec] callback.c:446: error: (near initialization for fnx_array[0][12])
     [exec] callback.c:446: error: initializer element is not constant
     [exec] callback.c:446: error: (near initialization for fnx_array[0][13])
     [exec] callback.c:446: error: initializer element is not constant
     [exec] callback.c:446: error: (near initialization for fnx_array[0][14])
     [exec] callback.c:446: error: initializer element is not constant
     [exec] callback.c:446: error: (near initialization for fnx_array[0][15])
     [exec] callback.c:446: error: initializer element is not constant
     [exec] callback.c:446: error: (near initialization for fnx_array[0][16])
     [exec] callback.c:446: error: initializer element is not constant
     [exec] callback.c:446: error: (near initialization for fnx_array[0][17])
     [exec] callback.c:446: error: initializer element is not constant
     [exec] callback.c:446: error: (near initialization for fnx_array[0][18])
     [exec] callback.c:446: error: initializer element is not constant
     [exec] callback.c:446: error: (near initialization for fnx_array[0][19])
     [exec] callback.c:446: error: initializer element is not constant
     [exec] callback.c:446: error: (near initialization for fnx_array[0][20])
     [exec] callback.c:446: error: initializer element is not constant
     [exec] callback.c:446: error: (near initialization for fnx_array[0][21])
     [exec] callback.c:446: error: initializer element is not constant
     [exec] callback.c:446: error: (near initialization for fnx_array[0][22])
     [exec] callback.c:446: error: initializer element is not constant
     [exec] callback.c:446: error: (near initialization for fnx_array[0][23])
     [exec] callback.c:446: error: initializer element is not constant
     [exec] callback.c:446: error: (near initialization for fnx_array[0][24])
     [exec] callback.c:446: error: initializer element is not constant
     [exec] callback.c:446: error: (near initialization for fnx_array[0][25])
     [exec] callback.c:446: error: initializer element is not constant
     [exec] callback.c:446: error: (near initialization for fnx_array[0][26])
     [exec] callback.c:446: error: initializer element is not constant
     [exec] callback.c:446: error: (near initialization for fnx_array[0][27])
     [exec] callback.c:446: error: initializer element is not constant
     [exec] callback.c:446: error: (near initialization for fnx_array[0][28])
     [exec] callback.c:446: error: initializer element is not constant
     [exec] callback.c:446: error: (near initialization for fnx_array[0][29])
     [exec] callback.c:446: error: initializer element is not constant
     [exec] callback.c:446: error: (near initialization for fnx_array[0][30])
     [exec] callback.c:446: error: initializer element is not constant
     [exec] callback.c:446: error: (near initialization for fnx_array[0][31])
     [exec] callback.c:446: error: initializer element is not constant
     [exec] callback.c:446: error: (near initialization for fnx_array[0][32])
     [exec] callback.c:446: error: initializer element is not constant
     [exec] callback.c:446: error: (near initialization for fnx_array[0][33])
     [exec] callback.c:446: error: initializer element is not constant
     [exec] callback.c:446: error: (near initialization for fnx_array[0][34])
     [exec] callback.c:446: error: initializer element is not constant
     [exec] callback.c:446: error: (near initialization for fnx_array[0][35])
     [exec] callback.c:446: error: initializer element is not constant
     [exec] callback.c:446: error: (near initialization for fnx_array[0][36])
     [exec] callback.c:454: error: initializer element is not constant
     [exec] callback.c:454: error: (near initialization for fnx_array[8][88])
     [exec] callback.c:454: error: initializer element is not constant
     [exec] callback.c:454: error: (near initialization for fnx_array[8][89])
     [exec] callback.c:454: error: initializer element is not constant
     [exec] callback.c:454: error: (near initialization for fnx_array[8][90])
     [exec] callback.c:454: error: initializer element is not constant
     [exec] callback.c:454: error: (near initialization for fnx_array[8][91])
     [exec] callback.c:454: error: initializer element is not constant
     [exec] callback.c:454: error: (near initialization for fnx_array[8][92])
     [exec] callback.c:454: error: initializer element is not constant
     [exec] callback.c:454: error: (near initialization for fnx_array[8][93])
     [exec] callback.c:454: error: initializer element is not constant
     [exec] callback.c:454: error: (near initialization for fnx_array[8][94])
     [exec] callback.c:454: error: initializer element is not constant
     [exec] callback.c:454: error: (near initialization for fnx_array[8][95])
     [exec] callback.c:454: error: initializer element is not constant
     [exec] callback.c:454: error: (near initialization for fnx_array[8][96])
     [exec] callback.c:454: error: initializer element is not constant
     [exec] callback.c:454: error: (near initialization for fnx_array[8][97])
     [exec] callback.c:454: error: initializer element is not constant
     [exec] callback.c:454: error: (near initialization for fnx_array[8][98])
     [exec] callback.c:454: error: initializer element is not constant
     [exec] callback.c:454: error: (near initialization for fnx_array[8][99])
     [exec] callback.c:454: error: initializer element is not constant
     [exec] callback.c:454: error: (near initialization for fnx_array[8][100])
     [exec] callback.c:454: error: initializer element is not constant
     [exec] callback.c:454: error: (near initialization for fnx_array[8][101])
     [exec] callback.c:454: error: initializer element is not constant
     [exec] callback.c:454: error: (near initialization for fnx_array[8][102])
     [exec] callback.c:454: error: initializer element is not constant
     [exec] callback.c:454: error: (near initialization for fnx_array[8][103])
     [exec] callback.c:454: error: initializer element is not constant
     [exec] callback.c:454: error: (near initialization for fnx_array[8][104])
     [exec] callback.c:454: error: initializer element is not constant
     [exec] callback.c:454: error: (near initialization for fnx_array[8][105])
     [exec] callback.c:454: error: initializer element is not constant
     [exec] callback.c:454: error: (near initialization for fnx_array[8][106])
     [exec] callback.c:454: error: initializer element is not constant
     [exec] callback.c:454: error: (near initialization for fnx_array[8][107])
     [exec] callback.c:454: error: initializer element is not constant
     [exec] callback.c:454: error: (near initialization for fnx_array[8][108])
     [exec] callback.c:454: error: initializer element is not constant
     [exec] callback.c:454: error: (near initialization for fnx_array[8][109])
     [exec] callback.c:454: error: initializer element is not constant
     [exec] callback.c:454: error: (near initialization for fnx_array[8][110])
     [exec] callback.c:454: error: initializer element is not constant
     [exec] callback.c:454: error: (near initialization for fnx_array[8][111])
     [exec] callback.c:454: error: initializer element is not constant
     [exec] callback.c:454: error: (near initialization for fnx_array[8][112])
     [exec] callback.c:454: error: initializer element is not constant
     [exec] callback.c:454: error: (near initialization for fnx_array[8][113])
     [exec] callback.c:454: error: initializer element is not constant
     [exec] callback.c:454: error: (near initialization for fnx_array[8][114])
     [exec] callback.c:454: error: initializer element is not constant
     [exec] callback.c:454: error: (near initialization for fnx_array[8][115])
     [exec] callback.c:454: error: initializer element is not constant
     [exec] callback.c:454: error: (near initialization for fnx_array[8][116])
     [exec] callback.c:454: error: initializer element is not constant
     [exec] callback.c:454: error: (near initialization for fnx_array[8][117])
     [exec] callback.c:454: error: initializer element is not constant
     [exec] callback.c:454: error: (near initialization for fnx_array[8][118])
     [exec] callback.c:454: error: initializer element is not constant
     [exec] callback.c:454: error: (near initialization for fnx_array[8][119])
     [exec] callback.c:454: error: initializer element is not constant
     [exec] callback.c:454: error: (near initialization for fnx_array[8][120])
     [exec] callback.c:454: error: initializer element is not constant
     [exec] callback.c:454: error: (near initialization for fnx_array[8][121])
     [exec] callback.c:454: error: initializer element is not constant
     [exec] callback.c:454: error: (near initialization for fnx_array[8][122])
     [exec] callback.c:454: error: initializer element is not constant
     [exec] callback.c:454: error: (near initialization for fnx_array[8][123])
     [exec] callback.c:454: error: initializer element is not constant
     [exec] callback.c:454: error: (near initialization for fnx_array[8][124])
     [exec] callback.c:454: error: initializer element is not constant
     [exec] callback.c:454: error: (near initialization for fnx_array[8][125])
     [exec] callback.c:454: error: initializer element is not constant
     [exec] callback.c:454: error: (near initialization for fnx_array[8][126])
     [exec] callback.c:454: error: initializer element is not constant
     [exec] callback.c:454: error: (near initialization for fnx_array[8][127])
     [exec] callback.c:455: error: initializer element is not constant
     [exec] callback.c:455: error: (near initialization for fnx_array[9][0])
     [exec] callback.c:455: error: initializer element is not constant
     [exec] callback.c:455: error: (near initialization for fnx_array[9][1])
     [exec] callback.c:455: error: initializer element is not constant
     [exec] callback.c:455: error: (near initialization for fnx_array[9][2])
     [exec] callback.c:455: error: initializer element is not constant
     [exec] callback.c:455: error: (near initialization for fnx_array[9][3])
     [exec] callback.c:455: error: initializer element is not constant
     [exec] callback.c:455: error: (near initialization for fnx_array[9][4])
     [exec] callback.c:455: error: initializer element is not constant
     [exec] callback.c:455: error: (near initialization for fnx_array[9][5])
     [exec] callback.c:455: error: initializer element is not constant
     [exec] callback.c:455: error: (near initialization for fnx_array[9][6])
     [exec] callback.c:455: error: initializer element is not constant
     [exec] callback.c:455: error: (near initialization for fnx_array[9][7])
     [exec] callback.c:455: error: initializer element is not constant
     [exec] callback.c:455: error: (near initialization for fnx_array[9][8])
     [exec] callback.c:455: error: initializer element is not constant
     [exec] callback.c:455: error: (near initialization for fnx_array[9][9])
     [exec] callback.c:455: error: initializer element is not constant
     [exec] callback.c:455: error: (near initialization for fnx_array[9][10])
     [exec] callback.c:455: error: initializer element is not constant
     [exec] callback.c:455: error: (near initialization for fnx_array[9][11])
     [exec] callback.c:455: error: initializer element is not constant
     [exec] callback.c:455: error: (near initialization for fnx_array[9][12])
     [exec] callback.c:455: error: initializer element is not constant
     [exec] callback.c:455: error: (near initialization for fnx_array[9][13])
     [exec] callback.c:455: error: initializer element is not constant
     [exec] callback.c:455: error: (near initialization for fnx_array[9][14])
     [exec] callback.c:455: error: initializer element is not constant
     [exec] callback.c:455: error: (near initialization for fnx_array[9][15])
     [exec] callback.c:455: error: initializer element is not constant
     [exec] callback.c:455: error: (near initialization for fnx_array[9][16])
     [exec] callback.c:455: error: initializer element is not constant
     [exec] callback.c:455: error: (near initialization for fnx_array[9][17])
     [exec] callback.c:455: error: initializer element is not constant
     [exec] callback.c:455: error: (near initialization for fnx_array[9][18])
     [exec] callback.c:455: error: initializer element is not constant
     [exec] callback.c:455: error: (near initialization for fnx_array[9][19])
     [exec] callback.c:455: error: initializer element is not constant
     [exec] callback.c:455: error: (near initialization for fnx_array[9][20])
     [exec] callback.c:455: error: initializer element is not constant
     [exec] callback.c:455: error: (near initialization for fnx_array[9][21])
     [exec] callback.c:455: error: initializer element is not constant
     [exec] callback.c:455: error: (near initialization for fnx_array[9][22])
     [exec] callback.c:455: error: initializer element is not constant
     [exec] callback.c:455: error: (near initialization for fnx_array[9][23])
     [exec] callback.c:455: error: initializer element is not constant
     [exec] callback.c:455: error: (near initialization for fnx_array[9][24])
     [exec] callback.c:455: error: initializer element is not constant
     [exec] callback.c:455: error: (near initialization for fnx_array[9][25])
     [exec] callback.c:455: error: initializer element is not constant
     [exec] callback.c:455: error: (near initialization for fnx_array[9][26])
     [exec] callback.c:455: error: initializer element is not constant
     [exec] callback.c:455: error: (near initialization for fnx_array[9][27])
     [exec] callback.c:455: error: initializer element is not constant
     [exec] callback.c:455: error: (near initialization for fnx_array[9][28])
     [exec] callback.c:455: error: initializer element is not constant
     [exec] callback.c:455: error: (near initialization for fnx_array[9][29])
     [exec] callback.c:455: error: initializer element is not constant
     [exec] callback.c:455: error: (near initialization for fnx_array[9][30])
     [exec] callback.c:455: error: initializer element is not constant
     [exec] callback.c:455: error: (near initialization for fnx_array[9][31])
     [exec] callback.c:455: error: initializer element is not constant
     [exec] callback.c:455: error: (near initialization for fnx_array[9][32])
     [exec] callback.c:455: error: initializer element is not constant
     [exec] callback.c:455: error: (near initialization for fnx_array[9][33])
     [exec] callback.c:455: error: initializer element is not constant
     [exec] callback.c:455: error: (near initialization for fnx_array[9][34])
     [exec] callback.c:455: error: initializer element is not constant
     [exec] callback.c:455: error: (near initialization for fnx_array[9][35])
     [exec] callback.c:455: error: initializer element is not constant
     [exec] callback.c:455: error: (near initialization for fnx_array[9][36])
     [exec] callback.c:455: error: initializer element is not constant
     [exec] callback.c:455: error: (near initialization for fnx_array[9][37])
     [exec] callback.c:455: error: initializer element is not constant
     [exec] callback.c:455: error: (near initialization for fnx_array[9][38])
     [exec] callback.c:455: error: initializer element is not constant
     [exec] callback.c:455: error: (near initialization for fnx_array[9][39])
     [exec] callback.c:455: error: initializer element is not constant
     [exec] callback.c:455: error: (near initialization for fnx_array[9][40])
     [exec] callback.c:455: error: initializer element is not constant
     [exec] callback.c:455: error: (near initialization for fnx_array[9][41])
     [exec] callback.c:455: error: initializer element is not constant
     [exec] callback.c:455: error: (near initialization for fnx_array[9][42])
     [exec] callback.c:455: error: initializer element is not constant
     [exec] callback.c:455: error: (near initialization for fnx_array[9][43])
     [exec] callback.c:455: error: initializer element is not constant
     [exec] callback.c:455: error: (near initialization for fnx_array[9][44])
     [exec] callback.c:455: error: initializer element is not constant
     [exec] callback.c:455: error: (near initialization for fnx_array[9][45])
     [exec] callback.c:455: error: initializer element is not constant
     [exec] callback.c:455: error: (near initialization for fnx_array[9][46])
     [exec] callback.c:455: error: initializer element is not constant
     [exec] callback.c:455: error: (near initialization for fnx_array[9][47])
     [exec] callback.c:455: error: initializer element is not constant
     [exec] callback.c:455: error: (near initialization for fnx_array[9][48])
     [exec] callback.c:455: error: initializer element is not constant
     [exec] callback.c:455: error: (near initialization for fnx_array[9][49])
     [exec] callback.c:455: error: initializer element is not constant
     [exec] callback.c:455: error: (near initialization for fnx_array[9][50])
     [exec] callback.c:455: error: initializer element is not constant
     [exec] callback.c:455: error: (near initialization for fnx_array[9][51])
     [exec] callback.c:455: error: initializer element is not constant
     [exec] callback.c:455: error: (near initialization for fnx_array[9][52])
     [exec] callback.c:455: error: initializer element is not constant
     [exec] callback.c:455: error: (near initialization for fnx_array[9][53])
     [exec] callback.c:455: error: initializer element is not constant
     [exec] callback.c:455: error: (near initialization for fnx_array[9][54])
     [exec] callback.c:455: error: initializer element is not constant
     [exec] callback.c:455: error: (near initialization for fnx_array[9][55])
     [exec] callback.c:455: error: initializer element is not constant
     [exec] callback.c:455: error: (near initialization for fnx_array[9][56])
     [exec] callback.c:455: error: initializer element is not constant
     [exec] callback.c:455: error: (near initialization for fnx_array[9][57])
     [exec] callback.c:455: error: initializer element is not constant
     [exec] callback.c:455: error: (near initialization for fnx_array[9][58])
     [exec] callback.c:455: error: initializer element is not constant
     [exec] callback.c:455: error: (near initialization for fnx_array[9][59])
     [exec] callback.c:455: error: initializer element is not constant
     [exec] callback.c:455: error: (near initialization for fnx_array[9][60])
     [exec] callback.c:455: error: initializer element is not constant
     [exec] callback.c:455: error: (near initialization for fnx_array[9][61])
     [exec] callback.c:455: error: initializer element is not constant
     [exec] callback.c:455: error: (near initialization for fnx_array[9][62])
     [exec] callback.c:455: error: initializer element is not constant
     [exec] callback.c:455: error: (near initialization for fnx_array[9][63])
     [exec] callback.c:455: error: initializer element is not constant
     [exec] callback.c:455: error: (near initialization for fnx_array[9][64])
     [exec] callback.c:455: error: initializer element is not constant
     [exec] callback.c:455: error: (near initialization for fnx_array[9][65])
     [exec] callback.c:455: error: initializer element is not constant
     [exec] callback.c:455: error: (near initialization for fnx_array[9][66])
     [exec] callback.c:455: error: initializer element is not constant
     [exec] callback.c:455: error: (near initialization for fnx_array[9][67])
     [exec] callback.c:455: error: initializer element is not constant
     [exec] callback.c:455: error: (near initialization for fnx_array[9][68])
     [exec] callback.c:455: error: initializer element is not constant
     [exec] callback.c:455: error: (near initialization for fnx_array[9][69])
     [exec] callback.c:455: error: initializer element is not constant
     [exec] callback.c:455: error: (near initialization for fnx_array[9][70])
     [exec] callback.c:455: error: initializer element is not constant
     [exec] callback.c:455: error: (near initialization for fnx_array[9][71])
     [exec] callback.c:455: error: initializer element is not constant
     [exec] callback.c:455: error: (near initialization for fnx_array[9][72])
     [exec] callback.c:455: error: initializer element is not constant
     [exec] callback.c:455: error: (near initialization for fnx_array[9][73])
     [exec] callback.c:455: error: initializer element is not constant
     [exec] callback.c:455: error: (near initialization for fnx_array[9][74])
     [exec] callback.c:455: error: initializer element is not constant
     [exec] callback.c:455: error: (near initialization for fnx_array[9][75])
     [exec] callback.c:455: error: initializer element is not constant
     [exec] callback.c:455: error: (near initialization for fnx_array[9][76])
     [exec] callback.c:455: error: initializer element is not constant
     [exec] callback.c:455: error: (near initialization for fnx_array[9][77])
     [exec] callback.c:455: error: initializer element is not constant
     [exec] callback.c:455: error: (near initialization for fnx_array[9][78])
     [exec] callback.c:455: error: initializer element is not constant
     [exec] callback.c:455: error: (near initialization for fnx_array[9][79])
     [exec] callback.c:455: error: initializer element is not constant
     [exec] callback.c:455: error: (near initialization for fnx_array[9][80])
     [exec] callback.c:455: error: initializer element is not constant
     [exec] callback.c:455: error: (near initialization for fnx_array[9][81])
     [exec] callback.c:455: error: initializer element is not constant
     [exec] callback.c:455: error: (near initialization for fnx_array[9][82])
     [exec] callback.c:455: error: initializer element is not constant
     [exec] callback.c:455: error: (near initialization for fnx_array[9][83])
     [exec] callback.c:455: error: initializer element is not constant
     [exec] callback.c:455: error: (near initialization for fnx_array[9][84])
     [exec] callback.c:455: error: initializer element is not constant
     [exec] callback.c:455: error: (near initialization for fnx_array[9][85])
     [exec] callback.c:455: error: initializer element is not constant
     [exec] callback.c:455: error: (near initialization for fnx_array[9][86])
     [exec] callback.c:455: error: initializer element is not constant
     [exec] callback.c:455: error: (near initialization for fnx_array[9][87])
     [exec] callback.c:455: error: initializer element is not constant
     [exec] callback.c:455: error: (near initialization for fnx_array[9][88])
     [exec] callback.c:455: error: initializer element is not constant
     [exec] callback.c:455: error: (near initialization for fnx_array[9][89])
     [exec] callback.c:455: error: initializer element is not constant
     [exec] callback.c:455: error: (near initialization for fnx_array[9][90])
     [exec] callback.c:455: error: initializer element is not constant
     [exec] callback.c:455: error: (near initialization for fnx_array[9][91])
     [exec] callback.c:455: error: initializer element is not constant
     [exec] callback.c:455: error: (near initialization for fnx_array[9][92])
     [exec] callback.c:455: error: initializer element is not constant
     [exec] callback.c:455: error: (near initialization for fnx_array[9][93])
     [exec] callback.c:455: error: initializer element is not constant
     [exec] callback.c:455: error: (near initialization for fnx_array[9][94])
     [exec] callback.c:455: error: initializer element is not constant
     [exec] callback.c:455: error: (near initialization for fnx_array[9][95])
     [exec] callback.c:455: error: initializer element is not constant
     [exec] callback.c:455: error: (near initialization for fnx_array[9][96])
     [exec] callback.c:455: error: initializer element is not constant
     [exec] callback.c:455: error: (near initialization for fnx_array[9][97])
     [exec] callback.c:455: error: initializer element is not constant
     [exec] callback.c:455: error: (near initialization for fnx_array[9][98])
     [exec] callback.c:455: error: initializer element is not constant
     [exec] callback.c:455: error: (near initialization for fnx_array[9][99])
     [exec] callback.c:455: error: initializer element is not constant
     [exec] callback.c:455: error: (near initialization for fnx_array[9][100])
     [exec] callback.c:455: error: initializer element is not constant
     [exec] callback.c:455: error: (near initialization for fnx_array[9][101])
     [exec] callback.c:455: error: initializer element is not constant
     [exec] callback.c:455: error: (near initialization for fnx_array[9][102])
     [exec] callback.c:455: error: initializer element is not constant
     [exec] callback.c:455: error: (near initialization for fnx_array[9][103])
     [exec] callback.c:455: error: initializer element is not constant
     [exec] callback.c:455: error: (near initialization for fnx_array[9][104])
     [exec] callback.c:455: error: initializer element is not constant
     [exec] callback.c:455: error: (near initialization for fnx_array[9][105])
     [exec] callback.c:455: error: initializer element is not constant
     [exec] callback.c:455: error: (near initialization for fnx_array[9][106])
     [exec] callback.c:455: error: initializer element is not constant
     [exec] callback.c:455: error: (near initialization for fnx_array[9][107])
     [exec] callback.c:455: error: initializer element is not constant
     [exec] callback.c:455: error: (near initialization for fnx_array[9][108])
     [exec] callback.c:455: error: initializer element is not constant
     [exec] callback.c:455: error: (near initialization for fnx_array[9][109])
     [exec] callback.c:455: error: initializer element is not constant
     [exec] callback.c:455: error: (near initialization for fnx_array[9][110])
     [exec] callback.c:455: error: initializer element is not constant
     [exec] callback.c:455: error: (near initialization for fnx_array[9][111])
     [exec] callback.c:455: error: initializer element is not constant
     [exec] callback.c:455: error: (near initialization for fnx_array[9][112])
     [exec] callback.c:455: error: initializer element is not constant
     [exec] callback.c:455: error: (near initialization for fnx_array[9][113])
     [exec] callback.c:455: error: initializer element is not constant
     [exec] callback.c:455: error: (near initialization for fnx_array[9][114])
     [exec] callback.c:455: error: initializer element is not constant
     [exec] callback.c:455: error: (near initialization for fnx_array[9][115])
     [exec] callback.c:455: error: initializer element is not constant
     [exec] callback.c:455: error: (near initialization for fnx_array[9][116])
     [exec] callback.c:455: error: initializer element is not constant
     [exec] callback.c:455: error: (near initialization for fnx_array[9][117])
     [exec] callback.c:455: error: initializer element is not constant
     [exec] callback.c:455: error: (near initialization for fnx_array[9][118])
     [exec] callback.c:455: error: initializer element is not constant
     [exec] callback.c:455: error: (near initialization for fnx_array[9][119])
     [exec] callback.c:455: error: initializer element is not constant
     [exec] callback.c:455: error: (near initialization for fnx_array[9][120])
     [exec] callback.c:455: error: initializer element is not constant
     [exec] callback.c:455: error: (near initialization for fnx_array[9][121])
     [exec] callback.c:455: error: initializer element is not constant
     [exec] callback.c:455: error: (near initialization for fnx_array[9][122])
     [exec] callback.c:455: error: initializer element is not constant
     [exec] callback.c:455: error: (near initialization for fnx_array[9][123])
     [exec] callback.c:455: error: initializer element is not constant
     [exec] callback.c:455: error: (near initialization for fnx_array[9][124])
     [exec] callback.c:455: error: initializer element is not constant
     [exec] callback.c:455: error: (near initialization for fnx_array[9][125])
     [exec] callback.c:455: error: initializer element is not constant
     [exec] callback.c:455: error: (near initialization for fnx_array[9][126])
     [exec] callback.c:455: error: initializer element is not constant
     [exec] callback.c:455: error: (near initialization for fnx_array[9][127])
     [exec] callback.c:456: error: initializer element is not constant
     [exec] callback.c:456: error: (near initialization for fnx_array[10][0])
     [exec] callback.c:456: error: initializer element is not constant
     [exec] callback.c:456: error: (near initialization for fnx_array[10][1])
     [exec] callback.c:456: error: initializer element is not constant
     [exec] callback.c:456: error: (near initialization for fnx_array[10][2])
     [exec] callback.c:456: error: initializer element is not constant
     [exec] callback.c:456: error: (near initialization for fnx_array[10][3])
     [exec] callback.c:456: error: initializer element is not constant
     [exec] callback.c:456: error: (near initialization for fnx_array[10][4])
     [exec] callback.c:456: error: initializer element is not constant
     [exec] callback.c:456: error: (near initialization for fnx_array[10][5])
     [exec] callback.c:456: error: initializer element is not constant
     [exec] callback.c:456: error: (near initialization for fnx_array[10][6])
     [exec] callback.c:456: error: initializer element is not constant
     [exec] callback.c:456: error: (near initialization for fnx_array[10][7])
     [exec] callback.c:456: error: initializer element is not constant
     [exec] callback.c:456: error: (near initialization for fnx_array[10][8])
     [exec] callback.c:456: error: initializer element is not constant
     [exec] callback.c:456: error: (near initialization for fnx_array[10][9])
     [exec] callback.c:456: error: initializer element is not constant
     [exec] callback.c:456: error: (near initialization for fnx_array[10][10])
     [exec] callback.c:456: error: initializer element is not constant
     [exec] callback.c:456: error: (near initialization for fnx_array[10][11])
     [exec] callback.c:456: error: initializer element is not constant
     [exec] callback.c:456: error: (near initialization for fnx_array[10][12])
     [exec] callback.c:456: error: initializer element is not constant
     [exec] callback.c:456: error: (near initialization for fnx_array[10][13])
     [exec] callback.c:456: error: initializer element is not constant
     [exec] callback.c:456: error: (near initialization for fnx_array[10][14])
     [exec] callback.c:456: error: initializer element is not constant
     [exec] callback.c:456: error: (near initialization for fnx_array[10][15])
     [exec] callback.c:456: error: initializer element is not constant
     [exec] callback.c:456: error: (near initialization for fnx_array[10][16])
     [exec] callback.c:456: error: initializer element is not constant
     [exec] callback.c:456: error: (near initialization for fnx_array[10][17])
     [exec] callback.c:456: error: initializer element is not constant
     [exec] callback.c:456: error: (near initialization for fnx_array[10][18])
     [exec] callback.c:456: error: initializer element is not constant
     [exec] callback.c:456: error: (near initialization for fnx_array[10][19])
     [exec] callback.c:456: error: initializer element is not constant
     [exec] callback.c:456: error: (near initialization for fnx_array[10][20])
     [exec] callback.c:456: error: initializer element is not constant
     [exec] callback.c:456: error: (near initialization for fnx_array[10][21])
     [exec] callback.c:456: error: initializer element is not constant
     [exec] callback.c:456: error: (near initialization for fnx_array[10][22])
     [exec] callback.c:456: error: initializer element is not constant
     [exec] callback.c:456: error: (near initialization for fnx_array[10][23])
     [exec] callback.c:456: error: initializer element is not constant
     [exec] callback.c:456: error: (near initialization for fnx_array[10][24])
     [exec] callback.c:456: error: initializer element is not constant
     [exec] callback.c:456: error: (near initialization for fnx_array[10][25])
     [exec] callback.c:456: error: initializer element is not constant
     [exec] callback.c:456: error: (near initialization for fnx_array[10][26])
     [exec] callback.c:456: error: initializer element is not constant
     [exec] callback.c:456: error: (near initialization for fnx_array[10][27])
     [exec] callback.c:456: error: initializer element is not constant
     [exec] callback.c:456: error: (near initialization for fnx_array[10][28])
     [exec] callback.c:456: error: initializer element is not constant
     [exec] callback.c:456: error: (near initialization for fnx_array[10][29])
     [exec] callback.c:456: error: initializer element is not constant
     [exec] callback.c:456: error: (near initialization for fnx_array[10][30])
     [exec] callback.c:456: error: initializer element is not constant
     [exec] callback.c:456: error: (near initialization for fnx_array[10][31])
     [exec] callback.c:456: error: initializer element is not constant
     [exec] callback.c:456: error: (near initialization for fnx_array[10][32])
     [exec] callback.c:456: error: initializer element is not constant
     [exec] callback.c:456: error: (near initialization for fnx_array[10][33])
     [exec] callback.c:456: error: initializer element is not constant
     [exec] callback.c:456: error: (near initialization for fnx_array[10][34])
     [exec] callback.c:456: error: initializer element is not constant
     [exec] callback.c:456: error: (near initialization for fnx_array[10][35])
     [exec] callback.c:456: error: initializer element is not constant
     [exec] callback.c:456: error: (near initialization for fnx_array[10][36])
     [exec] callback.c:456: error: initializer element is not constant
     [exec] callback.c:456: error: (near initialization for fnx_array[10][37])
     [exec] callback.c:456: error: initializer element is not constant
     [exec] callback.c:456: error: (near initialization for fnx_array[10][38])
     [exec] callback.c:456: error: initializer element is not constant
     [exec] callback.c:456: error: (near initialization for fnx_array[10][39])
     [exec] callback.c:456: error: initializer element is not constant
     [exec] callback.c:456: error: (near initialization for fnx_array[10][40])
     [exec] callback.c:456: error: initializer element is not constant
     [exec] callback.c:456: error: (near initialization for fnx_array[10][41])
     [exec] callback.c:456: error: initializer element is not constant
     [exec] callback.c:456: error: (near initialization for fnx_array[10][42])
     [exec] callback.c:456: error: initializer element is not constant
     [exec] callback.c:456: error: (near initialization for fnx_array[10][43])
     [exec] callback.c:456: error: initializer element is not constant
     [exec] callback.c:456: error: (near initialization for fnx_array[10][44])
     [exec] callback.c:456: error: initializer element is not constant
     [exec] callback.c:456: error: (near initialization for fnx_array[10][45])
     [exec] callback.c:456: error: initializer element is not constant
     [exec] callback.c:456: error: (near initialization for fnx_array[10][46])
     [exec] callback.c:456: error: initializer element is not constant
     [exec] callback.c:456: error: (near initialization for fnx_array[10][47])
     [exec] callback.c:456: error: initializer element is not constant
     [exec] callback.c:456: error: (near initialization for fnx_array[10][48])
     [exec] callback.c:456: error: initializer element is not constant
     [exec] callback.c:456: error: (near initialization for fnx_array[10][49])
     [exec] callback.c:456: error: initializer element is not constant
     [exec] callback.c:456: error: (near initialization for fnx_array[10][50])
     [exec] callback.c:456: error: initializer element is not constant
     [exec] callback.c:456: error: (near initialization for fnx_array[10][51])
     [exec] callback.c:456: error: initializer element is not constant
     [exec] callback.c:456: error: (near initialization for fnx_array[10][52])
     [exec] callback.c:456: error: initializer element is not constant
     [exec] callback.c:456: error: (near initialization for fnx_array[10][53])
     [exec] callback.c:456: error: initializer element is not constant
     [exec] callback.c:456: error: (near initialization for fnx_array[10][54])
     [exec] callback.c:456: error: initializer element is not constant
     [exec] callback.c:456: error: (near initialization for fnx_array[10][55])
     [exec] callback.c:456: error: initializer element is not constant
     [exec] callback.c:456: error: (near initialization for fnx_array[10][56])
     [exec] callback.c:456: error: initializer element is not constant
     [exec] callback.c:456: error: (near initialization for fnx_array[10][57])
     [exec] callback.c:456: error: initializer element is not constant
     [exec] callback.c:456: error: (near initialization for fnx_array[10][58])
     [exec] callback.c:456: error: initializer element is not constant
     [exec] callback.c:456: error: (near initialization for fnx_array[10][59])
     [exec] callback.c:456: error: initializer element is not constant
     [exec] callback.c:456: error: (near initialization for fnx_array[10][60])
     [exec] callback.c:456: error: initializer element is not constant
     [exec] callback.c:456: error: (near initialization for fnx_array[10][61])
     [exec] callback.c:456: error: initializer element is not constant
     [exec] callback.c:456: error: (near initialization for fnx_array[10][62])
     [exec] callback.c:456: error: initializer element is not constant
     [exec] callback.c:456: error: (near initialization for fnx_array[10][63])
     [exec] callback.c:456: error: initializer element is not constant
     [exec] callback.c:456: error: (near initialization for fnx_array[10][64])
     [exec] callback.c:456: error: initializer element is not constant
     [exec] callback.c:456: error: (near initialization for fnx_array[10][65])
     [exec] callback.c:456: error: initializer element is not constant
     [exec] callback.c:456: error: (near initialization for fnx_array[10][66])
     [exec] callback.c:456: error: initializer element is not constant
     [exec] callback.c:456: error: (near initialization for fnx_array[10][67])
     [exec] callback.c:456: error: initializer element is not constant
     [exec] callback.c:456: error: (near initialization for fnx_array[10][68])
     [exec] callback.c:456: error: initializer element is not constant
     [exec] callback.c:456: error: (near initialization for fnx_array[10][69])
     [exec] callback.c:456: error: initializer element is not constant
     [exec] callback.c:456: error: (near initialization for fnx_array[10][70])
     [exec] callback.c:456: error: initializer element is not constant
     [exec] callback.c:456: error: (near initialization for fnx_array[10][71])
     [exec] callback.c:456: error: initializer element is not constant
     [exec] callback.c:456: error: (near initialization for fnx_array[10][72])
     [exec] callback.c:456: error: initializer element is not constant
     [exec] callback.c:456: error: (near initialization for fnx_array[10][73])
     [exec] callback.c:456: error: initializer element is not constant
     [exec] callback.c:456: error: (near initialization for fnx_array[10][74])
     [exec] callback.c:456: error: initializer element is not constant
     [exec] callback.c:456: error: (near initialization for fnx_array[10][75])
     [exec] callback.c:456: error: initializer element is not constant
     [exec] callback.c:456: error: (near initialization for fnx_array[10][76])
     [exec] callback.c:456: error: initializer element is not constant
     [exec] callback.c:456: error: (near initialization for fnx_array[10][77])
     [exec] callback.c:456: error: initializer element is not constant
     [exec] callback.c:456: error: (near initialization for fnx_array[10][78])
     [exec] callback.c:456: error: initializer element is not constant
     [exec] callback.c:456: error: (near initialization for fnx_array[10][79])
     [exec] callback.c:456: error: initializer element is not constant
     [exec] callback.c:456: error: (near initialization for fnx_array[10][80])
     [exec] callback.c:456: error: initializer element is not constant
     [exec] callback.c:456: error: (near initialization for fnx_array[10][81])
     [exec] callback.c:456: error: initializer element is not constant
     [exec] callback.c:456: error: (near initialization for fnx_array[10][82])
     [exec] callback.c:456: error: initializer element is not constant
     [exec] callback.c:456: error: (near initialization for fnx_array[10][83])
     [exec] callback.c:456: error: initializer element is not constant
     [exec] callback.c:456: error: (near initialization for fnx_array[10][84])
     [exec] callback.c:456: error: initializer element is not constant
     [exec] callback.c:456: error: (near initialization for fnx_array[10][85])
     [exec] callback.c:456: error: initializer element is not constant
     [exec] callback.c:456: error: (near initialization for fnx_array[10][86])
     [exec] callback.c:456: error: initializer element is not constant
     [exec] callback.c:456: error: (near initialization for fnx_array[10][87])
     [exec] callback.c:456: error: initializer element is not constant
     [exec] callback.c:456: error: (near initialization for fnx_array[10][88])
     [exec] callback.c:456: error: initializer element is not constant
     [exec] callback.c:456: error: (near initialization for fnx_array[10][89])
     [exec] callback.c:456: error: initializer element is not constant
     [exec] callback.c:456: error: (near initialization for fnx_array[10][90])
     [exec] callback.c:456: error: initializer element is not constant
     [exec] callback.c:456: error: (near initialization for fnx_array[10][91])
     [exec] callback.c:456: error: initializer element is not constant
     [exec] callback.c:456: error: (near initialization for fnx_array[10][92])
     [exec] callback.c:456: error: initializer element is not constant
     [exec] callback.c:456: error: (near initialization for fnx_array[10][93])
     [exec] callback.c:456: error: initializer element is not constant
     [exec] callback.c:456: error: (near initialization for fnx_array[10][94])
     [exec] callback.c:456: error: initializer element is not constant
     [exec] callback.c:456: error: (near initialization for fnx_array[10][95])
     [exec] callback.c:456: error: initializer element is not constant
     [exec] callback.c:456: error: (near initialization for fnx_array[10][96])
     [exec] callback.c:456: error: initializer element is not constant
     [exec] callback.c:456: error: (near initialization for fnx_array[10][97])
     [exec] callback.c:456: error: initializer element is not constant
     [exec] callback.c:456: error: (near initialization for fnx_array[10][98])
     [exec] callback.c:456: error: initializer element is not constant
     [exec] callback.c:456: error: (near initialization for fnx_array[10][99])
     [exec] callback.c:456: error: initializer element is not constant
     [exec] callback.c:456: error: (near initialization for fnx_array[10][100])
     [exec] callback.c:456: error: initializer element is not constant
     [exec] callback.c:456: error: (near initialization for fnx_array[10][101])
     [exec] callback.c:456: error: initializer element is not constant
     [exec] callback.c:456: error: (near initialization for fnx_array[10][102])
     [exec] callback.c:456: error: initializer element is not constant
     [exec] callback.c:456: error: (near initialization for fnx_array[10][103])
     [exec] callback.c:456: error: initializer element is not constant
     [exec] callback.c:456: error: (near initialization for fnx_array[10][104])
     [exec] callback.c:456: error: initializer element is not constant
     [exec] callback.c:456: error: (near initialization for fnx_array[10][105])
     [exec] callback.c:456: error: initializer element is not constant
     [exec] callback.c:456: error: (near initialization for fnx_array[10][106])
     [exec] callback.c:456: error: initializer element is not constant
     [exec] callback.c:456: error: (near initialization for fnx_array[10][107])
     [exec] callback.c:456: error: initializer element is not constant
     [exec] callback.c:456: error: (near initialization for fnx_array[10][108])
     [exec] callback.c:456: error: initializer element is not constant
     [exec] callback.c:456: error: (near initialization for fnx_array[10][109])
     [exec] callback.c:456: error: initializer element is not constant
     [exec] callback.c:456: error: (near initialization for fnx_array[10][110])
     [exec] callback.c:456: error: initializer element is not constant
     [exec] callback.c:456: error: (near initialization for fnx_array[10][111])
     [exec] callback.c:456: error: initializer element is not constant
     [exec] callback.c:456: error: (near initialization for fnx_array[10][112])
     [exec] callback.c:456: error: initializer element is not constant
     [exec] callback.c:456: error: (near initialization for fnx_array[10][113])
     [exec] callback.c:456: error: initializer element is not constant
     [exec] callback.c:456: error: (near initialization for fnx_array[10][114])
     [exec] callback.c:456: error: initializer element is not constant
     [exec] callback.c:456: error: (near initialization for fnx_array[10][115])
     [exec] callback.c:456: error: initializer element is not constant
     [exec] callback.c:456: error: (near initialization for fnx_array[10][116])
     [exec] callback.c:456: error: initializer element is not constant
     [exec] callback.c:456: error: (near initialization for fnx_array[10][117])
     [exec] callback.c:456: error: initializer element is not constant
     [exec] callback.c:456: error: (near initialization for fnx_array[10][118])
     [exec] callback.c:456: error: initializer element is not constant
     [exec] callback.c:456: error: (near initialization for fnx_array[10][119])
     [exec] callback.c:456: error: initializer element is not constant
     [exec] callback.c:456: error: (near initialization for fnx_array[10][120])
     [exec] callback.c:456: error: initializer element is not constant
     [exec] callback.c:456: error: (near initialization for fnx_array[10][121])
     [exec] callback.c:456: error: initializer element is not constant
     [exec] callback.c:456: error: (near initialization for fnx_array[10][122])
     [exec] callback.c:456: error: initializer element is not constant
     [exec] callback.c:456: error: (near initialization for fnx_array[10][123])
     [exec] callback.c:456: error: initializer element is not constant
     [exec] callback.c:456: error: (near initialization for fnx_array[10][124])
     [exec] callback.c:456: error: initializer element is not constant
     [exec] callback.c:456: error: (near initialization for fnx_array[10][125])
     [exec] callback.c:456: error: initializer element is not constant
     [exec] callback.c:456: error: (near initialization for fnx_array[10][126])
     [exec] callback.c:456: error: initializer element is not constant
     [exec] callback.c:456: error: (near initialization for fnx_array[10][127])
     [exec] callback.c:457: error: initializer element is not constant
     [exec] callback.c:457: error: (near initialization for fnx_array[11][0])
     [exec] callback.c:457: error: initializer element is not constant
     [exec] callback.c:457: error: (near initialization for fnx_array[11][1])
     [exec] callback.c:457: error: initializer element is not constant
     [exec] callback.c:457: error: (near initialization for fnx_array[11][2])
     [exec] callback.c:457: error: initializer element is not constant
     [exec] callback.c:457: error: (near initialization for fnx_array[11][3])
     [exec] callback.c:457: error: initializer element is not constant
     [exec] callback.c:457: error: (near initialization for fnx_array[11][4])
     [exec] callback.c:457: error: initializer element is not constant
     [exec] callback.c:457: error: (near initialization for fnx_array[11][5])
     [exec] callback.c:457: error: initializer element is not constant
     [exec] callback.c:457: error: (near initialization for fnx_array[11][6])
     [exec] callback.c:457: error: initializer element is not constant
     [exec] callback.c:457: error: (near initialization for fnx_array[11][7])
     [exec] callback.c:457: error: initializer element is not constant
     [exec] callback.c:457: error: (near initialization for fnx_array[11][8])
     [exec] callback.c:457: error: initializer element is not constant
     [exec] callback.c:457: error: (near initialization for fnx_array[11][9])
     [exec] callback.c:457: error: initializer element is not constant
     [exec] callback.c:457: error: (near initialization for fnx_array[11][10])
     [exec] callback.c:457: error: initializer element is not constant
     [exec] callback.c:457: error: (near initialization for fnx_array[11][11])
     [exec] callback.c:457: error: initializer element is not constant
     [exec] callback.c:457: error: (near initialization for fnx_array[11][12])
     [exec] callback.c:457: error: initializer element is not constant
     [exec] callback.c:457: error: (near initialization for fnx_array[11][13])
     [exec] callback.c:457: error: initializer element is not constant
     [exec] callback.c:457: error: (near initialization for fnx_array[11][14])
     [exec] callback.c:457: error: initializer element is not constant
     [exec] callback.c:457: error: (near initialization for fnx_array[11][15])
     [exec] callback.c:457: error: initializer element is not constant
     [exec] callback.c:457: error: (near initialization for fnx_array[11][16])
     [exec] callback.c:457: error: initializer element is not constant
     [exec] callback.c:457: error: (near initialization for fnx_array[11][17])
     [exec] callback.c:457: error: initializer element is not constant
     [exec] callback.c:457: error: (near initialization for fnx_array[11][18])
     [exec] callback.c:457: error: initializer element is not constant
     [exec] callback.c:457: error: (near initialization for fnx_array[11][19])
     [exec] callback.c:457: error: initializer element is not constant
     [exec] callback.c:457: error: (near initialization for fnx_array[11][20])
     [exec] callback.c:457: error: initializer element is not constant
     [exec] callback.c:457: error: (near initialization for fnx_array[11][21])
     [exec] callback.c:457: error: initializer element is not constant
     [exec] callback.c:457: error: (near initialization for fnx_array[11][22])
     [exec] callback.c:457: error: initializer element is not constant
     [exec] callback.c:457: error: (near initialization for fnx_array[11][23])
     [exec] callback.c:457: error: initializer element is not constant
     [exec] callback.c:457: error: (near initialization for fnx_array[11][24])
     [exec] callback.c:457: error: initializer element is not constant
     [exec] callback.c:457: error: (near initialization for fnx_array[11][25])
     [exec] callback.c:457: error: initializer element is not constant
     [exec] callback.c:457: error: (near initialization for fnx_array[11][26])
     [exec] callback.c:457: error: initializer element is not constant
     [exec] callback.c:457: error: (near initialization for fnx_array[11][27])
     [exec] callback.c:457: error: initializer element is not constant
     [exec] callback.c:457: error: (near initialization for fnx_array[11][28])
     [exec] callback.c:457: error: initializer element is not constant
     [exec] callback.c:457: error: (near initialization for fnx_array[11][29])
     [exec] callback.c:457: error: initializer element is not constant
     [exec] callback.c:457: error: (near initialization for fnx_array[11][30])
     [exec] callback.c:457: error: initializer element is not constant
     [exec] callback.c:457: error: (near initialization for fnx_array[11][31])
     [exec] callback.c:457: error: initializer element is not constant
     [exec] callback.c:457: error: (near initialization for fnx_array[11][32])
     [exec] callback.c:457: error: initializer element is not constant
     [exec] callback.c:457: error: (near initialization for fnx_array[11][33])
     [exec] callback.c:457: error: initializer element is not constant
     [exec] callback.c:457: error: (near initialization for fnx_array[11][34])
     [exec] callback.c:457: error: initializer element is not constant
     [exec] callback.c:457: error: (near initialization for fnx_array[11][35])
     [exec] callback.c:457: error: initializer element is not constant
     [exec] callback.c:457: error: (near initialization for fnx_array[11][36])
     [exec] callback.c:457: error: initializer element is not constant
     [exec] callback.c:457: error: (near initialization for fnx_array[11][37])
     [exec] callback.c:457: error: initializer element is not constant
     [exec] callback.c:457: error: (near initialization for fnx_array[11][38])
     [exec] callback.c:457: error: initializer element is not constant
     [exec] callback.c:457: error: (near initialization for fnx_array[11][39])
     [exec] callback.c:457: error: initializer element is not constant
     [exec] callback.c:457: error: (near initialization for fnx_array[11][40])
     [exec] callback.c:457: error: initializer element is not constant
     [exec] callback.c:457: error: (near initialization for fnx_array[11][41])
     [exec] callback.c:457: error: initializer element is not constant
     [exec] callback.c:457: error: (near initialization for fnx_array[11][42])
     [exec] callback.c:457: error: initializer element is not constant
     [exec] callback.c:457: error: (near initialization for fnx_array[11][43])
     [exec] callback.c:457: error: initializer element is not constant
     [exec] callback.c:457: error: (near initialization for fnx_array[11][44])
     [exec] callback.c:457: error: initializer element is not constant
     [exec] callback.c:457: error: (near initialization for fnx_array[11][45])
     [exec] callback.c:457: error: initializer element is not constant
     [exec] callback.c:457: error: (near initialization for fnx_array[11][46])
     [exec] callback.c:457: error: initializer element is not constant
     [exec] callback.c:457: error: (near initialization for fnx_array[11][47])
     [exec] callback.c:457: error: initializer element is not constant
     [exec] callback.c:457: error: (near initialization for fnx_array[11][48])
     [exec] callback.c:457: error: initializer element is not constant
     [exec] callback.c:457: error: (near initialization for fnx_array[11][49])
     [exec] callback.c:457: error: initializer element is not constant
     [exec] callback.c:457: error: (near initialization for fnx_array[11][50])
     [exec] callback.c:457: error: initializer element is not constant
     [exec] callback.c:457: error: (near initialization for fnx_array[11][51])
     [exec] callback.c:457: error: initializer element is not constant
     [exec] callback.c:457: error: (near initialization for fnx_array[11][52])
     [exec] callback.c:457: error: initializer element is not constant
     [exec] callback.c:457: error: (near initialization for fnx_array[11][53])
     [exec] callback.c:457: error: initializer element is not constant
     [exec] callback.c:457: error: (near initialization for fnx_array[11][54])
     [exec] callback.c:457: error: initializer element is not constant
     [exec] callback.c:457: error: (near initialization for fnx_array[11][55])
     [exec] callback.c:457: error: initializer element is not constant
     [exec] callback.c:457: error: (near initialization for fnx_array[11][56])
     [exec] callback.c:457: error: initializer element is not constant
     [exec] callback.c:457: error: (near initialization for fnx_array[11][57])
     [exec] callback.c:457: error: initializer element is not constant
     [exec] callback.c:457: error: (near initialization for fnx_array[11][58])
     [exec] callback.c:457: error: initializer element is not constant
     [exec] callback.c:457: error: (near initialization for fnx_array[11][59])
     [exec] callback.c:457: error: initializer element is not constant
     [exec] callback.c:457: error: (near initialization for fnx_array[11][60])
     [exec] callback.c:457: error: initializer element is not constant
     [exec] callback.c:457: error: (near initialization for fnx_array[11][61])
     [exec] callback.c:457: error: initializer element is not constant
     [exec] callback.c:457: error: (near initialization for fnx_array[11][62])
     [exec] callback.c:457: error: initializer element is not constant
     [exec] callback.c:457: error: (near initialization for fnx_array[11][63])
     [exec] callback.c:457: error: initializer element is not constant
     [exec] callback.c:457: error: (near initialization for fnx_array[11][64])
     [exec] callback.c:457: error: initializer element is not constant
     [exec] callback.c:457: error: (near initialization for fnx_array[11][65])
     [exec] callback.c:457: error: initializer element is not constant
     [exec] callback.c:457: error: (near initialization for fnx_array[11][66])
     [exec] callback.c:457: error: initializer element is not constant
     [exec] callback.c:457: error: (near initialization for fnx_array[11][67])
     [exec] callback.c:457: error: initializer element is not constant
     [exec] callback.c:457: error: (near initialization for fnx_array[11][68])
     [exec] callback.c:457: error: initializer element is not constant
     [exec] callback.c:457: error: (near initialization for fnx_array[11][69])
     [exec] callback.c:457: error: initializer element is not constant
     [exec] callback.c:457: error: (near initialization for fnx_array[11][70])
     [exec] callback.c:457: error: initializer element is not constant
     [exec] callback.c:457: error: (near initialization for fnx_array[11][71])
     [exec] callback.c:457: error: initializer element is not constant
     [exec] callback.c:457: error: (near initialization for fnx_array[11][72])
     [exec] callback.c:457: error: initializer element is not constant
     [exec] callback.c:457: error: (near initialization for fnx_array[11][73])
     [exec] callback.c:457: error: initializer element is not constant
     [exec] callback.c:457: error: (near initialization for fnx_array[11][74])
     [exec] callback.c:457: error: initializer element is not constant
     [exec] callback.c:457: error: (near initialization for fnx_array[11][75])
     [exec] callback.c:457: error: initializer element is not constant
     [exec] callback.c:457: error: (near initialization for fnx_array[11][76])
     [exec] callback.c:457: error: initializer element is not constant
     [exec] callback.c:457: error: (near initialization for fnx_array[11][77])
     [exec] callback.c:457: error: initializer element is not constant
     [exec] callback.c:457: error: (near initialization for fnx_array[11][78])
     [exec] callback.c:457: error: initializer element is not constant
     [exec] callback.c:457: error: (near initialization for fnx_array[11][79])
     [exec] callback.c:457: error: initializer element is not constant
     [exec] callback.c:457: error: (near initialization for fnx_array[11][80])
     [exec] callback.c:457: error: initializer element is not constant
     [exec] callback.c:457: error: (near initialization for fnx_array[11][81])
     [exec] callback.c:457: error: initializer element is not constant
     [exec] callback.c:457: error: (near initialization for fnx_array[11][82])
     [exec] callback.c:457: error: initializer element is not constant
     [exec] callback.c:457: error: (near initialization for fnx_array[11][83])
     [exec] callback.c:457: error: initializer element is not constant
     [exec] callback.c:457: error: (near initialization for fnx_array[11][84])
     [exec] callback.c:457: error: initializer element is not constant
     [exec] callback.c:457: error: (near initialization for fnx_array[11][85])
     [exec] callback.c:457: error: initializer element is not constant
     [exec] callback.c:457: error: (near initialization for fnx_array[11][86])
     [exec] callback.c:457: error: initializer element is not constant
     [exec] callback.c:457: error: (near initialization for fnx_array[11][87])
     [exec] callback.c:457: error: initializer element is not constant
     [exec] callback.c:457: error: (near initialization for fnx_array[11][88])
     [exec] callback.c:457: error: initializer element is not constant
     [exec] callback.c:457: error: (near initialization for fnx_array[11][89])
     [exec] callback.c:457: error: initializer element is not constant
     [exec] callback.c:457: error: (near initialization for fnx_array[11][90])
     [exec] callback.c:457: error: initializer element is not constant
     [exec] callback.c:457: error: (near initialization for fnx_array[11][91])
     [exec] callback.c:457: error: initializer element is not constant
     [exec] callback.c:457: error: (near initialization for fnx_array[11][92])
     [exec] callback.c:457: error: initializer element is not constant
     [exec] callback.c:457: error: (near initialization for fnx_array[11][93])
     [exec] callback.c:457: error: initializer element is not constant
     [exec] callback.c:457: error: (near initialization for fnx_array[11][94])
     [exec] callback.c:457: error: initializer element is not constant
     [exec] callback.c:457: error: (near initialization for fnx_array[11][95])
     [exec] callback.c:457: error: initializer element is not constant
     [exec] callback.c:457: error: (near initialization for fnx_array[11][96])
     [exec] callback.c:457: error: initializer element is not constant
     [exec] callback.c:457: error: (near initialization for fnx_array[11][97])
     [exec] callback.c:457: error: initializer element is not constant
     [exec] callback.c:457: error: (near initialization for fnx_array[11][98])
     [exec] callback.c:457: error: initializer element is not constant
     [exec] callback.c:457: error: (near initialization for fnx_array[11][99])
     [exec] callback.c:457: error: initializer element is not constant
     [exec] callback.c:457: error: (near initialization for fnx_array[11][100])
     [exec] callback.c:457: error: initializer element is not constant
     [exec] callback.c:457: error: (near initialization for fnx_array[11][101])
     [exec] callback.c:457: error: initializer element is not constant
     [exec] callback.c:457: error: (near initialization for fnx_array[11][102])
     [exec] callback.c:457: error: initializer element is not constant
     [exec] callback.c:457: error: (near initialization for fnx_array[11][103])
     [exec] callback.c:457: error: initializer element is not constant
     [exec] callback.c:457: error: (near initialization for fnx_array[11][104])
     [exec] callback.c:457: error: initializer element is not constant
     [exec] callback.c:457: error: (near initialization for fnx_array[11][105])
     [exec] callback.c:457: error: initializer element is not constant
     [exec] callback.c:457: error: (near initialization for fnx_array[11][106])
     [exec] callback.c:457: error: initializer element is not constant
     [exec] callback.c:457: error: (near initialization for fnx_array[11][107])
     [exec] callback.c:457: error: initializer element is not constant
     [exec] callback.c:457: error: (near initialization for fnx_array[11][108])
     [exec] callback.c:457: error: initializer element is not constant
     [exec] callback.c:457: error: (near initialization for fnx_array[11][109])
     [exec] callback.c:457: error: initializer element is not constant
     [exec] callback.c:457: error: (near initialization for fnx_array[11][110])
     [exec] callback.c:457: error: initializer element is not constant
     [exec] callback.c:457: error: (near initialization for fnx_array[11][111])
     [exec] callback.c:457: error: initializer element is not constant
     [exec] callback.c:457: error: (near initialization for fnx_array[11][112])
     [exec] callback.c:457: error: initializer element is not constant
     [exec] callback.c:457: error: (near initialization for fnx_array[11][113])
     [exec] callback.c:457: error: initializer element is not constant
     [exec] callback.c:457: error: (near initialization for fnx_array[11][114])
     [exec] callback.c:457: error: initializer element is not constant
     [exec] callback.c:457: error: (near initialization for fnx_array[11][115])
     [exec] callback.c:457: error: initializer element is not constant
     [exec] callback.c:457: error: (near initialization for fnx_array[11][116])
     [exec] callback.c:457: error: initializer element is not constant
     [exec] callback.c:457: error: (near initialization for fnx_array[11][117])
     [exec] callback.c:457: error: initializer element is not constant
     [exec] callback.c:457: error: (near initialization for fnx_array[11][118])
     [exec] callback.c:457: error: initializer element is not constant
     [exec] callback.c:457: error: (near initialization for fnx_array[11][119])
     [exec] callback.c:457: error: initializer element is not constant
     [exec] callback.c:457: error: (near initialization for fnx_array[11][120])
     [exec] callback.c:457: error: initializer element is not constant
     [exec] callback.c:457: error: (near initialization for fnx_array[11][121])
     [exec] callback.c:457: error: initializer element is not constant
     [exec] callback.c:457: error: (near initialization for fnx_array[11][122])
     [exec] callback.c:457: error: initializer element is not constant
     [exec] callback.c:457: error: (near initialization for fnx_array[11][123])
     [exec] callback.c:457: error: initializer element is not constant
     [exec] callback.c:457: error: (near initialization for fnx_array[11][124])
     [exec] callback.c:457: error: initializer element is not constant
     [exec] callback.c:457: error: (near initialization for fnx_array[11][125])
     [exec] callback.c:457: error: initializer element is not constant
     [exec] callback.c:457: error: (near initialization for fnx_array[11][126])
     [exec] callback.c:457: error: initializer element is not constant
     [exec] callback.c:457: error: (near initialization for fnx_array[11][127])
     [exec] callback.c:458: error: initializer element is not constant
     [exec] callback.c:458: error: (near initialization for fnx_array[12][0])
     [exec] callback.c:458: error: initializer element is not constant
     [exec] callback.c:458: error: (near initialization for fnx_array[12][1])
     [exec] callback.c:458: error: initializer element is not constant
     [exec] callback.c:458: error: (near initialization for fnx_array[12][2])
     [exec] callback.c:458: error: initializer element is not constant
     [exec] callback.c:458: error: (near initialization for fnx_array[12][3])
     [exec] callback.c:458: error: initializer element is not constant
     [exec] callback.c:458: error: (near initialization for fnx_array[12][4])
     [exec] callback.c:458: error: initializer element is not constant
     [exec] callback.c:458: error: (near initialization for fnx_array[12][5])
     [exec] callback.c:458: error: initializer element is not constant
     [exec] callback.c:458: error: (near initialization for fnx_array[12][6])
     [exec] callback.c:458: error: initializer element is not constant
     [exec] callback.c:458: error: (near initialization for fnx_array[12][7])
     [exec] callback.c:458: error: initializer element is not constant
     [exec] callback.c:458: error: (near initialization for fnx_array[12][8])
     [exec] callback.c:458: error: initializer element is not constant
     [exec] callback.c:458: error: (near initialization for fnx_array[12][9])
     [exec] callback.c:458: error: initializer element is not constant
     [exec] callback.c:458: error: (near initialization for fnx_array[12][10])
     [exec] callback.c:458: error: initializer element is not constant
     [exec] callback.c:458: error: (near initialization for fnx_array[12][11])
     [exec] callback.c:458: error: initializer element is not constant
     [exec] callback.c:458: error: (near initialization for fnx_array[12][12])
     [exec] callback.c:458: error: initializer element is not constant
     [exec] callback.c:458: error: (near initialization for fnx_array[12][13])
     [exec] callback.c:458: error: initializer element is not constant
     [exec] callback.c:458: error: (near initialization for fnx_array[12][14])
     [exec] callback.c:458: error: initializer element is not constant
     [exec] callback.c:458: error: (near initialization for fnx_array[12][15])
     [exec] callback.c:458: error: initializer element is not constant
     [exec] callback.c:458: error: (near initialization for fnx_array[12][16])
     [exec] callback.c:458: error: initializer element is not constant
     [exec] callback.c:458: error: (near initialization for fnx_array[12][17])
     [exec] callback.c:458: error: initializer element is not constant
     [exec] callback.c:458: error: (near initialization for fnx_array[12][18])
     [exec] callback.c:458: error: initializer element is not constant
     [exec] callback.c:458: error: (near initialization for fnx_array[12][19])
     [exec] callback.c:458: error: initializer element is not constant
     [exec] callback.c:458: error: (near initialization for fnx_array[12][20])
     [exec] callback.c:458: error: initializer element is not constant
     [exec] callback.c:458: error: (near initialization for fnx_array[12][21])
     [exec] callback.c:458: error: initializer element is not constant
     [exec] callback.c:458: error: (near initialization for fnx_array[12][22])
     [exec] callback.c:458: error: initializer element is not constant
     [exec] callback.c:458: error: (near initialization for fnx_array[12][23])
     [exec] callback.c:458: error: initializer element is not constant
     [exec] callback.c:458: error: (near initialization for fnx_array[12][24])
     [exec] callback.c:458: error: initializer element is not constant
     [exec] callback.c:458: error: (near initialization for fnx_array[12][25])
     [exec] callback.c:458: error: initializer element is not constant
     [exec] callback.c:458: error: (near initialization for fnx_array[12][26])
     [exec] callback.c:458: error: initializer element is not constant
     [exec] callback.c:458: error: (near initialization for fnx_array[12][27])
     [exec] callback.c:458: error: initializer element is not constant
     [exec] callback.c:458: error: (near initialization for fnx_array[12][28])
     [exec] callback.c:458: error: initializer element is not constant
     [exec] callback.c:458: error: (near initialization for fnx_array[12][29])
     [exec] callback.c:458: error: initializer element is not constant
     [exec] callback.c:458: error: (near initialization for fnx_array[12][30])
     [exec] callback.c:458: error: initializer element is not constant
     [exec] callback.c:458: error: (near initialization for fnx_array[12][31])
     [exec] callback.c:458: error: initializer element is not constant
     [exec] callback.c:458: error: (near initialization for fnx_array[12][32])
     [exec] callback.c:458: error: initializer element is not constant
     [exec] callback.c:458: error: (near initialization for fnx_array[12][33])
     [exec] callback.c:458: error: initializer element is not constant
     [exec] callback.c:458: error: (near initialization for fnx_array[12][34])
     [exec] callback.c:458: error: initializer element is not constant
     [exec] callback.c:458: error: (near initialization for fnx_array[12][35])
     [exec] callback.c:458: error: initializer element is not constant
     [exec] callback.c:458: error: (near initialization for fnx_array[12][36])
     [exec] callback.c:458: error: initializer element is not constant
     [exec] callback.c:458: error: (near initialization for fnx_array[12][37])
     [exec] callback.c:458: error: initializer element is not constant
     [exec] callback.c:458: error: (near initialization for fnx_array[12][38])
     [exec] callback.c:458: error: initializer element is not constant
     [exec] callback.c:458: error: (near initialization for fnx_array[12][39])
     [exec] callback.c:458: error: initializer element is not constant
     [exec] callback.c:458: error: (near initialization for fnx_array[12][40])
     [exec] callback.c:458: error: initializer element is not constant
     [exec] callback.c:458: error: (near initialization for fnx_array[12][41])
     [exec] callback.c:458: error: initializer element is not constant
     [exec] callback.c:458: error: (near initialization for fnx_array[12][42])
     [exec] callback.c:458: error: initializer element is not constant
     [exec] callback.c:458: error: (near initialization for fnx_array[12][43])
     [exec] callback.c:458: error: initializer element is not constant
     [exec] callback.c:458: error: (near initialization for fnx_array[12][44])
     [exec] callback.c:458: error: initializer element is not constant
     [exec] callback.c:458: error: (near initialization for fnx_array[12][45])
     [exec] callback.c:458: error: initializer element is not constant
     [exec] callback.c:458: error: (near initialization for fnx_array[12][46])
     [exec] callback.c:458: error: initializer element is not constant
     [exec] callback.c:458: error: (near initialization for fnx_array[12][47])
     [exec] callback.c:458: error: initializer element is not constant
     [exec] callback.c:458: error: (near initialization for fnx_array[12][48])
     [exec] callback.c:458: error: initializer element is not constant
     [exec] callback.c:458: error: (near initialization for fnx_array[12][49])
     [exec] callback.c:458: error: initializer element is not constant
     [exec] callback.c:458: error: (near initialization for fnx_array[12][50])
     [exec] callback.c:458: error: initializer element is not constant
     [exec] callback.c:458: error: (near initialization for fnx_array[12][51])
     [exec] callback.c:458: error: initializer element is not constant
     [exec] callback.c:458: error: (near initialization for fnx_array[12][52])
     [exec] callback.c:458: error: initializer element is not constant
     [exec] callback.c:458: error: (near initialization for fnx_array[12][53])
     [exec] callback.c:458: error: initializer element is not constant
     [exec] callback.c:458: error: (near initialization for fnx_array[12][54])
     [exec] callback.c:458: error: initializer element is not constant
     [exec] callback.c:458: error: (near initialization for fnx_array[12][55])
     [exec] callback.c:458: error: initializer element is not constant
     [exec] callback.c:458: error: (near initialization for fnx_array[12][56])
     [exec] callback.c:458: error: initializer element is not constant
     [exec] callback.c:458: error: (near initialization for fnx_array[12][57])
     [exec] callback.c:458: error: initializer element is not constant
     [exec] callback.c:458: error: (near initialization for fnx_array[12][58])
     [exec] callback.c:458: error: initializer element is not constant
     [exec] callback.c:458: error: (near initialization for fnx_array[12][59])
     [exec] callback.c:458: error: initializer element is not constant
     [exec] callback.c:458: error: (near initialization for fnx_array[12][60])
     [exec] callback.c:458: error: initializer element is not constant
     [exec] callback.c:458: error: (near initialization for fnx_array[12][61])
     [exec] callback.c:458: error: initializer element is not constant
     [exec] callback.c:458: error: (near initialization for fnx_array[12][62])
     [exec] callback.c:458: error: initializer element is not constant
     [exec] callback.c:458: error: (near initialization for fnx_array[12][63])
     [exec] callback.c:458: error: initializer element is not constant
     [exec] callback.c:458: error: (near initialization for fnx_array[12][64])
     [exec] callback.c:458: error: initializer element is not constant
     [exec] callback.c:458: error: (near initialization for fnx_array[12][65])
     [exec] callback.c:458: error: initializer element is not constant
     [exec] callback.c:458: error: (near initialization for fnx_array[12][66])
     [exec] callback.c:458: error: initializer element is not constant
     [exec] callback.c:458: error: (near initialization for fnx_array[12][67])
     [exec] callback.c:458: error: initializer element is not constant
     [exec] callback.c:458: error: (near initialization for fnx_array[12][68])
     [exec] callback.c:458: error: initializer element is not constant
     [exec] callback.c:458: error: (near initialization for fnx_array[12][69])
     [exec] callback.c:458: error: initializer element is not constant
     [exec] callback.c:458: error: (near initialization for fnx_array[12][70])
     [exec] callback.c:458: error: initializer element is not constant
     [exec] callback.c:458: error: (near initialization for fnx_array[12][71])
     [exec] callback.c:458: error: initializer element is not constant
     [exec] callback.c:458: error: (near initialization for fnx_array[12][72])
     [exec] callback.c:458: error: initializer element is not constant
     [exec] callback.c:458: error: (near initialization for fnx_array[12][73])
     [exec] callback.c:458: error: initializer element is not constant
     [exec] callback.c:458: error: (near initialization for fnx_array[12][74])
     [exec] callback.c:458: error: initializer element is not constant
     [exec] callback.c:458: error: (near initialization for fnx_array[12][75])
     [exec] callback.c:458: error: initializer element is not constant
     [exec] callback.c:458: error: (near initialization for fnx_array[12][76])
     [exec] callback.c:458: error: initializer element is not constant
     [exec] callback.c:458: error: (near initialization for fnx_array[12][77])
     [exec] callback.c:458: error: initializer element is not constant
     [exec] callback.c:458: error: (near initialization for fnx_array[12][78])
     [exec] callback.c:458: error: initializer element is not constant
     [exec] callback.c:458: error: (near initialization for fnx_array[12][79])
     [exec] callback.c:458: error: initializer element is not constant
     [exec] callback.c:458: error: (near initialization for fnx_array[12][80])
     [exec] callback.c:458: error: initializer element is not constant
     [exec] callback.c:458: error: (near initialization for fnx_array[12][81])
     [exec] callback.c:458: error: initializer element is not constant
     [exec] callback.c:458: error: (near initialization for fnx_array[12][82])
     [exec] callback.c:458: error: initializer element is not constant
     [exec] callback.c:458: error: (near initialization for fnx_array[12][83])
     [exec] callback.c:458: error: initializer element is not constant
     [exec] callback.c:458: error: (near initialization for fnx_array[12][84])
     [exec] callback.c:458: error: initializer element is not constant
     [exec] callback.c:458: error: (near initialization for fnx_array[12][85])
     [exec] callback.c:458: error: initializer element is not constant
     [exec] callback.c:458: error: (near initialization for fnx_array[12][86])
     [exec] callback.c:458: error: initializer element is not constant
     [exec] callback.c:458: error: (near initialization for fnx_array[12][87])
     [exec] callback.c:458: error: initializer element is not constant
     [exec] callback.c:458: error: (near initialization for fnx_array[12][88])
     [exec] callback.c:458: error: initializer element is not constant
     [exec] callback.c:458: error: (near initialization for fnx_array[12][89])
     [exec] callback.c:458: error: initializer element is not constant
     [exec] callback.c:458: error: (near initialization for fnx_array[12][90])
     [exec] callback.c:458: error: initializer element is not constant
     [exec] callback.c:458: error: (near initialization for fnx_array[12][91])
     [exec] callback.c:458: error: initializer element is not constant
     [exec] callback.c:458: error: (near initialization for fnx_array[12][92])
     [exec] callback.c:458: error: initializer element is not constant
     [exec] callback.c:458: error: (near initialization for fnx_array[12][93])
     [exec] callback.c:458: error: initializer element is not constant
     [exec] callback.c:458: error: (near initialization for fnx_array[12][94])
     [exec] callback.c:458: error: initializer element is not constant
     [exec] callback.c:458: error: (near initialization for fnx_array[12][95])
     [exec] callback.c:458: error: initializer element is not constant
     [exec] callback.c:458: error: (near initialization for fnx_array[12][96])
     [exec] callback.c:458: error: initializer element is not constant
     [exec] callback.c:458: error: (near initialization for fnx_array[12][97])
     [exec] callback.c:458: error: initializer element is not constant
     [exec] callback.c:458: error: (near initialization for fnx_array[12][98])
     [exec] callback.c:458: error: initializer element is not constant
     [exec] callback.c:458: error: (near initialization for fnx_array[12][99])
     [exec] callback.c:458: error: initializer element is not constant
     [exec] callback.c:458: error: (near initialization for fnx_array[12][100])
     [exec] callback.c:458: error: initializer element is not constant
     [exec] callback.c:458: error: (near initialization for fnx_array[12][101])
     [exec] callback.c:458: error: initializer element is not constant
     [exec] callback.c:458: error: (near initialization for fnx_array[12][102])
     [exec] callback.c:458: error: initializer element is not constant
     [exec] callback.c:458: error: (near initialization for fnx_array[12][103])
     [exec] callback.c:458: error: initializer element is not constant
     [exec] callback.c:458: error: (near initialization for fnx_array[12][104])
     [exec] callback.c:458: error: initializer element is not constant
     [exec] callback.c:458: error: (near initialization for fnx_array[12][105])
     [exec] callback.c:458: error: initializer element is not constant
     [exec] callback.c:458: error: (near initialization for fnx_array[12][106])
     [exec] callback.c:458: error: initializer element is not constant
     [exec] callback.c:458: error: (near initialization for fnx_array[12][107])
     [exec] callback.c:458: error: initializer element is not constant
     [exec] callback.c:458: error: (near initialization for fnx_array[12][108])
     [exec] callback.c:458: error: initializer element is not constant
     [exec] callback.c:458: error: (near initialization for fnx_array[12][109])
     [exec] callback.c:458: error: initializer element is not constant
     [exec] callback.c:458: error: (near initialization for fnx_array[12][110])
     [exec] callback.c:458: error: initializer element is not constant
     [exec] callback.c:458: error: (near initialization for fnx_array[12][111])
     [exec] callback.c:458: error: initializer element is not constant
     [exec] callback.c:458: error: (near initialization for fnx_array[12][112])
     [exec] callback.c:458: error: initializer element is not constant
     [exec] callback.c:458: error: (near initialization for fnx_array[12][113])
     [exec] callback.c:458: error: initializer element is not constant
     [exec] callback.c:458: error: (near initialization for fnx_array[12][114])
     [exec] callback.c:458: error: initializer element is not constant
     [exec] callback.c:458: error: (near initialization for fnx_array[12][115])
     [exec] callback.c:458: error: initializer element is not constant
     [exec] callback.c:458: error: (near initialization for fnx_array[12][116])
     [exec] callback.c:458: error: initializer element is not constant
     [exec] callback.c:458: error: (near initialization for fnx_array[12][117])
     [exec] callback.c:458: error: initializer element is not constant
     [exec] callback.c:458: error: (near initialization for fnx_array[12][118])
     [exec] callback.c:458: error: initializer element is not constant
     [exec] callback.c:458: error: (near initialization for fnx_array[12][119])
     [exec] callback.c:458: error: initializer element is not constant
     [exec] callback.c:458: error: (near initialization for fnx_array[12][120])
     [exec] callback.c:458: error: initializer element is not constant
     [exec] callback.c:458: error: (near initialization for fnx_array[12][121])
     [exec] callback.c:458: error: initializer element is not constant
     [exec] callback.c:458: error: (near initialization for fnx_array[12][122])
     [exec] callback.c:458: error: initializer element is not constant
     [exec] callback.c:458: error: (near initialization for fnx_array[12][123])
     [exec] callback.c:458: error: initializer element is not constant
     [exec] callback.c:458: error: (near initialization for fnx_array[12][124])
     [exec] callback.c:458: error: initializer element is not constant
     [exec] callback.c:458: error: (near initialization for fnx_array[12][125])
     [exec] callback.c:458: error: initializer element is not constant
     [exec] callback.c:458: error: (near initialization for fnx_array[12][126])
     [exec] callback.c:458: error: initializer element is not constant
     [exec] callback.c:458: error: (near initialization for fnx_array[12][127])
     [exec] make: *** [callback.o] Error 1
     [exec] Result: 2
     [exec] Building Linux launcher. Defaults: -os linux -arch ppc64 -ws gtk
     [exec] rm -f eclipse eclipse_1207.so eclipseMain.o eclipseConfig.o eclipseCommon.o eclipseGtkCommon.o eclipseGtkInit.o eclipse.o eclipseGtk.o eclipseUtil.o eclipseJNI.o eclipseMozilla.o eclipseShm.o eclipseNix.o
     [exec] gcc -g -s -Wall -fpic -DLINUX -DMOZILLA_FIX -DDEFAULT_OS="\"linux\"" -DDEFAULT_OS_ARCH="\"ppc64\"" -DDEFAULT_WS="\"gtk\"" -DDEFAULT_JAVA_EXEC -DGTK_LIB="\"libgtk-x11-2.0.so.0\"" -DGDK_LIB="\"libgdk-x11-2.0.so.0\"" -DPIXBUF_LIB="\"libgdk_pixbuf-2.0.so.0\"" -DGOBJ_LIB="\"libgobject-2.0.so.0\"" -I. -I.. -I/opt/ibm/java-ppc64-60/jre/include -I/opt/ibm/java-ppc64-60/jre/include/linux `pkg-config --cflags gtk+-2.0` -c ../eclipseMain.c -o eclipseMain.o
     [exec] Package cairo was not found in the pkg-config search path.
     [exec] Perhaps you should add the directory containing `cairo.pc'
     [exec] to the PKG_CONFIG_PATH environment variable
     [exec] Package 'cairo', required by 'Pango Cairo', not found
     [exec] gcc -g -s -Wall -fpic -DLINUX -DMOZILLA_FIX -DDEFAULT_OS="\"linux\"" -DDEFAULT_OS_ARCH="\"ppc64\"" -DDEFAULT_WS="\"gtk\"" -DDEFAULT_JAVA_EXEC -DGTK_LIB="\"libgtk-x11-2.0.so.0\"" -DGDK_LIB="\"libgdk-x11-2.0.so.0\"" -DPIXBUF_LIB="\"libgdk_pixbuf-2.0.so.0\"" -DGOBJ_LIB="\"libgobject-2.0.so.0\"" -I. -I.. -I/opt/ibm/java-ppc64-60/jre/include -I/opt/ibm/java-ppc64-60/jre/include/linux `pkg-config --cflags gtk+-2.0` -c ../eclipseConfig.c -o eclipseConfig.o
     [exec] Package cairo was not found in the pkg-config search path.
     [exec] Perhaps you should add the directory containing `cairo.pc'
     [exec] to the PKG_CONFIG_PATH environment variable
     [exec] Package 'cairo', required by 'Pango Cairo', not found
     [exec] gcc -g -s -Wall -fpic -DLINUX -DMOZILLA_FIX -DDEFAULT_OS="\"linux\"" -DDEFAULT_OS_ARCH="\"ppc64\"" -DDEFAULT_WS="\"gtk\"" -DDEFAULT_JAVA_EXEC -DGTK_LIB="\"libgtk-x11-2.0.so.0\"" -DGDK_LIB="\"libgdk-x11-2.0.so.0\"" -DPIXBUF_LIB="\"libgdk_pixbuf-2.0.so.0\"" -DGOBJ_LIB="\"libgobject-2.0.so.0\"" -I. -I.. -I/opt/ibm/java-ppc64-60/jre/include -I/opt/ibm/java-ppc64-60/jre/include/linux `pkg-config --cflags gtk+-2.0` -c ../eclipseCommon.c
     [exec] Package cairo was not found in the pkg-config search path.
     [exec] Perhaps you should add the directory containing `cairo.pc'
     [exec] to the PKG_CONFIG_PATH environment variable
     [exec] Package 'cairo', required by 'Pango Cairo', not found
     [exec] ../eclipseCommon.c: In function filter:
     [exec] ../eclipseCommon.c:355: warning: initialization discards qualifiers from pointer target type
     [exec] gcc -g -s -Wall -fpic -DLINUX -DMOZILLA_FIX -DDEFAULT_OS="\"linux\"" -DDEFAULT_OS_ARCH="\"ppc64\"" -DDEFAULT_WS="\"gtk\"" -DDEFAULT_JAVA_EXEC -DGTK_LIB="\"libgtk-x11-2.0.so.0\"" -DGDK_LIB="\"libgdk-x11-2.0.so.0\"" -DPIXBUF_LIB="\"libgdk_pixbuf-2.0.so.0\"" -DGOBJ_LIB="\"libgobject-2.0.so.0\"" -I. -I.. -I/opt/ibm/java-ppc64-60/jre/include -I/opt/ibm/java-ppc64-60/jre/include/linux `pkg-config --cflags gtk+-2.0` -c eclipseGtkCommon.c -o eclipseGtkCommon.o
     [exec] Package cairo was not found in the pkg-config search path.
     [exec] Perhaps you should add the directory containing `cairo.pc'
     [exec] to the PKG_CONFIG_PATH environment variable
     [exec] Package 'cairo', required by 'Pango Cairo', not found
     [exec] In file included from eclipseGtkCommon.c:15:
     [exec] eclipseGtk.h:14:21: error: gtk/gtk.h: No such file or directory
     [exec] eclipseGtk.h:15:35: error: gdk-pixbuf/gdk-pixbuf.h: No such file or directory
     [exec] In file included from eclipseGtkCommon.c:15:
     [exec] eclipseGtk.h:19: error: expected specifier-qualifier-list before GtkObject
     [exec] eclipseGtkCommon.c:30: error: expected =, ,, ;, asm or __attribute__ before gtkInitialized
     [exec] eclipseGtkCommon.c: In function displayMessage:
     [exec] eclipseGtkCommon.c:47: error: GtkWidget undeclared (first use in this function)
     [exec] eclipseGtkCommon.c:47: error: (Each undeclared identifier is reported only once
     [exec] eclipseGtkCommon.c:47: error: for each function it appears in.)
     [exec] eclipseGtkCommon.c:47: error: dialog undeclared (first use in this function)
     [exec] eclipseGtkCommon.c:53: error: struct GTK_PTRS has no member named gtk_message_dialog_new
     [exec] eclipseGtkCommon.c:53: error: GTK_DIALOG_DESTROY_WITH_PARENT undeclared (first use in this function)
     [exec] eclipseGtkCommon.c:54: error: GTK_MESSAGE_ERROR undeclared (first use in this function)
     [exec] eclipseGtkCommon.c:54: error: GTK_BUTTONS_CLOSE undeclared (first use in this function)
     [exec] eclipseGtkCommon.c:56: error: struct GTK_PTRS has no member named gtk_window_set_title
     [exec] eclipseGtkCommon.c:56: error: GtkWindow undeclared (first use in this function)
     [exec] eclipseGtkCommon.c:56: error: expected expression before ) token
     [exec] eclipseGtkCommon.c:57: error: struct GTK_PTRS has no member named gtk_dialog_run
     [exec] eclipseGtkCommon.c:57: error: GtkDialog undeclared (first use in this function)
     [exec] eclipseGtkCommon.c:57: error: expected expression before ) token
     [exec] eclipseGtkCommon.c:58: error: struct GTK_PTRS has no member named gtk_widget_destroy
     [exec] eclipseGtkCommon.c: In function initWindowSystem:
     [exec] eclipseGtkCommon.c:67: error: gtkInitialized undeclared (first use in this function)
     [exec] eclipseGtkCommon.c:88: error: struct GTK_PTRS has no member named gtk_set_locale
     [exec] eclipseGtkCommon.c:89: error: struct GTK_PTRS has no member named gtk_init_check
     [exec] eclipseGtkCommon.c:91: error: TRUE undeclared (first use in this function)
     [exec] make: *** [eclipseGtkCommon.o] Error 1

BUILD FAILED
/home/eclipsebuild/eclipse-build/build.xml:404: exec returned: 2

Total time: 14 minutes 21 seconds