All pastes #162240 Raw Edit

Something

public text v1 · immutable
·published 2006-09-06 09:15 UTC
rendered paste body
Making install in ecore_evas
make[4]: Entering directory `/tmp/buildd/etk-0.1.0.002/src/engines/ecore_evas'
if /bin/sh ../../../libtool --mode=compile i486-linux-gnu-gcc -DHAVE_CONFIG_H -I. -I. -I../../.. -I../../../src/lib -I../../../src/engines/ecore_evas -g -Wall    -Wall -g -O2 -MT ecore_evas.lo -MD -MP -MF ".deps/ecore_evas.Tpo" -c -o ecore_evas.lo ecore_evas.c; \
        then mv -f ".deps/ecore_evas.Tpo" ".deps/ecore_evas.Plo"; else rm -f ".deps/ecore_evas.Tpo"; exit 1; fi
mkdir .libs
 i486-linux-gnu-gcc -DHAVE_CONFIG_H -I. -I. -I../../.. -I../../../src/lib -I../../../src/engines/ecore_evas -g -Wall -Wall -g -O2 -MT ecore_evas.lo -MD -MP -MF .deps/ecore_evas.Tpo -c ecore_evas.c  -fPIC -DPIC -o .libs/ecore_evas.o
 i486-linux-gnu-gcc -DHAVE_CONFIG_H -I. -I. -I../../.. -I../../../src/lib -I../../../src/engines/ecore_evas -g -Wall -Wall -g -O2 -MT ecore_evas.lo -MD -MP -MF .deps/ecore_evas.Tpo -c ecore_evas.c -o ecore_evas.o >/dev/null 2>&1
/bin/sh ../../../libtool --mode=link i486-linux-gnu-gcc  -Wall -g -O2  -Wl,-z,defs -o ecore_evas.la -rpath /usr/lib/etk/engines -module -avoid-version -L../../../src/lib -L../../../src/lib/.libs ecore_evas.lo ../../../src/lib/libetk.la 
i486-linux-gnu-gcc -shared  .libs/ecore_evas.o  -Wl,--rpath -Wl,/tmp/buildd/etk-0.1.0.002/src/lib/.libs -L/tmp/buildd/etk-0.1.0.002/src/lib/.libs ../../../src/lib/.libs/libetk.so  -Wl,-z -Wl,defs -Wl,-soname -Wl,ecore_evas.so -o .libs/ecore_evas.so
.libs/ecore_evas.o: In function `_engine_init':/tmp/buildd/etk-0.1.0.002/src/engines/ecore_evas/ecore_evas.c:151: undefined reference to `ecore_evas_init'
.libs/ecore_evas.o: In function `_engine_shutdown':/tmp/buildd/etk-0.1.0.002/src/engines/ecore_evas/ecore_evas.c:162: undefined reference to `ecore_evas_shutdown'
.libs/ecore_evas.o: In function `_window_constructor':/tmp/buildd/etk-0.1.0.002/src/engines/ecore_evas/ecore_evas.c:178: undefined reference to `ecore_evas_get'
:/tmp/buildd/etk-0.1.0.002/src/engines/ecore_evas/ecore_evas.c:179: undefined reference to `ecore_evas_data_set'
:/tmp/buildd/etk-0.1.0.002/src/engines/ecore_evas/ecore_evas.c:180: undefined reference to `ecore_evas_callback_move_set'
:/tmp/buildd/etk-0.1.0.002/src/engines/ecore_evas/ecore_evas.c:181: undefined reference to `ecore_evas_callback_resize_set'
:/tmp/buildd/etk-0.1.0.002/src/engines/ecore_evas/ecore_evas.c:182: undefined reference to `ecore_evas_callback_focus_in_set'
:/tmp/buildd/etk-0.1.0.002/src/engines/ecore_evas/ecore_evas.c:183: undefined reference to `ecore_evas_callback_focus_out_set'
:/tmp/buildd/etk-0.1.0.002/src/engines/ecore_evas/ecore_evas.c:184: undefined reference to `ecore_evas_callback_sticky_set'
:/tmp/buildd/etk-0.1.0.002/src/engines/ecore_evas/ecore_evas.c:185: undefined reference to `ecore_evas_callback_unsticky_set'
:/tmp/buildd/etk-0.1.0.002/src/engines/ecore_evas/ecore_evas.c:186: undefined reference to `ecore_evas_callback_delete_request_set'
.libs/ecore_evas.o: In function `_window_destructor':/tmp/buildd/etk-0.1.0.002/src/engines/ecore_evas/ecore_evas.c:195: undefined reference to `ecore_evas_free'
.libs/ecore_evas.o: In function `_window_show':/tmp/buildd/etk-0.1.0.002/src/engines/ecore_evas/ecore_evas.c:204: undefined reference to `ecore_evas_show'
.libs/ecore_evas.o: In function `_window_hide':/tmp/buildd/etk-0.1.0.002/src/engines/ecore_evas/ecore_evas.c:213: undefined reference to `ecore_evas_hide'
.libs/ecore_evas.o: In function `_window_evas_get':/tmp/buildd/etk-0.1.0.002/src/engines/ecore_evas/ecore_evas.c:222: undefined reference to `ecore_evas_get'
.libs/ecore_evas.o: In function `_window_title_set':/tmp/buildd/etk-0.1.0.002/src/engines/ecore_evas/ecore_evas.c:231: undefined reference to `ecore_evas_title_set'
.libs/ecore_evas.o: In function `_window_title_get':/tmp/buildd/etk-0.1.0.002/src/engines/ecore_evas/ecore_evas.c:241: undefined reference to `ecore_evas_title_get'
.libs/ecore_evas.o: In function `_window_wmclass_set':/tmp/buildd/etk-0.1.0.002/src/engines/ecore_evas/ecore_evas.c:250: undefined reference to `ecore_evas_name_class_set'
.libs/ecore_evas.o: In function `_window_move':/tmp/buildd/etk-0.1.0.002/src/engines/ecore_evas/ecore_evas.c:259: undefined reference to `ecore_evas_move'
.libs/ecore_evas.o: In function `_window_resize':/tmp/buildd/etk-0.1.0.002/src/engines/ecore_evas/ecore_evas.c:269: undefined reference to `ecore_evas_size_min_get'
:/tmp/buildd/etk-0.1.0.002/src/engines/ecore_evas/ecore_evas.c:272: undefined reference to `ecore_evas_resize'
.libs/ecore_evas.o: In function `_window_size_min_set':/tmp/buildd/etk-0.1.0.002/src/engines/ecore_evas/ecore_evas.c:281: undefined reference to `ecore_evas_size_min_set'
.libs/ecore_evas.o: In function `_window_screen_position_get':/tmp/buildd/etk-0.1.0.002/src/engines/ecore_evas/ecore_evas.c:297: undefined reference to `ecore_evas_geometry_get'
.libs/ecore_evas.o: In function `_window_iconified_set':/tmp/buildd/etk-0.1.0.002/src/engines/ecore_evas/ecore_evas.c:313: undefined reference to `ecore_evas_iconified_set'
.libs/ecore_evas.o: In function `_window_iconified_get':/tmp/buildd/etk-0.1.0.002/src/engines/ecore_evas/ecore_evas.c:322: undefined reference to `ecore_evas_iconified_get'
.libs/ecore_evas.o: In function `_window_maximized_set':/tmp/buildd/etk-0.1.0.002/src/engines/ecore_evas/ecore_evas.c:331: undefined reference to `ecore_evas_maximized_set'
.libs/ecore_evas.o: In function `_window_maximized_get':/tmp/buildd/etk-0.1.0.002/src/engines/ecore_evas/ecore_evas.c:341: undefined reference to `ecore_evas_maximized_get'
.libs/ecore_evas.o: In function `_window_fullscreen_set':/tmp/buildd/etk-0.1.0.002/src/engines/ecore_evas/ecore_evas.c:350: undefined reference to `ecore_evas_fullscreen_set'
.libs/ecore_evas.o: In function `_window_fullscreen_get':/tmp/buildd/etk-0.1.0.002/src/engines/ecore_evas/ecore_evas.c:360: undefined reference to `ecore_evas_fullscreen_get'
.libs/ecore_evas.o: In function `_window_raise':/tmp/buildd/etk-0.1.0.002/src/engines/ecore_evas/ecore_evas.c:369: undefined reference to `ecore_evas_raise'
.libs/ecore_evas.o: In function `_window_lower':/tmp/buildd/etk-0.1.0.002/src/engines/ecore_evas/ecore_evas.c:378: undefined reference to `ecore_evas_lower'
.libs/ecore_evas.o: In function `_window_sticky_set':/tmp/buildd/etk-0.1.0.002/src/engines/ecore_evas/ecore_evas.c:387: undefined reference to `ecore_evas_sticky_set'
.libs/ecore_evas.o: In function `_window_sticky_get':/tmp/buildd/etk-0.1.0.002/src/engines/ecore_evas/ecore_evas.c:396: undefined reference to `ecore_evas_sticky_get'
.libs/ecore_evas.o: In function `_window_focused_set':/tmp/buildd/etk-0.1.0.002/src/engines/ecore_evas/ecore_evas.c:405: undefined reference to `ecore_evas_focus_set'
.libs/ecore_evas.o: In function `_window_focused_get':/tmp/buildd/etk-0.1.0.002/src/engines/ecore_evas/ecore_evas.c:414: undefined reference to `ecore_evas_focus_get'
.libs/ecore_evas.o: In function `_window_decorated_set':/tmp/buildd/etk-0.1.0.002/src/engines/ecore_evas/ecore_evas.c:423: undefined reference to `ecore_evas_borderless_set'
.libs/ecore_evas.o: In function `_window_decorated_get':/tmp/buildd/etk-0.1.0.002/src/engines/ecore_evas/ecore_evas.c:433: undefined reference to `ecore_evas_borderless_get'
.libs/ecore_evas.o: In function `_window_shaped_set':/tmp/buildd/etk-0.1.0.002/src/engines/ecore_evas/ecore_evas.c:442: undefined reference to `ecore_evas_shaped_set'
.libs/ecore_evas.o: In function `_window_shaped_get':/tmp/buildd/etk-0.1.0.002/src/engines/ecore_evas/ecore_evas.c:452: undefined reference to `ecore_evas_shaped_get'
.libs/ecore_evas.o: In function `_window_move_cb':/tmp/buildd/etk-0.1.0.002/src/engines/ecore_evas/ecore_evas.c:466: undefined reference to `ecore_evas_data_get'
.libs/ecore_evas.o: In function `_window_resize_cb':/tmp/buildd/etk-0.1.0.002/src/engines/ecore_evas/ecore_evas.c:477: undefined reference to `ecore_evas_data_get'
:/tmp/buildd/etk-0.1.0.002/src/engines/ecore_evas/ecore_evas.c:480: undefined reference to `ecore_evas_geometry_get'
.libs/ecore_evas.o: In function `_window_focus_in_cb':/tmp/buildd/etk-0.1.0.002/src/engines/ecore_evas/ecore_evas.c:490: undefined reference to `ecore_evas_data_get'
.libs/ecore_evas.o: In function `_window_focus_out_cb':/tmp/buildd/etk-0.1.0.002/src/engines/ecore_evas/ecore_evas.c:501: undefined reference to `ecore_evas_data_get'
.libs/ecore_evas.o: In function `_window_sticky_changed_cb':/tmp/buildd/etk-0.1.0.002/src/engines/ecore_evas/ecore_evas.c:512: undefined reference to `ecore_evas_data_get'
.libs/ecore_evas.o: In function `_window_delete_request_cb':/tmp/buildd/etk-0.1.0.002/src/engines/ecore_evas/ecore_evas.c:523: undefined reference to `ecore_evas_data_get'
collect2: ld returned 1 exit status
make[4]: *** [ecore_evas.la] Error 1
make[4]: Leaving directory `/tmp/buildd/etk-0.1.0.002/src/engines/ecore_evas'
make[3]: *** [install-recursive] Error 1
make[3]: Leaving directory `/tmp/buildd/etk-0.1.0.002/src/engines'
make[2]: *** [install-recursive] Error 1
make[2]: Leaving directory `/tmp/buildd/etk-0.1.0.002/src'
make[1]: *** [install-recursive] Error 1
make[1]: Leaving directory `/tmp/buildd/etk-0.1.0.002'
make: *** [install-arch] Error 2
pbuilder: Failed autobuilding of package
 -> Aborting with an error
 -> unmounting dev/pts filesystem
 -> unmounting proc filesystem
 -> cleaning the build env 
    -> removing directory /var/cache/pbuilder-dapper/build//6041 and its subdirectories