Building CXX object scribus/CMakeFiles/scribus.dir/tabdisplay.o
/usr/bin/c++ -O0 -g3 -Wall -I/home/mrdocs/cvs/cmakescribus/scribus -I/home/mrdocs/cvs/13/Scribus/scribus -I/home/mrdocs/cvs/cmakescribus -I/usr/lib/qt3/include -I/usr/include/freetype2 -I/usr/include/libxml2 -I/usr/include/python2.4 -I/usr/local/include/cairo -I/home/mrdocs/cvs/13/Scribus -I/home/mrdocs/cvs/13/Scribus/scribus/text -I/home/mrdocs/cvs/13/Scribus/scribus/fonts -I/home/mrdocs/cvs/13/Scribus/scribus/desaxe -DSHAREDIR=\"/opt/134cairo/share/scribus/\" -DDOCDIR=\"/opt/134cairo/share/doc/scribus/\" -DICONDIR=\"/opt/134cairo/share/scribus/icons/\" -DSAMPLESDIR=\"/opt/134cairo/share/scribus/samples/\" -DSCRIPTSDIR=\"/opt/134cairo/share/scribus/scripts/\" -DTEMPLATEDIR=\"/opt/134cairo/share/scribus/templates/\" -DLIBDIR=\"/opt/134cairo/lib/scribus/\" -DPLUGINDIR=\"/opt/134cairo/lib/scribus/plugins/\" -DQT_SHARED -DQT_NO_DEBUG -DQT_THREAD_SUPPORT -D_REENTRANT -DHAVE_DLFCN_H -DHAVE_UNISTD_H -DHAVE_CONFIG_H -o scribus/CMakeFiles/scribus.dir/tabdisplay.o -c /home/mrdocs/cvs/13/Scribus/scribus/tabdisplay.cpp
/home/mrdocs/cvs/13/Scribus/scribus/tabdisplay.cpp: In constructor TabDisplay::TabDisplay(QWidget*, const char*):
/home/mrdocs/cvs/13/Scribus/scribus/tabdisplay.cpp:41: error: buttonFrameSelected was not declared in this scope
/home/mrdocs/cvs/13/Scribus/scribus/tabdisplay.cpp:42: error: buttonFrameNormal was not declared in this scope
/home/mrdocs/cvs/13/Scribus/scribus/tabdisplay.cpp:43: error: buttonFrameGrouped was not declared in this scope
/home/mrdocs/cvs/13/Scribus/scribus/tabdisplay.cpp:44: error: buttonFrameLinked was not declared in this scope
/home/mrdocs/cvs/13/Scribus/scribus/tabdisplay.cpp:45: error: buttonFrameLocked was not declared in this scope
/home/mrdocs/cvs/13/Scribus/scribus/tabdisplay.cpp:46: error: buttonFrameAnnotation was not declared in this scope
/home/mrdocs/cvs/13/Scribus/scribus/tabdisplay.cpp:47: error: buttonSelectedPage was not declared in this scope
/home/mrdocs/cvs/13/Scribus/scribus/tabdisplay.cpp:48: error: buttonControlChars was not declared in this scope
/home/mrdocs/cvs/13/Scribus/scribus/tabdisplay.cpp: In member function void TabDisplay::restoreDefaults(ApplicationPrefs*, guidesPrefs*):
/home/mrdocs/cvs/13/Scribus/scribus/tabdisplay.cpp:68: error: buttonFrameSelected was not declared in this scope
/home/mrdocs/cvs/13/Scribus/scribus/tabdisplay.cpp:72: error: buttonFrameNormal was not declared in this scope
/home/mrdocs/cvs/13/Scribus/scribus/tabdisplay.cpp:76: error: buttonFrameGrouped was not declared in this scope
/home/mrdocs/cvs/13/Scribus/scribus/tabdisplay.cpp:80: error: buttonFrameLinked was not declared in this scope
/home/mrdocs/cvs/13/Scribus/scribus/tabdisplay.cpp:84: error: buttonFrameLocked was not declared in this scope
/home/mrdocs/cvs/13/Scribus/scribus/tabdisplay.cpp:88: error: buttonFrameAnnotation was not declared in this scope
/home/mrdocs/cvs/13/Scribus/scribus/tabdisplay.cpp:92: error: buttonSelectedPage was not declared in this scope
/home/mrdocs/cvs/13/Scribus/scribus/tabdisplay.cpp:96: error: buttonControlChars was not declared in this scope
/home/mrdocs/cvs/13/Scribus/scribus/tabdisplay.cpp: In member function void TabDisplay::setDocSetupMode():
/home/mrdocs/cvs/13/Scribus/scribus/tabdisplay.cpp:259: error: selectedPageBorderLabel was not declared in this scope
/home/mrdocs/cvs/13/Scribus/scribus/tabdisplay.cpp:260: error: buttonSelectedPage was not declared in this scope
/home/mrdocs/cvs/13/Scribus/scribus/tabdisplay.cpp:261: error: groupObjFrame was not declared in this scope
/home/mrdocs/cvs/13/Scribus/scribus/tabdisplay.cpp:262: error: textColorGroup was not declared in this scope
/home/mrdocs/cvs/13/Scribus/scribus/tabdisplay.cpp: In member function virtual void TabDisplay::changeFrameColor():
/home/mrdocs/cvs/13/Scribus/scribus/tabdisplay.cpp:274: error: buttonFrameSelected was not declared in this scope
/home/mrdocs/cvs/13/Scribus/scribus/tabdisplay.cpp: In member function virtual void TabDisplay::changeNormFrameColor():
/home/mrdocs/cvs/13/Scribus/scribus/tabdisplay.cpp:287: error: buttonFrameNormal was not declared in this scope
/home/mrdocs/cvs/13/Scribus/scribus/tabdisplay.cpp: In member function virtual void TabDisplay::changeGroupFrameColor():
/home/mrdocs/cvs/13/Scribus/scribus/tabdisplay.cpp:300: error: buttonFrameGrouped was not declared in this scope
/home/mrdocs/cvs/13/Scribus/scribus/tabdisplay.cpp: In member function virtual void TabDisplay::changeChainFrameColor():
/home/mrdocs/cvs/13/Scribus/scribus/tabdisplay.cpp:313: error: buttonFrameLinked was not declared in this scope
/home/mrdocs/cvs/13/Scribus/scribus/tabdisplay.cpp: In member function virtual void TabDisplay::changeLockFrameColor():
/home/mrdocs/cvs/13/Scribus/scribus/tabdisplay.cpp:326: error: buttonFrameLocked was not declared in this scope
/home/mrdocs/cvs/13/Scribus/scribus/tabdisplay.cpp: In member function virtual void TabDisplay::changeAnnotFrameColor():
/home/mrdocs/cvs/13/Scribus/scribus/tabdisplay.cpp:339: error: buttonFrameAnnotation was not declared in this scope
/home/mrdocs/cvs/13/Scribus/scribus/tabdisplay.cpp: In member function virtual void TabDisplay::changePageBorderColor():
/home/mrdocs/cvs/13/Scribus/scribus/tabdisplay.cpp:352: error: buttonSelectedPage was not declared in this scope
/home/mrdocs/cvs/13/Scribus/scribus/tabdisplay.cpp: In member function virtual void TabDisplay::changeControlCharsColor():
/home/mrdocs/cvs/13/Scribus/scribus/tabdisplay.cpp:365: error: buttonControlChars was not declared in this scope
make[2]: *** [scribus/CMakeFiles/scribus.dir/tabdisplay.o] Error 1
make[2]: Leaving directory `/home/mrdocs/cvs/cmakescribus'
make[1]: *** [scribus/CMakeFiles/scribus.dir/all] Error 2
make[1]: Leaving directory `/home/mrdocs/cvs/cmakescribus'
make: *** [all] Error 2
mrdocs@linux:~/cvs/cmakescribus>