All pastes #160884 Raw Edit

Untitled

public text v1 · immutable
·published 2006-09-04 20:10 UTC
rendered paste body
saveload.c:1063:18: error: zlib.h: No such file or directory
saveload.c:1065: error: syntax error before ‘_z’
saveload.c:1065: warning: type defaults to ‘int’ in declaration of ‘_z’
saveload.c:1065: warning: data definition has no type or storage class
saveload.c: In function ‘InitReadZlib’:
saveload.c:1070: warning: implicit declaration of function ‘inflateInit’
saveload.c:1070: error: ‘Z_OK’ undeclared (first use in this function)
saveload.c:1070: error: (Each undeclared identifier is reported only once
saveload.c:1070: error: for each function it appears in.)
saveload.c: In function ‘ReadZlib’:
saveload.c:1081: error: request for member ‘next_out’ in something not a structure or union
saveload.c:1082: error: request for member ‘avail_out’ in something not a structure or union
saveload.c:1086: error: request for member ‘avail_in’ in something not a structure or union
saveload.c:1087: error: request for member ‘avail_in’ in something not a structure or union
saveload.c:1087: error: request for member ‘next_in’ in something not a structure or union
saveload.c:1091: warning: implicit declaration of function ‘inflate’
saveload.c:1092: error: ‘Z_STREAM_END’ undeclared (first use in this function)
saveload.c:1095: error: ‘Z_OK’ undeclared (first use in this function)
saveload.c:1097: error: request for member ‘avail_out’ in something not a structure or union
saveload.c:1099: error: request for member ‘avail_out’ in something not a structure or union
saveload.c: In function ‘UninitReadZlib’:
saveload.c:1104: warning: implicit declaration of function ‘inflateEnd’
saveload.c: In function ‘InitWriteZlib’:
saveload.c:1111: warning: implicit declaration of function ‘deflateInit’
saveload.c:1111: error: ‘Z_OK’ undeclared (first use in this function)
saveload.c: At top level:
saveload.c:1118: error: syntax error before ‘z’
saveload.c:1119: warning: function declaration isn’t a prototype
saveload.c: In function ‘WriteZlibLoop’:
saveload.c:1119: warning: old-style function definition
saveload.c:1123: error: ‘z’ undeclared (first use in this function)
saveload.c:1123: error: ‘p’ undeclared (first use in this function)
saveload.c:1124: error: ‘len’ undeclared (first use in this function)
saveload.c:1128: warning: implicit declaration of function ‘deflate’
saveload.c:1128: error: ‘mode’ undeclared (first use in this function)
saveload.c:1133: error: ‘Z_STREAM_END’ undeclared (first use in this function)
saveload.c:1135: error: ‘Z_OK’ undeclared (first use in this function)
saveload.c: In function ‘UninitWriteZlib’:
saveload.c:1147: error: ‘Z_FINISH’ undeclared (first use in this function)
saveload.c:1148: warning: implicit declaration of function ‘deflateEnd’
make: *** [saveload.o] Error 1