Installing sys-apps/findutils-4.3.0::gentoo
>>> Starting builtin_fetch
>>> Already have findutils-4.3.0.tar.gz
* Checking MD5 for findutils-4.3.0.tar.gz ... [ ok ]
* Checking RMD160 for findutils-4.3.0.tar.gz ... [ ok ]
* Checking SHA256 for findutils-4.3.0.tar.gz ... [ ok ]
>>> Done builtin_fetch
>>> Starting builtin_init
>>> Done builtin_init
>>> Starting pkg_setup
>>> Done pkg_setup
>>> Starting src_unpack
>>> Unpacking findutils-4.3.0.tar.gz to /var/tmp/paludis/sys-apps/findutils-4.3.0/work
tar zxf /mnt/storage/stagepaludis/var/paludis/repositories/gentoo/distfiles/findutils-4.3.0.tar.gz
* Applying gnulib-openat-mode_t.patch ... [ ok ]
>>> Done src_unpack
>>> Starting src_compile
econf: updating /var/tmp/paludis/sys-apps/findutils-4.3.0/work/findutils-4.3.0/config.guess with /usr/share/gnuconfig/config.guess
econf: updating /var/tmp/paludis/sys-apps/findutils-4.3.0/work/findutils-4.3.0/config.sub with /usr/share/gnuconfig/config.sub
./configure --prefix=/usr --host=i686-pc-linux-gnu --mandir=/usr/share/man --infodir=/usr/share/info --datadir=/usr/share --sysconfdir=/etc --localstatedir=/var/lib --enable-nls
configure: WARNING: If you wanted to set the --build type, don't use --host.
If a cross compiler is detected then cross compile mode will be used.
checking for a BSD-compatible install... /usr/bin/install -c
checking whether build environment is sane... yes
checking for gawk... gawk
checking whether make sets $(MAKE)... yes
checking for i686-pc-linux-gnu-strip... i686-pc-linux-gnu-strip
checking build system type... i686-pc-linux-gnu
checking host system type... i686-pc-linux-gnu
checking whether debug output should be produced... no
checking for leaf optimisation... yes
checking for i686-pc-linux-gnu-gcc... i686-pc-linux-gnu-gcc
checking for C compiler default output file name... a.out
checking whether the C compiler works... yes
checking whether we are cross compiling... no
checking for suffix of executables...
checking for suffix of object files... o
checking whether we are using the GNU C compiler... yes
checking whether i686-pc-linux-gnu-gcc accepts -g... yes
checking for i686-pc-linux-gnu-gcc option to accept ANSI C... none needed
checking for style of include used by make... GNU
checking dependency style of i686-pc-linux-gnu-gcc... gcc3
checking how to run the C preprocessor... i686-pc-linux-gnu-gcc -E
checking for egrep... grep -E
checking for AIX... no
checking for ANSI C header files... yes
checking for sys/types.h... yes
checking for sys/stat.h... yes
checking for stdlib.h... yes
checking for string.h... yes
checking for memory.h... yes
checking for strings.h... yes
checking for inttypes.h... yes
checking for stdint.h... yes
checking for unistd.h... yes
checking minix/config.h usability... no
checking minix/config.h presence... no
checking for minix/config.h... no
checking for library containing strerror... none required
checking for function prototypes... yes
checking for string.h... (cached) yes
checking for a BSD-compatible install... /usr/bin/install -c
checking for i686-pc-linux-gnu-ranlib... i686-pc-linux-gnu-ranlib
checking whether make sets $(MAKE)... (cached) yes
checking for special C compiler options needed for large files... no
checking for _FILE_OFFSET_BITS value needed for large files... 64
checking for _LARGE_FILES value needed for large files... no
checking for working alloca.h... yes
checking for alloca... yes
checking for stdbool.h that conforms to C99... yes
checking for _Bool... yes
checking for fdopendir... yes
checking for fchdir... yes
checking for mempcpy... yes
checking for alarm... yes
checking for iswprint... yes
checking for mbsinit... yes
checking for isblank... yes
checking for mbrtowc... yes
checking for wcrtomb... yes
checking for wcscoll... yes
checking for mblen... yes
checking for mbrlen... yes
checking for tzset... yes
checking for isascii... yes
checking whether memrchr is declared... yes
checking whether system is Windows or MSDOS... no
checking whether strerror_r is declared... yes
checking for strerror_r... yes
checking whether strerror_r returns char *... yes
checking sys/param.h usability... yes
checking sys/param.h presence... yes
checking for sys/param.h... yes
checking wchar.h usability... yes
checking wchar.h presence... yes
checking for wchar.h... yes
checking wctype.h usability... yes
checking wctype.h presence... yes
checking for wctype.h... yes
checking sys/time.h usability... yes
checking sys/time.h presence... yes
checking for sys/time.h... yes
checking locale.h usability... yes
checking locale.h presence... yes
checking for locale.h... yes
checking for an ANSI C-conforming const... yes
checking for mbstate_t... yes
checking whether getcwd (NULL, 0) allocates memory for result... yes
checking whether getcwd is declared... yes
checking for d_ino member in directory struct... no
checking whether getdelim is declared... yes
checking getopt.h usability... yes
checking getopt.h presence... yes
checking for getopt.h... yes
checking for getopt_long_only... yes
checking whether optreset is declared... no
checking for working GNU getopt function... yes
checking for inttypes.h... yes
checking for stdint.h... yes
checking for unsigned long long... yes
checking whether lstat dereferences a symlink specified with a trailing slash... yes
checking whether mbrtowc and mbstate_t are properly declared... yes
checking for working memcmp... yes
checking whether time.h and sys/time.h may both be included... yes
checking for working mktime... yes
checking for C/C++ restrict keyword... __restrict
checking for nl_langinfo and CODESET... yes
checking whether closedir returns void... yes
checking whether stat file-mode macros are broken... no
checking whether strdup is declared... yes
checking for strftime... yes
checking whether struct tm is in sys/time.h or time.h... time.h
checking for struct tm.tm_zone... yes
checking for struct tm.tm_gmtoff... yes
checking for long long... yes
checking for inline... inline
checking whether strtoimax is declared... yes
checking whether strtoumax is declared... yes
checking for atexit... yes
checking for sys/param.h... (cached) yes
checking for resolvepath... no
checking for canonicalize_file_name... yes
checking whether this system has an arbitrary file name length limit... yes
checking for mempcpy... (cached) yes
checking for openat... yes
checking for memrchr... yes
checking for dirent.h that defines DIR... yes
checking for library containing opendir... none required
checking for dirfd... yes
checking whether dirfd is declared... yes
checking whether dirfd is a macro... no
checking for error_at_line... yes
checking for struct stat.st_blocks... yes
checking for working GNU fnmatch... yes
checking stdio_ext.h usability... yes
checking stdio_ext.h presence... yes
checking for stdio_ext.h... yes
checking for __fpending... yes
checking whether __fpending is declared... yes
checking whether getcwd handles long file names properly... no, but it is partly working
checking for getdelim... yes
checking whether getline is declared... yes
checking for getline... yes
checking for working getline function... yes
checking for stdlib.h... (cached) yes
checking for GNU libc compatible malloc... yes
checking for memchr... yes
checking for mempcpy... (cached) yes
checking for memrchr... (cached) yes
checking for memset... yes
checking for listmntent... no
checking for getmntinfo... no
checking for sys/ucred.h... no
checking for sys/mount.h... yes
checking mntent.h usability... yes
checking mntent.h presence... yes
checking for mntent.h... yes
checking sys/fs_types.h usability... no
checking sys/fs_types.h presence... no
checking for sys/fs_types.h... no
checking for struct fsstat.f_fstypename... no
checking for library containing getmntent... none required
checking for getmntent... yes
checking for listmntent of Cray/Unicos-9... no
checking for mntctl function and struct vmount... no
checking for one-argument getmntent function... yes
checking sys/mntent.h usability... no
checking sys/mntent.h presence... no
checking for sys/mntent.h... no
checking for f_fstypename in struct statfs... no
checking for openat... (cached) yes
checking for mbstate_t... (cached) yes
checking whether mbrtowc and mbstate_t are properly declared... (cached) yes
checking for readlink... yes
checking for stdlib.h... (cached) yes
checking for GNU libc compatible realloc... yes
checking whether off_t can be used in a switch statement... yes
checking for working re_compile_pattern... yes
checking for C/C++ restrict keyword... (cached) __restrict
checking for rpmatch... yes
checking for ssize_t... yes
checking for stpcpy... yes
checking for strncasecmp... yes
checking for strdup... yes
checking whether <inttypes.h> defines strtoimax as a macro... no
checking for strtoimax... yes
checking for strtol... yes
checking for strtoll... yes
checking for strtoul... yes
checking for strtoull... yes
checking whether <inttypes.h> defines strtoumax as a macro... no
checking for strtoumax... yes
checking whether localtime_r is compatible with its POSIX signature... yes
checking for getpwnam... yes
checking for ANSI C header files... (cached) yes
checking fcntl.h usability... yes
checking fcntl.h presence... yes
checking for fcntl.h... yes
checking for string.h... (cached) yes
checking limits.h usability... yes
checking limits.h presence... yes
checking for limits.h... yes
checking errno.h usability... yes
checking errno.h presence... yes
checking for errno.h... yes
checking for stdlib.h... (cached) yes
checking stddef.h usability... yes
checking stddef.h presence... yes
checking for stddef.h... yes
checking for unistd.h... (cached) yes
checking for sys/types.h... (cached) yes
checking for inttypes.h... (cached) yes
checking for fcntl.h... (cached) yes
checking for locale.h... (cached) yes
checking for stdint.h... (cached) yes
checking for sys/param.h... (cached) yes
checking for mntent.h... (cached) yes
checking sys/mnttab.h usability... no
checking sys/mnttab.h presence... no
checking for sys/mnttab.h... no
checking sys/mntio.h usability... no
checking sys/mntio.h presence... no
checking for sys/mntio.h... no
checking sys/mkdev.h usability... no
checking sys/mkdev.h presence... no
checking for sys/mkdev.h... no
checking sys/utsname.h usability... yes
checking sys/utsname.h presence... yes
checking for sys/utsname.h... yes
checking whether sys/types.h defines makedev... yes
checking for dirent.h that defines DIR... (cached) yes
checking for library containing opendir... (cached) none required
checking whether stat file-mode macros are broken... (cached) no
checking for sys/wait.h that is POSIX.1 compatible... yes
checking for uid_t in sys/types.h... yes
checking for size_t... yes
checking for ssize_t... yes
checking for pid_t... yes
checking for ino_t... yes
checking for dev_t... yes
checking for mode_t... yes
checking for struct stat.st_blocks... (cached) yes
checking for struct stat.st_rdev... yes
checking whether we should use struct dirent.d_type, if available... yes
checking for struct dirent.d_type... yes
checking whether struct tm is in sys/time.h or time.h... (cached) time.h
checking for struct tm.tm_zone... (cached) yes
checking for strftime... (cached) yes
checking for memcmp... yes
checking for memset... (cached) yes
checking for stpcpy... (cached) yes
checking for strdup... (cached) yes
checking for strstr... yes
checking for strtol... (cached) yes
checking for strtoul... (cached) yes
checking for fchdir... (cached) yes
checking for getcwd... yes
checking for strerror... yes
checking for endgrent... yes
checking for endpwent... yes
checking for setlocale... yes
checking for vprintf... yes
checking for _doprnt... no
checking for working alloca.h... (cached) yes
checking for alloca... (cached) yes
checking whether closedir returns void... (cached) yes
checking for getmntent... (cached) yes
checking for getmntent... (cached) yes
checking for setmntent... yes
checking for endmntent... yes
checking for waitpid... yes
checking for strspn... yes
checking for forcefindlib... no
checking whether off_t can be used in a switch statement... (cached) yes
checking for working re_compile_pattern... (cached) yes
checking for sort... /usr/bin/sort
checking if /usr/bin/sort supports the -z option... yes
checking for struct dirent.d_type... (cached) yes
checking whether NLS is requested... yes
checking for msgfmt... /usr/bin/msgfmt
checking for gmsgfmt... /usr/bin/gmsgfmt
checking for xgettext... /usr/bin/xgettext
checking for msgmerge... /usr/bin/msgmerge
checking for ld used by GCC... /usr/i686-pc-linux-gnu/bin/ld
checking if the linker (/usr/i686-pc-linux-gnu/bin/ld) is GNU ld... yes
checking for shared library run path origin... done
checking for CFPreferencesCopyAppValue... no
checking for CFLocaleCopyCurrent... no
checking whether NLS is requested... yes
checking for GNU gettext in libc... yes
checking whether to use NLS... yes
checking where the gettext function comes from... libc
configure: creating ./config.status
config.status: creating gnulib/Makefile
config.status: creating gnulib/lib/Makefile
config.status: creating m4/Makefile
config.status: creating Makefile
config.status: creating find/Makefile
config.status: creating find/testsuite/Makefile
config.status: creating xargs/Makefile
config.status: creating xargs/testsuite/Makefile
config.status: creating locate/Makefile
config.status: creating locate/testsuite/Makefile
config.status: creating po/Makefile.in
config.status: creating po/Makefile
config.status: creating doc/Makefile
config.status: creating lib/Makefile
config.status: creating config.h
config.status: executing depfiles commands
config.status: executing default-1 commands
config.status: creating po/POTFILES
config.status: creating po/Makefile
make -j2 libexecdir=/usr/lib/find AR=i686-pc-linux-gnu-ar
make all-recursive
make[1]: Entering directory `/var/tmp/paludis/sys-apps/findutils-4.3.0/work/findutils-4.3.0'
Making all in gnulib
make[2]: Entering directory `/var/tmp/paludis/sys-apps/findutils-4.3.0/work/findutils-4.3.0/gnulib'
Making all in lib
make[3]: Entering directory `/var/tmp/paludis/sys-apps/findutils-4.3.0/work/findutils-4.3.0/gnulib/lib'
cp ./alloca_.h alloca.h-t
mv alloca.h-t alloca.h
make all-am
make[4]: Entering directory `/var/tmp/paludis/sys-apps/findutils-4.3.0/work/findutils-4.3.0/gnulib/lib'
i686-pc-linux-gnu-gcc -DHAVE_CONFIG_H -I. -I. -I../.. -O2 -march=i686 -fomit-frame-pointer -c argmatch.c
i686-pc-linux-gnu-gcc -DHAVE_CONFIG_H -I. -I. -I../.. -O2 -march=i686 -fomit-frame-pointer -c cycle-check.c
i686-pc-linux-gnu-gcc -DHAVE_CONFIG_H -I. -I. -I../.. -O2 -march=i686 -fomit-frame-pointer -c basename.c
i686-pc-linux-gnu-gcc -DHAVE_CONFIG_H -I. -I. -I../.. -O2 -march=i686 -fomit-frame-pointer -c stripslash.c
i686-pc-linux-gnu-gcc -DHAVE_CONFIG_H -I. -I. -I../.. -O2 -march=i686 -fomit-frame-pointer -c strnlen1.c
i686-pc-linux-gnu-gcc -DHAVE_CONFIG_H -I. -I. -I../.. -O2 -march=i686 -fomit-frame-pointer -c xalloc-die.c
i686-pc-linux-gnu-gcc -DHAVE_CONFIG_H -I. -I. -I../.. -O2 -march=i686 -fomit-frame-pointer -c xstrtoumax.c
i686-pc-linux-gnu-gcc -DHAVE_CONFIG_H -I. -I. -I../.. -O2 -march=i686 -fomit-frame-pointer -c save-cwd.c
i686-pc-linux-gnu-gcc -DHAVE_CONFIG_H -I. -I. -I../.. -O2 -march=i686 -fomit-frame-pointer -c fts.c
i686-pc-linux-gnu-gcc -DHAVE_CONFIG_H -I. -I. -I../.. -O2 -march=i686 -fomit-frame-pointer -c strftime.c
i686-pc-linux-gnu-gcc -DHAVE_CONFIG_H -I. -I. -I../.. -O2 -march=i686 -fomit-frame-pointer -c canonicalize.c
i686-pc-linux-gnu-gcc -DHAVE_CONFIG_H -I. -I. -I../.. -O2 -march=i686 -fomit-frame-pointer -c chdir-long.c
i686-pc-linux-gnu-gcc -DHAVE_CONFIG_H -I. -I. -I../.. -O2 -march=i686 -fomit-frame-pointer -c openat-die.c
i686-pc-linux-gnu-gcc -DHAVE_CONFIG_H -I. -I. -I../.. -O2 -march=i686 -fomit-frame-pointer -c closeout.c
i686-pc-linux-gnu-gcc -DHAVE_CONFIG_H -I. -I. -I../.. -O2 -march=i686 -fomit-frame-pointer -c dirname.c
i686-pc-linux-gnu-gcc -DHAVE_CONFIG_H -I. -I. -I../.. -O2 -march=i686 -fomit-frame-pointer -c exitfail.c
i686-pc-linux-gnu-gcc -DHAVE_CONFIG_H -I. -I. -I../.. -O2 -march=i686 -fomit-frame-pointer -c open-safer.c
i686-pc-linux-gnu-gcc -DHAVE_CONFIG_H -I. -I. -I../.. -O2 -march=i686 -fomit-frame-pointer -c creat-safer.c
i686-pc-linux-gnu-gcc -DHAVE_CONFIG_H -I. -I. -I../.. -O2 -march=i686 -fomit-frame-pointer -c filemode.c
i686-pc-linux-gnu-gcc -DHAVE_CONFIG_H -I. -I. -I../.. -O2 -march=i686 -fomit-frame-pointer -c filenamecat.c
i686-pc-linux-gnu-gcc -DHAVE_CONFIG_H -I. -I. -I../.. -O2 -march=i686 -fomit-frame-pointer -c getcwd.c
i686-pc-linux-gnu-gcc -DHAVE_CONFIG_H -I. -I. -I../.. -O2 -march=i686 -fomit-frame-pointer -c hash.c
i686-pc-linux-gnu-gcc -DHAVE_CONFIG_H -I. -I. -I../.. -O2 -march=i686 -fomit-frame-pointer -c human.c
i686-pc-linux-gnu-gcc -DHAVE_CONFIG_H -I. -I. -I../.. -O2 -march=i686 -fomit-frame-pointer -c idcache.c
i686-pc-linux-gnu-gcc -DHAVE_CONFIG_H -I. -I. -I../.. -O2 -march=i686 -fomit-frame-pointer -c mbchar.c
i686-pc-linux-gnu-gcc -DHAVE_CONFIG_H -I. -I. -I../.. -O2 -march=i686 -fomit-frame-pointer -c modechange.c
i686-pc-linux-gnu-gcc -DHAVE_CONFIG_H -I. -I. -I../.. -O2 -march=i686 -fomit-frame-pointer -c mountlist.c
i686-pc-linux-gnu-gcc -DHAVE_CONFIG_H -I. -I. -I../.. -O2 -march=i686 -fomit-frame-pointer -c quote.c
i686-pc-linux-gnu-gcc -DHAVE_CONFIG_H -I. -I. -I../.. -O2 -march=i686 -fomit-frame-pointer -c quotearg.c
i686-pc-linux-gnu-gcc -DHAVE_CONFIG_H -I. -I. -I../.. -O2 -march=i686 -fomit-frame-pointer -c regex.c
In file included from regex.c:55:
regex_internal.h:128: error: expected '=', ',', ';', 'asm' or '__attribute__' before 'Idx'
regex_internal.h:151: error: expected '=', ',', ';', 'asm' or '__attribute__' before 're_hashval_t'
regex_internal.h:223: error: expected specifier-qualifier-list before 'Idx'
regex_internal.h:311: error: expected specifier-qualifier-list before 'Idx'
regex_internal.h:336: error: expected specifier-qualifier-list before 'Idx'
regex_internal.h:370: error: expected specifier-qualifier-list before 'Idx'
regex_internal.h:428: error: expected declaration specifiers or '...' before 'Idx'
regex_internal.h:438: error: expected declaration specifiers or '...' before 'Idx'
regex_internal.h:550: error: expected specifier-qualifier-list before 'Idx'
regex_internal.h:594: error: expected specifier-qualifier-list before 're_hashval_t'
regex_internal.h:614: error: expected specifier-qualifier-list before 'Idx'
regex_internal.h:623: error: expected specifier-qualifier-list before 'Idx'
regex_internal.h:632: error: expected specifier-qualifier-list before 'Idx'
regex_internal.h:643: error: expected specifier-qualifier-list before 'Idx'
regex_internal.h:653: error: expected specifier-qualifier-list before 'Idx'
regex_internal.h:674: error: expected specifier-qualifier-list before 'Idx'
regex_internal.h:693: error: expected specifier-qualifier-list before 'Idx'
regex_internal.h:700: error: expected specifier-qualifier-list before 'Idx'
regex_internal.h:708: error: expected specifier-qualifier-list before 'Idx'
regex_internal.h:716: error: expected specifier-qualifier-list before 'Idx'
regex_internal.h:793: error: expected declaration specifiers or '...' before 'Idx'
regex_internal.h: In function 'bitset_set':
regex_internal.h:795: error: 'i' undeclared (first use in this function)
regex_internal.h:795: error: (Each undeclared identifier is reported only once
regex_internal.h:795: error: for each function it appears in.)
regex_internal.h: At top level:
regex_internal.h:799: error: expected declaration specifiers or '...' before 'Idx'
regex_internal.h: In function 'bitset_clear':
regex_internal.h:801: error: 'i' undeclared (first use in this function)
regex_internal.h: At top level:
regex_internal.h:805: error: expected declaration specifiers or '...' before 'Idx'
regex_internal.h: In function 'bitset_contain':
regex_internal.h:807: error: 'i' undeclared (first use in this function)
regex_internal.h: At top level:
regex_internal.h:863: error: expected declaration specifiers or '...' before 'Idx'
regex_internal.h: In function 're_string_char_size_at':
regex_internal.h:866: error: 're_string_t' has no member named 'mb_cur_max'
regex_internal.h:868: error: 'idx' undeclared (first use in this function)
regex_internal.h:868: error: 're_string_t' has no member named 'valid_len'
regex_internal.h: At top level:
regex_internal.h:876: error: expected declaration specifiers or '...' before 'Idx'
regex_internal.h: In function 're_string_wchar_at':
regex_internal.h:878: error: 're_string_t' has no member named 'mb_cur_max'
regex_internal.h:879: error: 'idx' undeclared (first use in this function)
regex_internal.h: At top level:
regex_internal.h:885: error: expected declaration specifiers or '...' before 'Idx'
In file included from regex.c:57:
regex_internal.c:20: error: expected declaration specifiers or '...' before 'Idx'
regex_internal.c:22: error: expected declaration specifiers or '...' before 'REG_TRANSLATE_TYPE'
regex_internal.c:26: error: expected declaration specifiers or '...' before 're_hashval_t'
regex_internal.c:30: error: expected declaration specifiers or '...' before 're_hashval_t'
regex_internal.c:39: error: expected declaration specifiers or '...' before 'Idx'
regex_internal.c:39: error: expected declaration specifiers or '...' before 'Idx'
regex_internal.c:40: error: expected declaration specifiers or '...' before 'REG_TRANSLATE_TYPE'
regex_internal.c: In function 're_string_allocate':
regex_internal.c:43: error: 'Idx' undeclared (first use in this function)
regex_internal.c:43: error: expected ';' before 'init_buf_len'
regex_internal.c:46: error: 'init_len' undeclared (first use in this function)
regex_internal.c:46: error: 're_dfa_t' has no member named 'mb_cur_max'
regex_internal.c:47: error: 're_dfa_t' has no member named 'mb_cur_max'
regex_internal.c:48: error: 'init_buf_len' undeclared (first use in this function)
regex_internal.c:48: error: 'len' undeclared (first use in this function)
regex_internal.c:49: error: 'trans' undeclared (first use in this function)
regex_internal.c:49: error: too many arguments to function 're_string_construct_common'
regex_internal.c:51: error: too many arguments to function 're_string_realloc_buffers'
regex_internal.c:55: error: 're_string_t' has no member named 'word_char'
regex_internal.c:55: error: 're_dfa_t' has no member named 'word_char'
regex_internal.c:56: error: 're_string_t' has no member named 'word_ops_used'
regex_internal.c:56: error: 're_dfa_t' has no member named 'word_ops_used'
regex_internal.c:57: error: 're_string_t' has no member named 'mbs_allocated'
regex_internal.c:58: error: 're_string_t' has no member named 'valid_len'
regex_internal.c:58: error: 're_string_t' has no member named 'mbs_allocated'
regex_internal.c:58: error: 're_dfa_t' has no member named 'mb_cur_max'
regex_internal.c:59: error: 're_string_t' has no member named 'valid_raw_len'
regex_internal.c:59: error: 're_string_t' has no member named 'valid_len'
regex_internal.c: At top level:
regex_internal.c:67: error: expected declaration specifiers or '...' before 'Idx'
regex_internal.c:68: error: expected declaration specifiers or '...' before 'REG_TRANSLATE_TYPE'
regex_internal.c: In function 're_string_construct':
regex_internal.c:72: error: 'len' undeclared (first use in this function)
regex_internal.c:72: error: 'trans' undeclared (first use in this function)
regex_internal.c:72: error: too many arguments to function 're_string_construct_common'
regex_internal.c:76: error: too many arguments to function 're_string_realloc_buffers'
regex_internal.c:80: error: 're_string_t' has no member named 'mbs_allocated'
regex_internal.c:85: error: 're_dfa_t' has no member named 'mb_cur_max'
regex_internal.c:92: error: 're_string_t' has no member named 'valid_raw_len'
regex_internal.c:94: error: 're_string_t' has no member named 'bufs_len'
regex_internal.c:94: error: 're_string_t' has no member named 'valid_len'
regex_internal.c:94: error: 're_dfa_t' has no member named 'mb_cur_max'
regex_internal.c:96: error: 're_string_t' has no member named 'bufs_len'
regex_internal.c:96: error: too many arguments to function 're_string_realloc_buffers'
regex_internal.c:108: error: 're_dfa_t' has no member named 'mb_cur_max'
regex_internal.c:117: error: 're_string_t' has no member named 'valid_len'
regex_internal.c:117: error: 're_string_t' has no member named 'bufs_len'
regex_internal.c:118: error: 're_string_t' has no member named 'valid_raw_len'
regex_internal.c:118: error: 're_string_t' has no member named 'bufs_len'
regex_internal.c: At top level:
regex_internal.c:130: error: expected declaration specifiers or '...' before 'Idx'
regex_internal.c: In function 're_string_realloc_buffers':
regex_internal.c:133: error: 're_string_t' has no member named 'mb_cur_max'
regex_internal.c:135: error: 'new_buf_len' undeclared (first use in this function)
regex_internal.c:139: error: 're_string_t' has no member named 'offsets'
regex_internal.c:141: error: 'Idx' undeclared (first use in this function)
regex_internal.c:141: error: 'new_offsets' undeclared (first use in this function)
regex_internal.c:141: error: expected expression before ')' token
regex_internal.c:144: error: 're_string_t' has no member named 'offsets'
regex_internal.c:148: error: 're_string_t' has no member named 'mbs_allocated'
regex_internal.c:156: error: 're_string_t' has no member named 'bufs_len'
regex_internal.c: At top level:
regex_internal.c:163: error: expected declaration specifiers or '...' before 'Idx'
regex_internal.c:164: error: expected declaration specifiers or '...' before 'REG_TRANSLATE_TYPE'
regex_internal.c: In function 're_string_construct_common':
regex_internal.c:168: error: 're_string_t' has no member named 'len'
regex_internal.c:168: error: 'len' undeclared (first use in this function)
regex_internal.c:169: error: 're_string_t' has no member named 'raw_len'
regex_internal.c:170: error: 're_string_t' has no member named 'trans'
regex_internal.c:170: error: expected ')' before 'REG_TRANSLATE_TYPE'
regex_internal.c:170: error: 'trans' undeclared (first use in this function)
regex_internal.c:171: error: 're_string_t' has no member named 'icase'
regex_internal.c:172: error: 're_string_t' has no member named 'mbs_allocated'
regex_internal.c:173: error: 're_string_t' has no member named 'mb_cur_max'
regex_internal.c:173: error: 're_dfa_t' has no member named 'mb_cur_max'
regex_internal.c:174: error: 're_string_t' has no member named 'is_utf8'
regex_internal.c:174: error: 're_dfa_t' has no member named 'is_utf8'
regex_internal.c:175: error: 're_string_t' has no member named 'map_notascii'
regex_internal.c:175: error: 're_dfa_t' has no member named 'map_notascii'
regex_internal.c:176: error: 're_string_t' has no member named 'stop'
regex_internal.c:176: error: 're_string_t' has no member named 'len'
regex_internal.c:177: error: 're_string_t' has no member named 'raw_stop'
regex_internal.c:177: error: 're_string_t' has no member named 'stop'
regex_internal.c: In function 'build_wcs_buffer':
regex_internal.c:204: error: 'Idx' undeclared (first use in this function)
regex_internal.c:204: error: expected ';' before 'byte_idx'
regex_internal.c:209: error: 'end_idx' undeclared (first use in this function)
regex_internal.c:209: error: 're_string_t' has no member named 'bufs_len'
regex_internal.c:209: error: 're_string_t' has no member named 'len'
regex_internal.c:209: error: 're_string_t' has no member named 'len'
regex_internal.c:209: error: 're_string_t' has no member named 'bufs_len'
regex_internal.c:210: error: 'byte_idx' undeclared (first use in this function)
regex_internal.c:210: error: 're_string_t' has no member named 'valid_len'
regex_internal.c:215: error: 'remain_len' undeclared (first use in this function)
regex_internal.c:216: error: 're_string_t' has no member named 'cur_state'
regex_internal.c:218: error: 're_string_t' has no member named 'trans'
regex_internal.c:222: error: 're_string_t' has no member named 'mb_cur_max'
regex_internal.c:224: error: 're_string_t' has no member named 'raw_mbs_idx'
regex_internal.c:225: error: 're_string_t' has no member named 'trans'
regex_internal.c:230: error: 're_string_t' has no member named 'raw_mbs_idx'
regex_internal.c:231: error: 're_string_t' has no member named 'cur_state'
regex_internal.c:235: error: 're_string_t' has no member named 'cur_state'
regex_internal.c:242: error: 're_string_t' has no member named 'raw_mbs_idx'
regex_internal.c:243: error: 're_string_t' has no member named 'trans'
regex_internal.c:244: error: 're_string_t' has no member named 'trans'
regex_internal.c:245: error: 're_string_t' has no member named 'cur_state'
regex_internal.c:254: error: 're_string_t' has no member named 'valid_len'
regex_internal.c:255: error: 're_string_t' has no member named 'valid_raw_len'
regex_internal.c: In function 'build_wcs_upper_buffer':
regex_internal.c:266: error: 'Idx' undeclared (first use in this function)
regex_internal.c:266: error: expected ';' before 'src_idx'
regex_internal.c:275: error: 'byte_idx' undeclared (first use in this function)
regex_internal.c:275: error: 're_string_t' has no member named 'valid_len'
regex_internal.c:276: error: 'end_idx' undeclared (first use in this function)
regex_internal.c:276: error: 're_string_t' has no member named 'bufs_len'
regex_internal.c:276: error: 're_string_t' has no member named 'len'
regex_internal.c:276: error: 're_string_t' has no member named 'len'
regex_internal.c:276: error: 're_string_t' has no member named 'bufs_len'
regex_internal.c:280: error: 're_string_t' has no member named 'map_notascii'
regex_internal.c:280: error: 're_string_t' has no member named 'trans'
regex_internal.c:280: error: 're_string_t' has no member named 'offsets_needed'
regex_internal.c:286: error: 're_string_t' has no member named 'raw_mbs_idx'
regex_internal.c:287: error: 're_string_t' has no member named 'cur_state'
regex_internal.c:291: error: 're_string_t' has no member named 'raw_mbs_idx'
regex_internal.c:291: error: 're_string_t' has no member named 'raw_mbs_idx'
regex_internal.c:291: error: 're_string_t' has no member named 'raw_mbs_idx'
regex_internal.c:291: error: 're_string_t' has no member named 'raw_mbs_idx'
regex_internal.c:291: error: 're_string_t' has no member named 'raw_mbs_idx'
regex_internal.c:299: error: 'remain_len' undeclared (first use in this function)
regex_internal.c:300: error: 're_string_t' has no member named 'cur_state'
regex_internal.c:302: error: 're_string_t' has no member named 'raw_mbs_idx'
regex_internal.c:303: error: 're_string_t' has no member named 'cur_state'
regex_internal.c:317: error: 'src_idx' undeclared (first use in this function)
regex_internal.c:323: error: 're_string_t' has no member named 'raw_mbs_idx'
regex_internal.c:332: error: 're_string_t' has no member named 'raw_mbs_idx'
regex_internal.c:337: error: 're_string_t' has no member named 'cur_state'
regex_internal.c:342: error: 're_string_t' has no member named 'cur_state'
regex_internal.c:346: error: 're_string_t' has no member named 'valid_len'
regex_internal.c:347: error: 're_string_t' has no member named 'valid_raw_len'
regex_internal.c:351: error: 're_string_t' has no member named 'valid_raw_len'
regex_internal.c:357: error: 're_string_t' has no member named 'cur_state'
regex_internal.c:358: error: 're_string_t' has no member named 'trans'
regex_internal.c:362: error: 're_string_t' has no member named 'mb_cur_max'
regex_internal.c:364: error: 're_string_t' has no member named 'raw_mbs_idx'
regex_internal.c:365: error: 're_string_t' has no member named 'trans'
regex_internal.c:370: error: 're_string_t' has no member named 'raw_mbs_idx'
regex_internal.c:371: error: 're_string_t' has no member named 'cur_state'
regex_internal.c:387: error: 're_string_t' has no member named 'bufs_len'
regex_internal.c:389: error: 're_string_t' has no member named 'cur_state'
regex_internal.c:393: error: 're_string_t' has no member named 'offsets'
regex_internal.c:395: error: 're_string_t' has no member named 'offsets'
regex_internal.c:395: error: expected expression before ')' token
regex_internal.c:397: error: 're_string_t' has no member named 'offsets'
regex_internal.c:400: error: 're_string_t' has no member named 'offsets_needed'
regex_internal.c:403: error: 're_string_t' has no member named 'offsets'
regex_internal.c:404: error: 're_string_t' has no member named 'offsets_needed'
regex_internal.c:409: error: 're_string_t' has no member named 'offsets'
regex_internal.c:412: error: 're_string_t' has no member named 'offsets'
regex_internal.c:416: error: 're_string_t' has no member named 'len'
regex_internal.c:417: error: 're_string_t' has no member named 'raw_stop'
regex_internal.c:418: error: 're_string_t' has no member named 'stop'
regex_internal.c:419: error: 're_string_t' has no member named 'bufs_len'
regex_internal.c:419: error: 're_string_t' has no member named 'len'
regex_internal.c:420: error: 're_string_t' has no member named 'len'
regex_internal.c:420: error: 're_string_t' has no member named 'bufs_len'
regex_internal.c:431: error: 're_string_t' has no member named 'offsets_needed'
regex_internal.c:435: error: 're_string_t' has no member named 'offsets'
regex_internal.c:447: error: 're_string_t' has no member named 'raw_mbs_idx'
regex_internal.c:449: error: 're_string_t' has no member named 'trans'
regex_internal.c:450: error: 're_string_t' has no member named 'trans'i686-pc-linux-gnu-gcc -DHAVE_CONFIG_H -I. -I. -I../.. -O2 -march=i686 -fomit-frame-pointer -c savedir.c
regex_internal.c:453: error: 're_string_t' has no member named 'offsets_needed'
regex_internal.c:454: error: 're_string_t' has no member named 'offsets'
regex_internal.c:460: error: 're_string_t' has no member named 'cur_state'
regex_internal.c:465: error: 're_string_t' has no member named 'cur_state'
regex_internal.c:469: error: 're_string_t' has no member named 'valid_len'
regex_internal.c:470: error: 're_string_t' has no member named 'valid_raw_len'
regex_internal.c: At top level:
regex_internal.c:479: warning: 'regparm' attribute only applies to function types
regex_internal.c:479: warning: 'stdcall' attribute only applies to function types
regex_internal.c:479: error: expected ',' or ';' before 're_string_skip_chars'
regex_internal.c: In function 'build_upper_buffer':
regex_internal.c:516: error: expected ';' before 'char_idx'
regex_internal.c:517: error: 'end_idx' undeclared (first use in this function)
regex_internal.c:517: error: 're_string_t' has no member named 'bufs_len'
regex_internal.c:517: error: 're_string_t' has no member named 'len'
regex_internal.c:517: error: 're_string_t' has no member named 'len'
regex_internal.c:517: error: 're_string_t' has no member named 'bufs_len'
regex_internal.c:519: error: 'char_idx' undeclared (first use in this function)
regex_internal.c:519: error: 're_string_t' has no member named 'valid_len'
regex_internal.c:521: error: 're_string_t' has no member named 'raw_mbs_idx'
regex_internal.c:522: error: 're_string_t' has no member named 'trans'
regex_internal.c:523: error: 're_string_t' has no member named 'trans'
regex_internal.c:529: error: 're_string_t' has no member named 'valid_len'
regex_internal.c:530: error: 're_string_t' has no member named 'valid_raw_len'
regex_internal.c: In function 're_string_translate_buffer':
regex_internal.c:539: error: expected ';' before 'buf_idx'
regex_internal.c:540: error: 'end_idx' undeclared (first use in this function)
regex_internal.c:540: error: 're_string_t' has no member named 'bufs_len'
regex_internal.c:540: error: 're_string_t' has no member named 'len'
regex_internal.c:540: error: 're_string_t' has no member named 'len'
regex_internal.c:540: error: 're_string_t' has no member named 'bufs_len'
regex_internal.c:542: error: 'buf_idx' undeclared (first use in this function)
regex_internal.c:542: error: 're_string_t' has no member named 'valid_len'
regex_internal.c:544: error: 're_string_t' has no member named 'raw_mbs_idx'
regex_internal.c:545: error: 're_string_t' has no member named 'trans'
regex_internal.c:548: error: 're_string_t' has no member named 'valid_len'
regex_internal.c:549: error: 're_string_t' has no member named 'valid_raw_len'
regex_internal.c: At top level:
regex_internal.c:558: error: expected declaration specifiers or '...' before 'Idx'
regex_internal.c: In function 're_string_reconstruct':
regex_internal.c:560: error: expected ';' before 'offset'
regex_internal.c:562: error: 're_string_t' has no member named 'raw_mbs_idx'
regex_internal.c:562: error: 'idx' undeclared (first use in this function)
regex_internal.c:563: error: 'offset' undeclared (first use in this function)
regex_internal.c:563: error: 're_string_t' has no member named 'raw_mbs_idx'
regex_internal.c:568: error: 're_string_t' has no member named 'mb_cur_max'
regex_internal.c:569: error: 're_string_t' has no member named 'cur_state'
regex_internal.c:571: error: 're_string_t' has no member named 'len'
regex_internal.c:571: error: 're_string_t' has no member named 'raw_len'
regex_internal.c:572: error: 're_string_t' has no member named 'stop'
regex_internal.c:572: error: 're_string_t' has no member named 'raw_stop'
regex_internal.c:573: error: 're_string_t' has no member named 'valid_len'
regex_internal.c:574: error: 're_string_t' has no member named 'raw_mbs_idx'
regex_internal.c:575: error: 're_string_t' has no member named 'valid_raw_len'
regex_internal.c:576: error: 're_string_t' has no member named 'offsets_needed'
regex_internal.c:577: error: 're_string_t' has no member named 'tip_context'
regex_internal.c:579: error: 're_string_t' has no member named 'mbs_allocated'
regex_internal.c:587: error: 're_string_t' has no member named 'valid_raw_len'
regex_internal.c:591: error: 're_string_t' has no member named 'offsets_needed'
regex_internal.c:596: error: 're_string_t' has no member named 'tip_context'
regex_internal.c:596: error: too many arguments to function 're_string_context_at'
regex_internal.c:598: error: 're_string_t' has no member named 'mb_cur_max'
regex_internal.c:600: error: 're_string_t' has no member named 'valid_len'
regex_internal.c:602: error: 're_string_t' has no member named 'mbs_allocated'
regex_internal.c:604: error: 're_string_t' has no member named 'valid_len'
regex_internal.c:605: error: 're_string_t' has no member named 'valid_len'
regex_internal.c:606: error: 're_string_t' has no member named 'valid_raw_len'
regex_internal.c:615: error: 're_string_t' has no member named 'offsets_needed'
regex_internal.c:617: error: 're_string_t' has no member named 'len'
regex_internal.c:617: error: 're_string_t' has no member named 'raw_len'
regex_internal.c:618: error: 're_string_t' has no member named 'stop'
regex_internal.c:618: error: 're_string_t' has no member named 'raw_stop'
regex_internal.c:619: error: 're_string_t' has no member named 'offsets_needed'
regex_internal.c:622: error: 're_string_t' has no member named 'valid_len'
regex_internal.c:623: error: 're_string_t' has no member named 'valid_raw_len'
regex_internal.c:625: error: 're_string_t' has no member named 'mb_cur_max'
regex_internal.c:627: error: expected ';' before 'wcs_idx'
regex_internal.c:630: error: 're_string_t' has no member named 'is_utf8'
regex_internal.c:636: error: 're_string_t' has no member named 'raw_mbs_idx'
regex_internal.c:637: error: 're_string_t' has no member named 'mb_cur_max'
regex_internal.c:643: error: expected ';' before 'mlen'
regex_internal.c:648: error: 're_string_t' has no member named 'trans'
regex_internal.c:650: error: 'mlen' undeclared (first use in this function)
regex_internal.c:652: error: 're_string_t' has no member named 'trans'
regex_internal.c:662: error: 're_string_t' has no member named 'cur_state'
regex_internal.c:664: error: 're_string_t' has no member named 'valid_len'
regex_internal.c:672: error: 're_string_t' has no member named 'valid_len'
regex_internal.c:673: error: 're_string_t' has no member named 'valid_len'
regex_internal.c:675: error: 'wcs_idx' undeclared (first use in this function)
regex_internal.c:675: error: 're_string_t' has no member named 'valid_len'
regex_internal.c:677: error: 're_string_t' has no member named 'mbs_allocated'
regex_internal.c:678: error: 're_string_t' has no member named 'valid_len'
regex_internal.c:680: error: 're_string_t' has no member named 'valid_raw_len'
regex_internal.c:680: error: 're_string_t' has no member named 'valid_len'
regex_internal.c:681: error: 're_string_t' has no member named 'tip_context'
regex_internal.c:681: error: 're_string_t' has no member named 'word_ops_used'
regex_internal.c:685: error: 're_string_t' has no member named 'newline_anchor'
regex_internal.c:691: error: 're_string_t' has no member named 'raw_mbs_idx'
regex_internal.c:692: error: 're_string_t' has no member named 'trans'
regex_internal.c:693: error: 're_string_t' has no member named 'trans'
regex_internal.c:694: error: 're_string_t' has no member named 'tip_context'
regex_internal.c:694: error: 're_string_t' has no member named 'word_char'
regex_internal.c:694: error: too many arguments to function 'bitset_contain'
regex_internal.c:696: error: 're_string_t' has no member named 'newline_anchor'
regex_internal.c:700: error: 're_string_t' has no member named 'mbs_allocated'
regex_internal.c:703: error: 're_string_t' has no member named 'raw_mbs_idx'
regex_internal.c:704: error: 're_string_t' has no member named 'len'
regex_internal.c:705: error: 're_string_t' has no member named 'stop'
regex_internal.c:709: error: 're_string_t' has no member named 'mb_cur_max'
regex_internal.c:711: error: 're_string_t' has no member named 'icase'
regex_internal.c:722: error: 're_string_t' has no member named 'mbs_allocated'i686-pc-linux-gnu-gcc -DHAVE_CONFIG_H -I. -I. -I../.. -O2 -march=i686 -fomit-frame-pointer -c fopen-safer.c
regex_internal.c:724: error: 're_string_t' has no member named 'icase'
regex_internal.c:726: error: 're_string_t' has no member named 'trans'
regex_internal.c:730: error: 're_string_t' has no member named 'valid_len'
regex_internal.c:730: error: 're_string_t' has no member named 'len'
regex_internal.c:732: error: 're_string_t' has no member named 'cur_idx'
regex_internal.c: At top level:
regex_internal.c:738: error: expected declaration specifiers or '...' before 'Idx'
regex_internal.c: In function 're_string_peek_byte_case':
regex_internal.c:741: error: expected ';' before 'off'
regex_internal.c:744: error: 're_string_t' has no member named 'mbs_allocated'
regex_internal.c:745: error: 're_string_t' has no member named 'cur_idx'
regex_internal.c:745: error: 'idx' undeclared (first use in this function)
regex_internal.c:748: error: 're_string_t' has no member named 'mb_cur_max'
regex_internal.c:749: error: 're_string_t' has no member named 'cur_idx'
regex_internal.c:749: error: 're_string_t' has no member named 'valid_len'
regex_internal.c:749: error: 're_string_t' has no member named 'cur_idx'
regex_internal.c:749: error: 're_string_t' has no member named 'cur_idx'
regex_internal.c:750: error: 're_string_t' has no member named 'cur_idx'
regex_internal.c:753: error: 'off' undeclared (first use in this function)
regex_internal.c:753: error: 're_string_t' has no member named 'cur_idx'
regex_internal.c:755: error: 're_string_t' has no member named 'offsets_needed'
regex_internal.c:756: error: 're_string_t' has no member named 'offsets'
regex_internal.c:759: error: 're_string_t' has no member named 'raw_mbs_idx'
regex_internal.c:766: error: 're_string_t' has no member named 'offsets_needed'
regex_internal.c:767: error: 're_string_t' has no member named 'cur_idx'
regex_internal.c: In function 're_string_fetch_byte_case':
regex_internal.c:777: error: 're_string_t' has no member named 'mbs_allocated'
regex_internal.c:778: error: 're_string_t' has no member named 'cur_idx'
regex_internal.c:781: error: 're_string_t' has no member named 'offsets_needed'
regex_internal.c:783: error: expected ';' before 'off'
regex_internal.c:793: error: 're_string_t' has no member named 'cur_idx'
regex_internal.c:793: error: 're_string_t' has no member named 'valid_len'
regex_internal.c:793: error: 're_string_t' has no member named 'cur_idx'
regex_internal.c:794: error: 're_string_t' has no member named 'cur_idx'
regex_internal.c:796: error: 'off' undeclared (first use in this function)
regex_internal.c:796: error: 're_string_t' has no member named 'offsets'
regex_internal.c:796: error: 're_string_t' has no member named 'cur_idx'
regex_internal.c:797: error: 're_string_t' has no member named 'raw_mbs_idx'
regex_internal.c:800: error: 're_string_t' has no member named 'cur_idx'
regex_internal.c:802: error: 're_string_t' has no member named 'cur_idx'
regex_internal.c:802: error: 're_string_t' has no member named 'cur_idx'
regex_internal.c:802: error: too many arguments to function 're_string_char_size_at'
regex_internal.c:808: error: 're_string_t' has no member named 'raw_mbs_idx'
regex_internal.c:808: error: 're_string_t' has no member named 'cur_idx'
regex_internal.c: In function 're_string_destruct':
regex_internal.c:817: error: 're_string_t' has no member named 'offsets'
regex_internal.c:819: error: 're_string_t' has no member named 'mbs_allocated'
regex_internal.c: At top level:
regex_internal.c:827: error: expected declaration specifiers or '...' before 'Idx'
regex_internal.c: In function 're_string_context_at':
regex_internal.c:830: error: 'idx' undeclared (first use in this function)
regex_internal.c:830: error: called object 'Idx' is not a function
regex_internal.c:833: error: 're_string_t' has no member named 'tip_context'
regex_internal.c:834: error: 're_string_t' has no member named 'len'
regex_internal.c:838: error: 're_string_t' has no member named 'mb_cur_max'
regex_internal.c:841: error: expected ';' before 'wc_idx'
regex_internal.c:842: error: 'wc_idx' undeclared (first use in this function)
regex_internal.c:849: error: called object 'Idx' is not a function
regex_internal.c:850: error: 're_string_t' has no member named 'tip_context'
regex_internal.c:853: error: 're_string_t' has no member named 'word_ops_used'
regex_internal.c:855: error: 're_string_t' has no member named 'newline_anchor'
regex_internal.c:862: error: 're_string_t' has no member named 'word_char'
regex_internal.c:862: error: too many arguments to function 'bitset_contain'
regex_internal.c:864: error: 're_string_t' has no member named 'newline_anchor'
regex_internal.c: At top level:
regex_internal.c:872: error: expected declaration specifiers or '...' before 'Idx'
regex_internal.c: In function 're_node_set_alloc':
regex_internal.c:874: error: 're_node_set' has no member named 'alloc'
regex_internal.c:874: error: 'size' undeclared (first use in this function)
regex_internal.c:875: error: 're_node_set' has no member named 'nelem'
regex_internal.c:876: error: 're_node_set' has no member named 'elems'
regex_internal.c:876: error: expected expression before ')' token
regex_internal.c:877: error: 're_node_set' has no member named 'elems'
regex_internal.c: At top level:
regex_internal.c:884: error: expected declaration specifiers or '...' before 'Idx'
regex_internal.c: In function 're_node_set_init_1':
regex_internal.c:886: error: 're_node_set' has no member named 'alloc'
regex_internal.c:887: error: 're_node_set' has no member named 'nelem'
regex_internal.c:888: error: 're_node_set' has no member named 'elems'
regex_internal.c:888: error: expected expression before ')' token
regex_internal.c:889: error: 're_node_set' has no member named 'elems'
regex_internal.c:891: error: 're_node_set' has no member named 'alloc'
regex_internal.c:891: error: 're_node_set' has no member named 'nelem'
regex_internal.c:894: error: 're_node_set' has no member named 'elems'
regex_internal.c:894: error: 'elem' undeclared (first use in this function)
regex_internal.c: At top level:
regex_internal.c:900: error: expected declaration specifiers or '...' before 'Idx'
regex_internal.c:900: error: expected declaration specifiers or '...' before 'Idx'
regex_internal.c: In function 're_node_set_init_2':
regex_internal.c:902: error: 're_node_set' has no member named 'alloc'
regex_internal.c:903: error: 're_node_set' has no member named 'elems'
regex_internal.c:903: error: expected expression before ')' token
regex_internal.c:904: error: 're_node_set' has no member named 'elems'
regex_internal.c:906: error: 'elem1' undeclared (first use in this function)
regex_internal.c:906: error: 'elem2' undeclared (first use in this function)
regex_internal.c:908: error: 're_node_set' has no member named 'nelem'
regex_internal.c:909: error: 're_node_set' has no member named 'elems'
regex_internal.c:913: error: 're_node_set' has no member named 'nelem'
regex_internal.c:916: error: 're_node_set' has no member named 'elems'
regex_internal.c:917: error: 're_node_set' has no member named 'elems'
regex_internal.c:921: error: 're_node_set' has no member named 'elems'
regex_internal.c:922: error: 're_node_set' has no member named 'elems'
regex_internal.c: In function 're_node_set_init_copy':
regex_internal.c:932: error: 're_node_set' has no member named 'nelem'
regex_internal.c:932: error: 're_node_set' has no member named 'nelem'
regex_internal.c:933: error: 're_node_set' has no member named 'nelem'
regex_internal.c:935: error: 're_node_set' has no member named 'alloc'
regex_internal.c:935: error: 're_node_set' has no member named 'nelem'
regex_internal.c:936: error: 're_node_set' has no member named 'elems'
regex_internal.c:936: error: expected expression before ')' token
regex_internal.c:937: error: 're_node_set' has no member named 'elems'
regex_internal.c:939: error: 're_node_set' has no member named 'alloc'
regex_internal.c:939: error: 're_node_set' has no member named 'nelem'
regex_internal.c:942: error: 're_node_set' has no member named 'elems'
regex_internal.c:942: error: 're_node_set' has no member named 'elems'
regex_internal.c:942: error: 're_node_set' has no member named 'nelem'
regex_internal.c:942: error: 're_node_set' has no member named 'elems'
regex_internal.c: In function 're_node_set_add_intersect':
regex_internal.c:958: error: expected ';' before 'i1'
regex_internal.c:959: error: 're_node_set' has no member named 'nelem'
regex_internal.c:959: error: 're_node_set' has no member named 'nelem'
regex_internal.c:964: error: 're_node_set' has no member named 'nelem'
regex_internal.c:964: error: 're_node_set' has no member named 'nelem'
regex_internal.c:964: error: 're_node_set' has no member named 'nelem'
regex_internal.c:964: error: 're_node_set' has no member named 'alloc'
regex_internal.c:966: error: expected ';' before 'new_alloc'
regex_internal.c:967: error: 'new_elems' undeclared (first use in this function)
regex_internal.c:969: error: 'new_alloc' undeclared (first use in this function)
regex_internal.c:969: error: 're_node_set' has no member named 'alloc'
regex_internal.c:970: error: 're_node_set' has no member named 'nelem'
regex_internal.c:970: error: 're_node_set' has no member named 'nelem'
regex_internal.c:970: error: called object 'Idx' is not a function
regex_internal.c:970: error: 're_node_set' has no member named 'nelem'
regex_internal.c:972: error: expected expression before ')' token
regex_internal.c:975: error: 're_node_set' has no member named 'elems'
regex_internal.c:976: error: 're_node_set' has no member named 'alloc'
regex_internal.c:981: error: 'sbase' undeclared (first use in this function)
regex_internal.c:981: error: 're_node_set' has no member named 'nelem'
regex_internal.c:981: error: 're_node_set' has no member named 'nelem'
regex_internal.c:981: error: 're_node_set' has no member named 'nelem'
regex_internal.c:982: error: 'i1' undeclared (first use in this function)
regex_internal.c:982: error: 're_node_set' has no member named 'nelem'
regex_internal.c:983: error: 'i2' undeclared (first use in this function)
regex_internal.c:983: error: 're_node_set' has no member named 'nelem'
regex_internal.c:984: error: 'id' undeclared (first use in this function)
regex_internal.c:984: error: 're_node_set' has no member named 'nelem'
regex_internal.c:987: error: 're_node_set' has no member named 'elems'
regex_internal.c:987: error: 're_node_set' has no member named 'elems'
regex_internal.c:990: error: called object 'Idx' is not a function
regex_internal.c:990: error: 're_node_set' has no member named 'elems'
regex_internal.c:990: error: 're_node_set' has no member named 'elems'
regex_internal.c:993: error: called object 'Idx' is not a function
regex_internal.c:993: error: 're_node_set' has no member named 'elems'
regex_internal.c:993: error: 're_node_set' has no member named 'elems'
regex_internal.c:994: error: 're_node_set' has no member named 'elems'
regex_internal.c:994: error: 're_node_set' has no member named 'elems'
regex_internal.c:996: error: called object 'Idx' is not a function
regex_internal.c:996: error: called object 'Idx' is not a function
regex_internal.c:1001: error: 're_node_set' has no member named 'elems'
regex_internal.c:1001: error: 're_node_set' has no member named 'elems'
regex_internal.c:1003: error: called object 'Idx' is not a function
regex_internal.c:1008: error: called object 'Idx' is not a function
regex_internal.c:1013: error: 're_node_set' has no member named 'nelem'
regex_internal.c:1014: error: 'is' undeclared (first use in this function)
regex_internal.c:1014: error: 're_node_set' has no member named 'nelem'
regex_internal.c:1014: error: 're_node_set' has no member named 'nelem'
regex_internal.c:1014: error: 're_node_set' has no member named 'nelem'
regex_internal.c:1015: error: 'delta' undeclared (first use in this function)
regex_internal.c:1020: error: 're_node_set' has no member named 'nelem'
regex_internal.c:1021: error: called object 'Idx' is not a function
regex_internal.c:1024: error: 're_node_set' has no member named 'elems'
regex_internal.c:1024: error: 're_node_set' has no member named 'elems'
regex_internal.c:1027: error: 're_node_set' has no member named 'elems'
regex_internal.c:1027: error: 're_node_set' has no member named 'elems'
regex_internal.c:1034: error: 're_node_set' has no member named 'elems'
regex_internal.c:1034: error: 're_node_set' has no member named 'elems'
regex_internal.c:1035: error: called object 'Idx' is not a function
regex_internal.c:1041: error: 're_node_set' has no member named 'elems'
regex_internal.c:1041: error: 're_node_set' has no member named 'elems'
regex_internal.c:1041: error: 're_node_set' has no member named 'elems'
regex_internal.c: In function 're_node_set_init_union':
regex_internal.c:1054: error: expected ';' before 'i1'
regex_internal.c:1055: error: 're_node_set' has no member named 'nelem'i686-pc-linux-gnu-gcc -DHAVE_CONFIG_H -I. -I. -I../.. -O2 -march=i686 -fomit-frame-pointer -c strcasecmp.c
regex_internal.c:1055: error: 're_node_set' has no member named 'nelem'
regex_internal.c:1057: error: 're_node_set' has no member named 'alloc'
regex_internal.c:1057: error: 're_node_set' has no member named 'nelem'
regex_internal.c:1057: error: 're_node_set' has no member named 'nelem'
regex_internal.c:1058: error: 're_node_set' has no member named 'alloc'
regex_internal.c:1058: error: 're_node_set' has no member named 'nelem'
regex_internal.c:1060: error: 're_node_set' has no member named 'elems'
regex_internal.c:1060: error: expected expression before ')' token
regex_internal.c:1061: error: 're_node_set' has no member named 'elems'
regex_internal.c:1066: error: 're_node_set' has no member named 'nelem'
regex_internal.c:1068: error: 're_node_set' has no member named 'nelem'
regex_internal.c:1074: error: 'i1' undeclared (first use in this function)
regex_internal.c:1074: error: 'i2' undeclared (first use in this function)
regex_internal.c:1074: error: 'id' undeclared (first use in this function)
regex_internal.c:1074: error: 're_node_set' has no member named 'nelem'
regex_internal.c:1074: error: 're_node_set' has no member named 'nelem'
regex_internal.c:1076: error: 're_node_set' has no member named 'elems'
regex_internal.c:1076: error: 're_node_set' has no member named 'elems'
regex_internal.c:1078: error: 're_node_set' has no member named 'elems'
regex_internal.c:1078: error: 're_node_set' has no member named 'elems'
regex_internal.c:1081: error: 're_node_set' has no member named 'elems'
regex_internal.c:1081: error: 're_node_set' has no member named 'elems'
regex_internal.c:1083: error: 're_node_set' has no member named 'elems'
regex_internal.c:1083: error: 're_node_set' has no member named 'elems'
regex_internal.c:1085: error: 're_node_set' has no member named 'nelem'
regex_internal.c:1087: error: 're_node_set' has no member named 'elems'
regex_internal.c:1087: error: 're_node_set' has no member named 'elems'
regex_internal.c:1088: error: 're_node_set' has no member named 'nelem'
regex_internal.c:1088: error: 're_node_set' has no member named 'elems'
regex_internal.c:1089: error: 're_node_set' has no member named 'nelem'
regex_internal.c:1091: error: 're_node_set' has no member named 'nelem'
regex_internal.c:1093: error: 're_node_set' has no member named 'elems'
regex_internal.c:1093: error: 're_node_set' has no member named 'elems'
regex_internal.c:1094: error: 're_node_set' has no member named 'nelem'
regex_internal.c:1094: error: 're_node_set' has no member named 'elems'
regex_internal.c:1095: error: 're_node_set' has no member named 'nelem'
regex_internal.c:1097: error: 're_node_set' has no member named 'nelem'
regex_internal.c: In function 're_node_set_merge':
regex_internal.c:1108: error: expected ';' before 'is'
regex_internal.c:1109: error: 're_node_set' has no member named 'nelem'
regex_internal.c:1112: error: 're_node_set' has no member named 'nelem'
regex_internal.c:1112: error: called object 'Idx' is not a function
regex_internal.c:1112: error: 're_node_set' has no member named 'nelem'
regex_internal.c:1113: error: 're_node_set' has no member named 'nelem'
regex_internal.c:1113: error: 're_node_set' has no member named 'nelem'
regex_internal.c:1113: error: called object 'Idx' is not a function
regex_internal.c:1113: error: 're_node_set' has no member named 'nelem'
regex_internal.c:1115: error: 're_node_set' has no member named 'alloc'
regex_internal.c:1115: error: 're_node_set' has no member named 'nelem'
regex_internal.c:1115: error: 're_node_set' has no member named 'nelem'
regex_internal.c:1117: error: expected ';' before 'new_alloc'
regex_internal.c:1118: error: 'new_buffer' undeclared (first use in this function)
regex_internal.c:1119: error: 'new_alloc' undeclared (first use in this function)
regex_internal.c:1119: error: 're_node_set' has no member named 'alloc'
regex_internal.c:1121: error: expected expression before ')' token
regex_internal.c:1124: error: 're_node_set' has no member named 'elems'
regex_internal.c:1125: error: 're_node_set' has no member named 'alloc'
regex_internal.c:1128: error: 're_node_set' has no member named 'nelem'
regex_internal.c:1130: error: 're_node_set' has no member named 'nelem'
regex_internal.c:1130: error: 're_node_set' has no member named 'nelem'
regex_internal.c:1131: error: 're_node_set' has no member named 'elems'
regex_internal.c:1131: error: 're_node_set' has no member named 'elems'
regex_internal.c:1131: error: 're_node_set' has no member named 'nelem'
regex_internal.c:1131: error: 're_node_set' has no member named 'elems'
regex_internal.c:1137: error: 'sbase' undeclared (first use in this function)
regex_internal.c:1137: error: 're_node_set' has no member named 'nelem'
regex_internal.c:1137: error: 're_node_set' has no member named 'nelem'
regex_internal.c:1138: error: 'is' undeclared (first use in this function)
regex_internal.c:1138: error: 're_node_set' has no member named 'nelem'
regex_internal.c:1138: error: 'id' undeclared (first use in this function)
regex_internal.c:1138: error: 're_node_set' has no member named 'nelem'
regex_internal.c:1139: error: called object 'Idx' is not a function
regex_internal.c:1139: error: called object 'Idx' is not a function
regex_internal.c:1141: error: 're_node_set' has no member named 'elems'
regex_internal.c:1141: error: 're_node_set' has no member named 'elems'
regex_internal.c:1143: error: 're_node_set' has no member named 'elems'
regex_internal.c:1143: error: 're_node_set' has no member named 'elems'
regex_internal.c:1144: error: 're_node_set' has no member named 'elems'
regex_internal.c:1144: error: 're_node_set' has no member named 'elems'
regex_internal.c:1149: error: called object 'Idx' is not a function
regex_internal.c:1153: error: 're_node_set' has no member named 'elems'
regex_internal.c:1153: error: 're_node_set' has no member named 'elems'
regex_internal.c:1154: error: 're_node_set' has no member named 'elems'
regex_internal.c:1157: error: 're_node_set' has no member named 'nelem'
regex_internal.c:1158: error: 're_node_set' has no member named 'nelem'
regex_internal.c:1158: error: 're_node_set' has no member named 'nelem'
regex_internal.c:1159: error: 'delta' undeclared (first use in this function)
regex_internal.c:1165: error: 're_node_set' has no member named 'nelem'
regex_internal.c:1168: error: 're_node_set' has no member named 'elems'
regex_internal.c:1168: error: 're_node_set' has no member named 'elems'
regex_internal.c:1171: error: 're_node_set' has no member named 'elems'
regex_internal.c:1171: error: 're_node_set' has no member named 'elems'
regex_internal.c:1178: error: 're_node_set' has no member named 'elems'
regex_internal.c:1178: error: 're_node_set' has no member named 'elems'
regex_internal.c:1179: error: called object 'Idx' is not a function
regex_internal.c:1182: error: 're_node_set' has no member named 'elems'
regex_internal.c:1182: error: 're_node_set' has no member named 'elems'
regex_internal.c:1183: error: 're_node_set' has no member named 'elems'
regex_internal.c: At top level:
regex_internal.c:1198: error: expected declaration specifiers or '...' before 'Idx'
regex_internal.c: In function 're_node_set_insert':
regex_internal.c:1200: error: expected ';' before 'idx'
regex_internal.c:1202: error: 're_node_set' has no member named 'alloc'
regex_internal.c:1203: error: 'elem' undeclared (first use in this function)
regex_internal.c:1203: error: too many arguments to function 're_node_set_init_1'
regex_internal.c:1205: error: 're_node_set' has no member named 'nelem'
regex_internal.c:1208: error: 're_node_set' has no member named 'elems'
regex_internal.c:1209: error: 're_node_set' has no member named 'nelem'
regex_internal.c:1214: error: 're_node_set' has no member named 'alloc'
regex_internal.c:1214: error: 're_node_set' has no member named 'nelem'
regex_internal.c:1216: error: 'new_elems' undeclared (first use in this function)
regex_internal.c:1216: error: expected expression before ')' token
regex_internal.c:1219: error: 're_node_set' has no member named 'elems'
regex_internal.c:1224: error: 're_node_set' has no member named 'elems'i686-pc-linux-gnu-gcc -DHAVE_CONFIG_H -I. -I. -I../.. -O2 -march=i686 -fomit-frame-pointer -c strstr.c
regex_internal.c:1226: error: 'idx' undeclared (first use in this function)
regex_internal.c:1227: error: 're_node_set' has no member named 'nelem'
regex_internal.c:1228: error: 're_node_set' has no member named 'elems'
regex_internal.c:1228: error: 're_node_set' has no member named 'elems'
regex_internal.c:1232: error: 're_node_set' has no member named 'nelem'
regex_internal.c:1232: error: 're_node_set' has no member named 'elems'
regex_internal.c:1233: error: 're_node_set' has no member named 'elems'
regex_internal.c:1233: error: 're_node_set' has no member named 'elems'
regex_internal.c:1237: error: 're_node_set' has no member named 'elems'
regex_internal.c:1238: error: 're_node_set' has no member named 'nelem'
regex_internal.c: At top level:
regex_internal.c:1248: error: expected declaration specifiers or '...' before 'Idx'
regex_internal.c: In function 're_node_set_insert_last':
regex_internal.c:1251: error: 're_node_set' has no member named 'alloc'
regex_internal.c:1251: error: 're_node_set' has no member named 'nelem'
regex_internal.c:1253: error: 'new_elems' undeclared (first use in this function)
regex_internal.c:1254: error: expected expression before ')' token
regex_internal.c:1257: error: 're_node_set' has no member named 'elems'
regex_internal.c:1261: error: 're_node_set' has no member named 'elems'
regex_internal.c:1261: error: 're_node_set' has no member named 'nelem'
regex_internal.c:1261: error: 'elem' undeclared (first use in this function)
regex_internal.c: In function 're_node_set_compare':
regex_internal.c:1272: error: expected ';' before 'i'
regex_internal.c:1273: error: 're_node_set' has no member named 'nelem'
regex_internal.c:1273: error: 're_node_set' has no member named 'nelem'
regex_internal.c:1275: error: 'i' undeclared (first use in this function)
regex_internal.c:1275: error: 're_node_set' has no member named 'nelem'
regex_internal.c:1275: error: called object 'Idx' is not a function
regex_internal.c:1276: error: 're_node_set' has no member named 'elems'
regex_internal.c:1276: error: 're_node_set' has no member named 'elems'
regex_internal.c: At top level:
regex_internal.c:1285: warning: 'regparm' attribute only applies to function types
regex_internal.c:1285: warning: 'stdcall' attribute only applies to function types
regex_internal.c:1285: warning: 'pure' attribute ignored
regex_internal.c:1285: error: expected ',' or ';' before 're_node_set_contains'
regex_internal.c:1307: error: expected declaration specifiers or '...' before 'Idx'
regex_internal.c: In function 're_node_set_remove_at':
regex_internal.c:1309: error: 'idx' undeclared (first use in this function)
regex_internal.c:1309: error: 're_node_set' has no member named 'nelem'
regex_internal.c:1311: error: 're_node_set' has no member named 'nelem'
regex_internal.c:1312: error: 're_node_set' has no member named 'nelem'
regex_internal.c:1313: error: 're_node_set' has no member named 'elems'
regex_internal.c:1313: error: 're_node_set' has no member named 'elems'
regex_internal.c: At top level:
regex_internal.c:1322: warning: 'regparm' attribute only applies to function types
regex_internal.c:1322: warning: 'stdcall' attribute only applies to function types
regex_internal.c:1322: error: expected ',' or ';' before 're_dfa_add_node'
regex_internal.c:1361: warning: variable 're_hashval_t' declared 'inline'
regex_internal.c:1363: warning: 'regparm' attribute only applies to function types
regex_internal.c:1363: warning: 'stdcall' attribute only applies to function types
regex_internal.c:1363: error: expected ',' or ';' before 'calc_state_hash'
regex_internal.c: In function 're_acquire_state':
regex_internal.c:1385: error: expected ';' before 'hash'
regex_internal.c:1388: error: expected ';' before 'i'
regex_internal.c:1393: error: 're_node_set' has no member named 'nelem'
regex_internal.c:1398: error: 'hash' undeclared (first use in this function)
regex_internal.c:1399: error: 're_dfa_t' has no member named 'state_table'
regex_internal.c:1399: error: 're_dfa_t' has no member named 'state_hash_mask'
regex_internal.c:1401: error: 'i' undeclared (first use in this function)
regex_internal.c:1401: error: 'struct re_state_table_entry' has no member named 'num'
regex_internal.c:1403: error: 'struct re_state_table_entry' has no member named 'array'
regex_internal.c:1404: error: 're_dfastate_t' has no member named 'hash'
regex_internal.c:1406: error: 're_dfastate_t' has no member named 'nodes'
regex_internal.c:1411: error: too many arguments to function 'create_ci_newstate'
regex_internal.c: In function 're_acquire_state_context':
regex_internal.c:1436: error: expected ';' before 'hash'
regex_internal.c:1439: error: expected ';' before 'i'
regex_internal.c:1444: error: 're_node_set' has no member named 'nelem'
regex_internal.c:1449: error: 'hash' undeclared (first use in this function)
regex_internal.c:1450: error: 're_dfa_t' has no member named 'state_table'
regex_internal.c:1450: error: 're_dfa_t' has no member named 'state_hash_mask'
regex_internal.c:1452: error: 'i' undeclared (first use in this function)
regex_internal.c:1452: error: 'struct re_state_table_entry' has no member named 'num'
regex_internal.c:1454: error: 'struct re_state_table_entry' has no member named 'array'
regex_internal.c:1455: error: 're_dfastate_t' has no member named 'hash'
regex_internal.c:1456: error: 're_dfastate_t' has no member named 'context'
regex_internal.c:1457: error: 're_dfastate_t' has no member named 'entrance_nodes'
regex_internal.c:1461: error: too many arguments to function 'create_cd_newstate'
regex_internal.c: At top level:
regex_internal.c:1477: error: expected declaration specifiers or '...' before 're_hashval_t'
regex_internal.c: In function 'register_state':
regex_internal.c:1481: error: expected ';' before 'i'
regex_internal.c:1483: error: 're_dfastate_t' has no member named 'hash'
regex_internal.c:1483: error: 'hash' undeclared (first use in this function)
regex_internal.c:1484: error: 're_dfastate_t' has no member named 'non_eps_nodes'
regex_internal.c:1484: error: 're_dfastate_t' has no member named 'nodes'
regex_internal.c:1484: error: too many arguments to function 're_node_set_alloc'
regex_internal.c:1487: error: 'i' undeclared (first use in this function)
regex_internal.c:1487: error: 're_dfastate_t' has no member named 'nodes'
regex_internal.c:1489: error: expected ';' before 'elem'
regex_internal.c:1490: error: 'elem' undeclared (first use in this function)
regex_internal.c:1492: error: 're_dfastate_t' has no member named 'non_eps_nodes'
regex_internal.c:1492: error: too many arguments to function 're_node_set_insert_last'
regex_internal.c:1498: error: 're_dfa_t' has no member named 'state_table'
regex_internal.c:1498: error: 're_dfa_t' has no member named 'state_hash_mask'
regex_internal.c:1499: error: 'struct re_state_table_entry' has no member named 'alloc'
regex_internal.c:1499: error: 'struct re_state_table_entry' has no member named 'num'
regex_internal.c:1501: error: expected ';' before 'new_alloc'
regex_internal.c:1502: error: 'struct re_state_table_entry' has no member named 'array'
regex_internal.c:1502: error: 'new_alloc' undeclared (first use in this function)
regex_internal.c:1506: error: 'struct re_state_table_entry' has no member named 'array'
regex_internal.c:1507: error: 'struct re_state_table_entry' has no member named 'alloc'
regex_internal.c:1509: error: 'struct re_state_table_entry' has no member named 'array'
regex_internal.c:1509: error: 'struct re_state_table_entry' has no member named 'num'
regex_internal.c: At top level:
regex_internal.c:1519: error: expected declaration specifiers or '...' before 're_hashval_t'
regex_internal.c: In function 'create_ci_newstate':
regex_internal.c:1521: error: expected ';' before 'i'
regex_internal.c:1528: error: 're_dfastate_t' has no member named 'nodes'
regex_internal.c:1535: error: 're_dfastate_t' has no member named 'entrance_nodes'
regex_internal.c:1535: error: 're_dfastate_t' has no member named 'nodes'
regex_internal.c:1536: error: 'i' undeclared (first use in this function)
regex_internal.c:1536: error: 're_node_set' has no member named 'nelem'
regex_internal.c:1538: error: 're_node_set' has no member named 'elems'
regex_internal.c:1543: error: 're_dfastate_t' has no member named 'accept_mb'
regex_internal.c:1548: error: 're_dfastate_t' has no member named 'halt'
regex_internal.c:1550: error: 're_dfastate_t' has no member named 'has_backref'
regex_internal.c:1552: error: 're_dfastate_t' has no member named 'has_constraint'
regex_internal.c:1554: error: 'hash' undeclared (first use in this function)
regex_internal.c:1554: error: too many arguments to function 'register_state'
regex_internal.c: At top level:
regex_internal.c:1569: error: expected declaration specifiers or '...' before 're_hashval_t'
regex_internal.c: In function 'create_cd_newstate':
regex_internal.c:1571: error: expected ';' before 'i'
regex_internal.c:1578: error: 're_dfastate_t' has no member named 'nodes'
regex_internal.c:1585: error: 're_dfastate_t' has no member named 'context'
regex_internal.c:1586: error: 're_dfastate_t' has no member named 'entrance_nodes'
regex_internal.c:1586: error: 're_dfastate_t' has no member named 'nodes'
regex_internal.c:1588: error: 'i' undeclared (first use in this function)
regex_internal.c:1588: error: 're_node_set' has no member named 'nelem'
regex_internal.c:1591: error: 're_node_set' has no member named 'elems'
regex_internal.c:1599: error: 're_dfastate_t' has no member named 'accept_mb'
regex_internal.c:1604: error: 're_dfastate_t' has no member named 'halt'
regex_internal.c:1606: error: 're_dfastate_t' has no member named 'has_backref'
regex_internal.c:1608: error: 'union <anonymous>' has no member named 'ctx_type'
regex_internal.c:1612: error: 're_dfastate_t' has no member named 'entrance_nodes'
regex_internal.c:1612: error: 're_dfastate_t' has no member named 'nodes'
regex_internal.c:1614: error: 're_dfastate_t' has no member named 'entrance_nodes'
regex_internal.c:1615: error: 're_dfastate_t' has no member named 'entrance_nodes'
regex_internal.c:1620: error: 're_dfastate_t' has no member named 'entrance_nodes'
regex_internal.c:1621: error: 'nctx_nodes' undeclared (first use in this function)
regex_internal.c:1622: error: 're_dfastate_t' has no member named 'has_constraint'
regex_internal.c:1627: error: 're_dfastate_t' has no member named 'nodes'
regex_internal.c:1627: error: too many arguments to function 're_node_set_remove_at'
regex_internal.c:1632: error: 'hash' undeclared (first use in this function)
regex_internal.c:1632: error: too many arguments to function 'register_state'
regex_internal.c: In function 'free_state':
regex_internal.c:1645: error: 're_dfastate_t' has no member named 'non_eps_nodes'
regex_internal.c:1646: error: 're_dfastate_t' has no member named 'inveclosure'
regex_internal.c:1647: error: 're_dfastate_t' has no member named 'entrance_nodes'
regex_internal.c:1647: error: 're_dfastate_t' has no member named 'nodes'
regex_internal.c:1649: error: 're_dfastate_t' has no member named 'entrance_nodes'
regex_internal.c:1650: error: 're_dfastate_t' has no member named 'entrance_nodes'
regex_internal.c:1652: error: 're_dfastate_t' has no member named 'nodes'
regex_internal.c:1653: error: 're_dfastate_t' has no member named 'word_trtable'
regex_internal.c:1654: error: 're_dfastate_t' has no member named 'trtable'
In file included from regex.c:58:
regcomp.c: At top level:
regcomp.c:21: error: expected declaration specifiers or '...' before 'Idx'
regcomp.c:25: error: expected declaration specifiers or '...' before 'Idx'
regcomp.c:48: error: expected '=', ',', ';', 'asm' or '__attribute__' before 'duplicate_node'
regcomp.c:49: error: expected '=', ',', ';', 'asm' or '__attribute__' before 'search_duplicated_node'
regcomp.c:53: error: expected declaration specifiers or '...' before 'Idx'
regcomp.c:55: error: expected '=', ',', ';', 'asm' or '__attribute__' before 'fetch_number'
regcomp.c:63: error: expected declaration specifiers or '...' before 'Idx'
regcomp.c:66: error: expected declaration specifiers or '...' before 'Idx'
regcomp.c:69: error: expected declaration specifiers or '...' before 'Idx'
regcomp.c:72: error: expected declaration specifiers or '...' before 'Idx'
regcomp.c:91: error: expected declaration specifiers or '...' before 'Idx'
regcomp.c:93: error: expected ';', ',' or ')' before 'trans'
regcomp.c:108: error: expected ';', ',' or ')' before 'trans'
regcomp.c: In function 'rpl_re_compile_pattern':
regcomp.c:221: error: 'struct re_pattern_buffer' has no member named 're_no_sub'
regcomp.c:221: error: 'REG_NO_SUB' undeclared (first use in this function)
regcomp.c:224: error: 'struct re_pattern_buffer' has no member named 're_newline_anchor'
regcomp.c:226: error: too many arguments to function 're_compile_internal'
regcomp.c: In function 'rpl_re_compile_fastmap':
regcomp.c:266: error: 'struct re_pattern_buffer' has no member named 're_buffer'
regcomp.c:267: error: 'struct re_pattern_buffer' has no member named 're_fastmap'
regcomp.c:270: error: 're_dfa_t' has no member named 'init_state'
regcomp.c:271: error: 're_dfa_t' has no member named 'init_state'
regcomp.c:271: error: 're_dfa_t' has no member named 'init_state_word'
regcomp.c:272: error: 're_dfa_t' has no member named 'init_state_word'
regcomp.c:273: error: 're_dfa_t' has no member named 'init_state'
regcomp.c:273: error: 're_dfa_t' has no member named 'init_state_nl'
regcomp.c:274: error: 're_dfa_t' has no member named 'init_state_nl'
regcomp.c:275: error: 're_dfa_t' has no member named 'init_state'
regcomp.c:275: error: 're_dfa_t' has no member named 'init_state_begbuf'
regcomp.c:276: error: 're_dfa_t' has no member named 'init_state_begbuf'
regcomp.c:277: error: 'struct re_pattern_buffer' has no member named 're_fastmap_accurate'
regcomp.c: In function 're_compile_fastmap_iter':
regcomp.c:300: error: 'regex_t' has no member named 're_buffer'
regcomp.c:301: error: expected ';' before 'node_cnt'
regcomp.c:302: error: 're_dfa_t' has no member named 'mb_cur_max'
regcomp.c:302: error: 'regex_t' has no member named 're_syntax'
regcomp.c:302: error: 'REG_IGNORE_CASE' undeclared (first use in this function)
regcomp.c:303: error: 'node_cnt' undeclared (first use in this function)
regcomp.c:303: error: 're_dfastate_t' has no member named 'nodes'
regcomp.c:305: error: expected ';' before 'node'
regcomp.c:306: error: 'node' undeclared (first use in this function)
regcomp.c:312: error: 'regex_t' has no member named 're_syntax'
regcomp.c:312: error: 're_dfa_t' has no member named 'mb_cur_max'
regcomp.c:321: error: 're_dfa_t' has no member named 'nodes_len'
regcomp.c:345: error: expected ';' before 'i'
regcomp.c:347: error: 're_charset_t' has no member named 'ncoll_syms'
regcomp.c:347: error: 're_charset_t' has no member named 'nequiv_classes'
regcomp.c:348: error: 're_charset_t' has no member named 'nranges'
regcomp.c:348: error: 're_charset_t' has no member named 'nchar_classes'
regcomp.c:366: error: 're_dfa_t' has no member named 'mb_cur_max'
regcomp.c:367: error: 'i' undeclared (first use in this function)
regcomp.c:372: error: 're_charset_t' has no member named 'nmbchars'
regcomp.c:379: error: 'regex_t' has no member named 're_syntax'
regcomp.c:379: error: 're_dfa_t' has no member named 'mb_cur_max'
regcomp.c:396: error: 'regex_t' has no member named 're_can_be_null'
regcomp.c: In function 'rpl_regcomp':
regcomp.c:442: error: 'REG_SYNTAX_POSIX_EXTENDED' undeclared (first use in this function)
regcomp.c:443: error: 'REG_SYNTAX_POSIX_BASIC' undeclared (first use in this function)
regcomp.c:445: error: 'regex_t' has no member named 're_buffer'
regcomp.c:446: error: 'regex_t' has no member named 're_allocated'
regcomp.c:447: error: 'regex_t' has no member named 're_used'
regcomp.c:450: error: 'regex_t' has no member named 're_fastmap'
regcomp.c:451: error: 'regex_t' has no member named 're_fastmap'
regcomp.c:454: error: 'REG_IGNORE_CASE' undeclared (first use in this function)
regcomp.c:459: error: 'REG_DOT_NEWLINE' undeclared (first use in this function)
regcomp.c:460: error: 'REG_HAT_LISTS_NOT_NEWLINE' undeclared (first use in this function)
regcomp.c:462: error: 'regex_t' has no member named 're_newline_anchor'
regcomp.c:465: error: 'regex_t' has no member named 're_newline_anchor'
regcomp.c:466: error: 'regex_t' has no member named 're_no_sub'
regcomp.c:467: error: 'regex_t' has no member named 're_translate'
regcomp.c:469: error: too many arguments to function 're_compile_internal'
regcomp.c:484: error: 'regex_t' has no member named 're_fastmap'
regcomp.c:485: error: 'regex_t' has no member named 're_fastmap'
regcomp.c: In function 'free_dfa_content':
regcomp.c:570: error: expected ';' before 'i'
regcomp.c:573: error: 'i' undeclared (first use in this function)
regcomp.c:573: error: 're_dfa_t' has no member named 'nodes_len'
regcomp.c:575: error: 're_dfa_t' has no member named 'nexts'
regcomp.c:576: error: 're_dfa_t' has no member named 'nodes_len'
regcomp.c:578: error: 're_dfa_t' has no member named 'eclosures'
regcomp.c:579: error: 're_dfa_t' has no member named 'eclosures'
regcomp.c:580: error: 're_dfa_t' has no member named 'inveclosures'
regcomp.c:581: error: 're_dfa_t' has no member named 'inveclosures'
regcomp.c:582: error: 're_dfa_t' has no member named 'edests'
regcomp.c:583: error: 're_dfa_t' has no member named 'edests'
regcomp.c:585: error: 're_dfa_t' has no member named 'edests'
regcomp.c:586: error: 're_dfa_t' has no member named 'eclosures'
regcomp.c:587: error: 're_dfa_t' has no member named 'inveclosures'
regcomp.c:590: error: 're_dfa_t' has no member named 'state_table'
regcomp.c:591: error: 're_dfa_t' has no member named 'state_hash_mask'
regcomp.c:593: error: 're_dfa_t' has no member named 'state_table'
regcomp.c:594: error: 'j' undeclared (first use in this function)
regcomp.c:594: error: 'struct re_state_table_entry' has no member named 'num'
regcomp.c:596: error: 'struct re_state_table_entry' has no member named 'array'
regcomp.c:599: error: 'struct re_state_table_entry' has no member named 'array'
regcomp.c:601: error: 're_dfa_t' has no member named 'state_table'
regcomp.c:603: error: 're_dfa_t' has no member named 'sb_char'
regcomp.c:604: error: 're_dfa_t' has no member named 'sb_char'
regcomp.c:606: error: 're_dfa_t' has no member named 'subexp_map'
regcomp.c: In function 'rpl_regfree':
regcomp.c:620: error: 'regex_t' has no member named 're_buffer'
regcomp.c:623: error: 'regex_t' has no member named 're_buffer'
regcomp.c:624: error: 'regex_t' has no member named 're_allocated'
regcomp.c:626: error: 'regex_t' has no member named 're_fastmap'
regcomp.c:627: error: 'regex_t' has no member named 're_fastmap'
regcomp.c:629: error: 'regex_t' has no member named 're_translate'
regcomp.c:630: error: 'regex_t' has no member named 're_translate'
regcomp.c: At top level:
regcomp.c:709: error: expected declaration specifiers or '...' before 'Idx'
regcomp.c: In function 're_compile_internal':
regcomp.c:717: error: 'regex_t' has no member named 're_fastmap_accurate'
regcomp.c:718: error: 'regex_t' has no member named 're_syntax'
regcomp.c:719: error: 'regex_t' has no member named 're_not_bol'
regcomp.c:719: error: 'regex_t' has no member named 're_not_eol'
regcomp.c:720: error: 'regex_t' has no member named 're_used'
regcomp.c:722: error: 'regex_t' has no member named 're_can_be_null'
regcomp.c:723: error: 'regex_t' has no member named 're_regs_allocated'
regcomp.c:723: error: 'REG_UNALLOCATED' undeclared (first use in this function)
regcomp.c:726: error: 'regex_t' has no member named 're_buffer'
regcomp.c:727: error: 'regex_t' has no member named 're_allocated'
regcomp.c:733: error: 'regex_t' has no member named 're_buffer'
regcomp.c:736: error: 'regex_t' has no member named 're_allocated'
regcomp.c:737: error: 'regex_t' has no member named 're_buffer'
regcomp.c:739: error: 'regex_t' has no member named 're_used'
regcomp.c:743: error: 'length' undeclared (first use in this function)
regcomp.c:743: error: too many arguments to function 'init_dfa'
regcomp.c:747: error: 'regex_t' has no member named 're_buffer'
regcomp.c:748: error: 'regex_t' has no member named 're_allocated'
regcomp.c:756: error: 'regex_t' has no member named 're_translate'
regcomp.c:757: error: 'REG_IGNORE_CASE' undeclared (first use in this function)
regcomp.c:757: error: too many arguments to function 're_string_construct'
regcomp.c:764: error: 'regex_t' has no member named 're_buffer'
regcomp.c:765: error: 'regex_t' has no member named 're_allocated'
regcomp.c:771: error: 're_dfa_t' has no member named 'str_tree'
regcomp.c:772: error: 're_dfa_t' has no member named 'str_tree'
regcomp.c:782: error: 're_dfa_t' has no member named 'is_utf8'
regcomp.c:782: error: 'regex_t' has no member named 're_translate'
regcomp.c:796: error: 'regex_t' has no member named 're_buffer'
regcomp.c:797: error: 'regex_t' has no member named 're_allocated'
regcomp.c: At top level:
regcomp.c:807: error: expected declaration specifiers or '...' before 'Idx'
regcomp.c: In function 'init_dfa':
regcomp.c:809: error: '__re_size_t' undeclared (first use in this function)
regcomp.c:809: error: expected ';' before 'table_size'
regcomp.c:817: error: 're_dfa_t' has no member named 'str_tree_storage_idx'
regcomp.c:819: error: 're_dfa_t' has no member named 'nodes_alloc'
regcomp.c:819: error: 'pat_len' undeclared (first use in this function)
regcomp.c:820: error: 're_dfa_t' has no member named 'nodes_alloc'
regcomp.c:823: error: 'table_size' undeclared (first use in this function)
regcomp.c:827: error: 're_dfa_t' has no member named 'state_table'
regcomp.c:828: error: 're_dfa_t' has no member named 'state_hash_mask'
regcomp.c:830: error: 're_dfa_t' has no member named 'mb_cur_max'
regcomp.c:854: error: 're_dfa_t' has no member named 'is_utf8'
regcomp.c:858: error: 're_dfa_t' has no member named 'map_notascii'
regcomp.c:862: error: 're_dfa_t' has no member named 'mb_cur_max'
regcomp.c:864: error: 're_dfa_t' has no member named 'is_utf8'
regcomp.c:865: error: 're_dfa_t' has no member named 'sb_char'
regcomp.c:870: error: 're_dfa_t' has no member named 'sb_char'
regcomp.c:871: error: 're_dfa_t' has no member named 'sb_char'
regcomp.c:880: error: 're_dfa_t' has no member named 'sb_char'
regcomp.c:883: error: 're_dfa_t' has no member named 'map_notascii'
regcomp.c:890: error: 're_dfa_t' has no member named 'state_table'
regcomp.c: In function 'init_word_char':
regcomp.c:903: error: 're_dfa_t' has no member named 'word_ops_used'
regcomp.c:907: error: 're_dfa_t' has no member named 'word_char'
regcomp.c: In function 'free_workarea_compile':
regcomp.c:915: error: 'regex_t' has no member named 're_buffer'
regcomp.c:917: error: 're_dfa_t' has no member named 'str_tree_storage'
regcomp.c:922: error: 're_dfa_t' has no member named 'str_tree_storage'
regcomp.c:923: error: 're_dfa_t' has no member named 'str_tree_storage_idx'
regcomp.c:924: error: 're_dfa_t' has no member named 'str_tree'
regcomp.c:925: error: 're_dfa_t' has no member named 'org_indices'
regcomp.c:926: error: 're_dfa_t' has no member named 'org_indices'
regcomp.c: In function 'create_initial_state':
regcomp.c:934: error: expected ';' before 'first'
regcomp.c:940: error: 'first' undeclared (first use in this function)
regcomp.c:940: error: 're_dfa_t' has no member named 'str_tree'
regcomp.c:941: error: 're_dfa_t' has no member named 'init_node'
regcomp.c:942: error: 're_dfa_t' has no member named 'eclosures'
regcomp.c:950: error: 're_dfa_t' has no member named 'nbackref'
regcomp.c:951: error: 'i' undeclared (first use in this function)
regcomp.c:951: error: 're_node_set' has no member named 'nelem'
regcomp.c:953: error: expected ';' before 'node_idx'
regcomp.c:954: error: 'node_idx' undeclared (first use in this function)
regcomp.c:956: error: expected ';' before 'clexp_idx'
regcomp.c:959: error: 'clexp_idx' undeclared (first use in this function)
regcomp.c:959: error: 're_node_set' has no member named 'nelem'
regcomp.c:962: error: 're_node_set' has no member named 'elems'
regcomp.c:964: error: 'union <anonymous>' has no member named 'idx'
regcomp.c:967: error: 're_node_set' has no member named 'nelem'
regcomp.c:972: error: expected ';' before 'dest_idx'
regcomp.c:973: error: 'dest_idx' undeclared (first use in this function)
regcomp.c:975: error: 're_dfa_t' has no member named 'eclosures'
regcomp.c:982: error: 're_dfa_t' has no member named 'init_state'
regcomp.c:984: error: 're_dfa_t' has no member named 'init_state'
regcomp.c:986: error: 're_dfa_t' has no member named 'init_state'
regcomp.c:988: error: 're_dfa_t' has no member named 'init_state_word'
regcomp.c:990: error: 're_dfa_t' has no member named 'init_state_nl'
regcomp.c:992: error: 're_dfa_t' has no member named 'init_state_begbuf'
regcomp.c:996: error: 're_dfa_t' has no member named 'init_state_word'
regcomp.c:996: error: 're_dfa_t' has no member named 'init_state_nl'
regcomp.c:996: error: 're_dfa_t' has no member named 'init_state_begbuf'
regcomp.c:1001: error: 're_dfa_t' has no member named 'init_state_word'
regcomp.c:1001: error: 're_dfa_t' has no member named 'init_state_nl'
regcomp.c:1002: error: 're_dfa_t' has no member named 'init_state_begbuf'
regcomp.c:1002: error: 're_dfa_t' has no member named 'init_state'
regcomp.c:1004: error: 're_node_set' has no member named 'elems'
regcomp.c: In function 'optimize_utf8':
regcomp.c:1016: error: expected ';' before 'node'
regcomp.c:1021: error: 'node' undeclared (first use in this function)
regcomp.c:1021: error: 're_dfa_t' has no member named 'nodes_len'
regcomp.c:1073: error: 're_dfa_t' has no member named 'nodes_len'
regcomp.c:1083: error: 're_dfa_t' has no member named 'mb_cur_max'
regcomp.c:1084: error: 're_dfa_t' has no member named 'is_utf8'
regcomp.c:1085: error: 're_dfa_t' has no member named 'has_mb_node'
regcomp.c:1085: error: 're_dfa_t' has no member named 'nbackref'
regcomp.c: In function 'analyze':
regcomp.c:1095: error: 'regex_t' has no member named 're_buffer'
regcomp.c:1099: error: 're_dfa_t' has no member named 'nexts'
regcomp.c:1099: error: expected expression before ')' token
regcomp.c:1100: error: 're_dfa_t' has no member named 'org_indices'
regcomp.c:1100: error: expected expression before ')' token
regcomp.c:1101: error: 're_dfa_t' has no member named 'edests'
regcomp.c:1101: error: 're_dfa_t' has no member named 'nodes_alloc'
regcomp.c:1102: error: 're_dfa_t' has no member named 'eclosures'
regcomp.c:1102: error: 're_dfa_t' has no member named 'nodes_alloc'
regcomp.c:1103: error: 're_dfa_t' has no member named 'nexts'
regcomp.c:1103: error: 're_dfa_t' has no member named 'org_indices'
regcomp.c:1103: error: 're_dfa_t' has no member named 'edests'
regcomp.c:1103: error: 're_dfa_t' has no member named 'eclosures'
regcomp.c:1107: error: 're_dfa_t' has no member named 'subexp_map'
regcomp.c:1107: error: expected expression before ')' token
regcomp.c:1108: error: 're_dfa_t' has no member named 'subexp_map'
regcomp.c:1110: error: expected ';' before 'i'
regcomp.c:1111: error: 'i' undeclared (first use in this function)
regcomp.c:1112: error: 're_dfa_t' has no member named 'subexp_map'
regcomp.c:1113: error: 're_dfa_t' has no member named 'str_tree'
regcomp.c:1115: error: 're_dfa_t' has no member named 'subexp_map'
regcomp.c:1119: error: 're_dfa_t' has no member named 'subexp_map'
regcomp.c:1120: error: 're_dfa_t' has no member named 'subexp_map'
regcomp.c:1124: error: 're_dfa_t' has no member named 'str_tree'
regcomp.c:1127: error: 're_dfa_t' has no member named 'str_tree'
regcomp.c:1130: error: 're_dfa_t' has no member named 'str_tree'
regcomp.c:1131: error: 're_dfa_t' has no member named 'str_tree'
regcomp.c:1140: error: 'regex_t' has no member named 're_no_sub'
regcomp.c:1140: error: 're_dfa_t' has no member named 'has_plural_match'
regcomp.c:1141: error: 're_dfa_t' has no member named 'nbackref'
regcomp.c:1143: error: 're_dfa_t' has no member named 'inveclosures'
regcomp.c:1143: error: 're_dfa_t' has no member named 'nodes_len'
regcomp.c:1144: error: 're_dfa_t' has no member named 'inveclosures'
regcomp.c: In function 'optimize_subexps':
regcomp.c:1225: error: 're_dfa_t' has no member named 'subexp_map'
regcomp.c:1227: error: 'union <anonymous>' has no member named 'idx'
regcomp.c:1228: error: 'union <anonymous>' has no member named 'idx'
regcomp.c:1228: error: 're_dfa_t' has no member named 'subexp_map'
regcomp.c:1229: error: 're_dfa_t' has no member named 'used_bkref_map'
regcomp.c:1229: error: 'union <anonymous>' has no member named 'idx'
regcomp.c:1235: error: expected ';' before 'other_idx'
regcomp.c:1241: error: 're_dfa_t' has no member named 'subexp_map'
regcomp.c:1241: error: 'other_idx' undeclared (first use in this function)
regcomp.c:1241: error: 're_dfa_t' has no member named 'subexp_map'
regcomp.c:1241: error: 'union <anonymous>' has no member named 'idx'
regcomp.c:1243: error: 're_dfa_t' has no member named 'used_bkref_map'
regcomp.c: In function 'lower_subexp':
regcomp.c:1276: error: 'regex_t' has no member named 're_buffer'
regcomp.c:1280: error: 'regex_t' has no member named 're_no_sub'
regcomp.c:1286: error: 'union <anonymous>' has no member named 'idx'
regcomp.c:1287: error: 're_dfa_t' has no member named 'used_bkref_map'
regcomp.c:1287: error: 'union <anonymous>' has no member named 'idx'
regcomp.c:1302: error: 'union <anonymous>' has no member named 'idx'
regcomp.c:1302: error: 'union <anonymous>' has no member named 'idx'
regcomp.c:1302: error: 'union <anonymous>' has no member named 'idx'
regcomp.c: In function 'calc_first':
regcomp.c:1316: error: 'bin_tree_t' has no member named 'node_idx'
regcomp.c:1316: error: 'struct bin_tree_t' has no member named 'node_idx'
regcomp.c:1321: error: 'bin_tree_t' has no member named 'node_idx'
regcomp.c:1322: error: 'bin_tree_t' has no member named 'node_idx'
regcomp.c: In function 'link_nfa_nodes':
regcomp.c:1356: error: expected ';' before 'idx'
regcomp.c:1371: error: expected ';' before 'left'
regcomp.c:1372: error: 're_dfa_t' has no member named 'has_plural_match'
regcomp.c:1374: error: 'left' undeclared (first use in this function)
regcomp.c:1374: error: 'struct bin_tree_t' has no member named 'node_idx'
regcomp.c:1376: error: 'struct bin_tree_t' has no member named 'node_idx'
regcomp.c:1378: error: 'right' undeclared (first use in this function)
regcomp.c:1378: error: 'struct bin_tree_t' has no member named 'node_idx'
regcomp.c:1380: error: 'struct bin_tree_t' has no member named 'node_idx'
regcomp.c:1381: error: called object 'Idx' is not a function
regcomp.c:1382: error: called object 'Idx' is not a function
regcomp.c:1383: error: 're_dfa_t' has no member named 'edests'
regcomp.c:1383: error: 'idx' undeclared (first use in this function)
regcomp.c:1383: error: too many arguments to function 're_node_set_init_2'
regcomp.c:1390: error: 're_dfa_t' has no member named 'edests'
regcomp.c:1390: error: 'struct bin_tree_t' has no member named 'node_idx'
regcomp.c:1390: error: too many arguments to function 're_node_set_init_1'
regcomp.c:1394: error: 're_dfa_t' has no member named 'nexts'
regcomp.c:1394: error: 'struct bin_tree_t' has no member named 'node_idx'
regcomp.c:1396: error: 're_dfa_t' has no member named 'edests'
regcomp.c:1396: error: 're_dfa_t' has no member named 'nexts'
regcomp.c:1396: error: too many arguments to function 're_node_set_init_1'
regcomp.c:1401: error: 're_dfa_t' has no member named 'nexts'
regcomp.c:1401: error: 'struct bin_tree_t' has no member named 'node_idx'
regcomp.c: At top level:
regcomp.c:1413: error: expected declaration specifiers or '...' before 'Idx'
regcomp.c:1414: error: expected declaration specifiers or '...' before 'Idx'
regcomp.c:1414: error: expected declaration specifiers or '...' before 'Idx'
regcomp.c: In function 'duplicate_node_closure':
regcomp.c:1417: error: expected ';' before 'org_node'
regcomp.c:1420: error: 'org_node' undeclared (first use in this function)
regcomp.c:1420: error: 'top_org_node' undeclared (first use in this function)
regcomp.c:1420: error: 'clone_node' undeclared (first use in this function)
regcomp.c:1420: error: 'top_clone_node' undeclared (first use in this function)
regcomp.c:1422: error: expected ';' before 'org_dest'
regcomp.c:1429: error: 'org_dest' undeclared (first use in this function)
regcomp.c:1429: error: 're_dfa_t' has no member named 'nexts'
regcomp.c:1430: error: 're_dfa_t' has no member named 'edests'
regcomp.c:1431: error: 'clone_dest' undeclared (first use in this function)
regcomp.c:1434: error: 're_dfa_t' has no member named 'nexts'
regcomp.c:1434: error: 're_dfa_t' has no member named 'nexts'
regcomp.c:1435: error: 're_dfa_t' has no member named 'edests'
regcomp.c:1435: error: too many arguments to function 're_node_set_insert'
regcomp.c:1439: error: 're_dfa_t' has no member named 'edests'
regcomp.c:1444: error: 're_dfa_t' has no member named 'nexts'
regcomp.c:1444: error: 're_dfa_t' has no member named 'nexts'
regcomp.c:1447: error: 're_dfa_t' has no member named 'edests'
regcomp.c:1451: error: 're_dfa_t' has no member named 'edests'
regcomp.c:1452: error: 're_dfa_t' has no member named 'edests'
regcomp.c:1456: error: 'root_node' undeclared (first use in this function)
regcomp.c:1461: error: 're_dfa_t' has no member named 'edests'
regcomp.c:1462: error: too many arguments to function 're_node_set_insert'
regcomp.c:1472: error: 're_dfa_t' has no member named 'edests'
regcomp.c:1472: error: too many arguments to function 're_node_set_insert'
regcomp.c:1480: error: 're_dfa_t' has no member named 'edests'
regcomp.c:1481: error: 're_dfa_t' has no member named 'edests'
regcomp.c:1491: error: 're_dfa_t' has no member named 'edests'
regcomp.c:1491: error: too many arguments to function 're_node_set_insert'
regcomp.c:1495: error: too many arguments to function 'duplicate_node_closure'
regcomp.c:1503: error: 're_dfa_t' has no member named 'edests'
regcomp.c:1503: error: too many arguments to function 're_node_set_insert'
regcomp.c:1508: error: 're_dfa_t' has no member named 'edests'
regcomp.c:1512: error: 're_dfa_t' has no member named 'edests'
regcomp.c:1512: error: too many arguments to function 're_node_set_insert'
regcomp.c: At top level:
regcomp.c:1526: error: expected '=', ',', ';', 'asm' or '__attribute__' before 'search_duplicated_node'
regcomp.c:1544: error: expected '=', ',', ';', 'asm' or '__attribute__' before 'duplicate_node'
regcomp.c: In function 'calc_inveclosure':
regcomp.c:1563: error: expected ';' before 'src'
regcomp.c:1565: error: 'idx' undeclared (first use in this function)
regcomp.c:1565: error: 're_dfa_t' has no member named 'nodes_len'
regcomp.c:1566: error: 're_dfa_t' has no member named 'inveclosures'
regcomp.c:1568: error: 'src' undeclared (first use in this function)
regcomp.c:1568: error: 're_dfa_t' has no member named 'nodes_len'
regcomp.c:1570: error: 'elems' undeclared (first use in this function)
regcomp.c:1570: error: 're_dfa_t' has no member named 'eclosures'
regcomp.c:1571: error: 're_dfa_t' has no member named 'eclosures'
regcomp.c:1573: error: 're_dfa_t' has no member named 'inveclosures'
regcomp.c:1573: error: too many arguments to function 're_node_set_insert_last'
regcomp.c: In function 'calc_eclosure':
regcomp.c:1587: error: expected ';' before 'node_idx'
regcomp.c:1594: error: 'node_idx' undeclared (first use in this function)
regcomp.c:1598: error: 're_dfa_t' has no member named 'nodes_len'
regcomp.c:1611: error: 're_dfa_t' has no member named 'eclosures'
regcomp.c:1614: error: too many arguments to function 'calc_eclosure_iter'
regcomp.c:1618: error: 're_dfa_t' has no member named 'eclosures'
regcomp.c:1621: error: 're_node_set' has no member named 'elems'
regcomp.c: At top level:
regcomp.c:1630: error: expected declaration specifiers or '...' before 'Idx'
regcomp.c: In function 'calc_eclosure_iter':
regcomp.c:1634: error: expected ';' before 'i'
regcomp.c:1639: error: 're_dfa_t' has no member named 'edests'
regcomp.c:1639: error: 'node' undeclared (first use in this function)
regcomp.c:1639: error: too many arguments to function 're_node_set_alloc'
regcomp.c:1645: error: 're_dfa_t' has no member named 'eclosures'
regcomp.c:1652: error: 're_dfa_t' has no member named 'edests'
regcomp.c:1653: error: 're_dfa_t' has no member named 'edests'
regcomp.c:1655: error: expected ';' before 'org_node'
regcomp.c:1656: error: 'org_node' undeclared (first use in this function)
regcomp.c:1656: error: 'cur_node' undeclared (first use in this function)
regcomp.c:1657: error: too many arguments to function 'duplicate_node_closure'
regcomp.c:1664: error: 'i' undeclared (first use in this function)
regcomp.c:1664: error: 're_dfa_t' has no member named 'edests'
regcomp.c:1667: error: expected ';' before 'edest'
regcomp.c:1670: error: 're_dfa_t' has no member named 'eclosures'
regcomp.c:1670: error: 'edest' undeclared (first use in this function)
regcomp.c:1677: error: 're_dfa_t' has no member named 'eclosures'
regcomp.c:1679: error: too many arguments to function 'calc_eclosure_iter'
regcomp.c:1684: error: 're_dfa_t' has no member named 'eclosures'
regcomp.c:1689: error: 're_dfa_t' has no member named 'eclosures'
regcomp.c:1692: error: 're_node_set' has no member named 'elems'
regcomp.c:1697: error: too many arguments to function 're_node_set_insert'
regcomp.c:1701: error: 're_dfa_t' has no member named 'eclosures'
regcomp.c:1703: error: 're_dfa_t' has no member named 'eclosures'
regcomp.c: In function 'fetch_token':
regcomp.c:1716: error: 're_string_t' has no member named 'cur_idx'
regcomp.c: In function 'peek_token':
regcomp.c:1727: error: 're_string_t' has no member named 'stop'
regcomp.c:1727: error: 're_string_t' has no member named 'cur_idx'
regcomp.c:1733: error: 're_string_t' has no member named 'cur_idx'
regcomp.c:1739: error: 're_string_t' has no member named 'mb_cur_max'
regcomp.c:1740: error: 're_string_t' has no member named 'cur_idx'
regcomp.c:1740: error: 're_string_t' has no member named 'valid_len'
regcomp.c:1740: error: 're_string_t' has no member named 'cur_idx'
regcomp.c:1750: error: 're_string_t' has no member named 'cur_idx'
regcomp.c:1750: error: 're_string_t' has no member named 'len'
regcomp.c:1756: error: too many arguments to function 're_string_peek_byte_case'
regcomp.c:1760: error: 're_string_t' has no member named 'mb_cur_max'
regcomp.c:1763: error: 're_string_t' has no member named 'cur_idx'
regcomp.c:1763: error: too many arguments to function 're_string_wchar_at'
regcomp.c:1773: error: 'REG_LIMITED_OPS' undeclared (first use in this function)
regcomp.c:1773: error: 'REG_NO_BK_VBAR' undeclared (first use in this function)
regcomp.c:1778: error: 'REG_NO_BK_REFS' undeclared (first use in this function)
regcomp.c:1781: error: 'union <anonymous>' has no member named 'idx'
regcomp.c:1785: error: 'REG_NO_GNU_OPS' undeclared (first use in this function)
regcomp.c:1788: error: 'union <anonymous>' has no member named 'ctx_type'
regcomp.c:1795: error: 'union <anonymous>' has no member named 'ctx_type'
regcomp.c:1802: error: 'union <anonymous>' has no member named 'ctx_type'
regcomp.c:1809: error: 'union <anonymous>' has no member named 'ctx_type'
regcomp.c:1832: error: 'union <anonymous>' has no member named 'ctx_type'
regcomp.c:1839: error: 'union <anonymous>' has no member named 'ctx_type'
regcomp.c:1843: error: 'REG_NO_BK_PARENS' undeclared (first use in this function)
regcomp.c:1851: error: 'REG_BK_PLUS_QM' undeclared (first use in this function)
regcomp.c:1859: error: 'REG_INTERVALS' undeclared (first use in this function)
regcomp.c:1859: error: 'REG_NO_BK_BRACES' undeclared (first use in this function)
regcomp.c:1874: error: 're_string_t' has no member named 'mb_cur_max'
regcomp.c:1876: error: 're_string_t' has no member named 'cur_idx'
regcomp.c:1876: error: too many arguments to function 're_string_wchar_at'
regcomp.c:1886: error: 'REG_NEWLINE_ALT' undeclared (first use in this function)
regcomp.c:1927: error: 'REG_CONTEXT_INDEP_ANCHORS' undeclared (first use in this function)
regcomp.c:1927: error: 'REG_CARET_ANCHORS_HERE' undeclared (first use in this function)
regcomp.c:1928: error: 're_string_t' has no member named 'cur_idx'
regcomp.c:1930: error: 're_string_t' has no member named 'cur_idx'
regcomp.c:1935: error: 'union <anonymous>' has no member named 'ctx_type'
regcomp.c:1939: error: 're_string_t' has no member named 'cur_idx'
regcomp.c:1939: error: 're_string_t' has no member named 'len'
regcomp.c:1942: error: 're_string_t' has no member named 'cur_idx'
regcomp.c:1944: error: 're_string_t' has no member named 'cur_idx'
regcomp.c:1949: error: 'union <anonymous>' has no member named 'ctx_type'
regcomp.c: In function 'peek_token_bracket':
regcomp.c:1964: error: 're_string_t' has no member named 'stop'
regcomp.c:1964: error: 're_string_t' has no member named 'cur_idx'
regcomp.c:1969: error: 're_string_t' has no member named 'cur_idx'
regcomp.c:1973: error: 're_string_t' has no member named 'mb_cur_max'
regcomp.c:1974: error: 're_string_t' has no member named 'cur_idx'
regcomp.c:1974: error: 're_string_t' has no member named 'valid_len'
regcomp.c:1974: error: 're_string_t' has no member named 'cur_idx'
regcomp.c:1981: error: 'REG_BACKSLASH_ESCAPE_IN_LISTS' undeclared (first use in this function)
regcomp.c:1982: error: 're_string_t' has no member named 'cur_idx'
regcomp.c:1982: error: 're_string_t' has no member named 'len'
regcomp.c:1986: error: 're_string_t' has no member named 'cur_idx'
regcomp.c:1987: error: 're_string_t' has no member named 'cur_idx'
regcomp.c:1996: error: 're_string_t' has no member named 'cur_idx'
regcomp.c:1996: error: 're_string_t' has no member named 'len'
regcomp.c:1997: error: 're_string_t' has no member named 'cur_idx'
regcomp.c:2011: error: 'REG_CHAR_CLASSES' undeclared (first use in this function)
regcomp.c: In function 'parse':
regcomp.c:2060: error: 'regex_t' has no member named 're_buffer'
regcomp.c:2063: error: 're_dfa_t' has no member named 'syntax'
regcomp.c:2064: error: 'REG_CARET_ANCHORS_HERE' undeclared (first use in this function)
regcomp.c:2065: error: too many arguments to function 'parse_reg_exp'
regcomp.c: At top level:
regcomp.c:2092: error: expected declaration specifiers or '...' before 'Idx'
regcomp.c: In function 'parse_reg_exp':
regcomp.c:2094: error: 'regex_t' has no member named 're_buffer'
regcomp.c:2096: error: 'nest' undeclared (first use in this function)
regcomp.c:2096: error: too many arguments to function 'parse_branch'
regcomp.c:2102: error: 'REG_CARET_ANCHORS_HERE' undeclared (first use in this function)
regcomp.c:2106: error: too many arguments to function 'parse_branch'
regcomp.c: At top level:
regcomp.c:2133: error: expected declaration specifiers or '...' before 'Idx'
regcomp.c: In function 'parse_branch':
regcomp.c:2136: error: 'regex_t' has no member named 're_buffer'
regcomp.c:2137: error: 'nest' undeclared (first use in this function)
regcomp.c:2137: error: too many arguments to function 'parse_expression'
regcomp.c:2144: error: too many arguments to function 'parse_expression'
regcomp.c: At top level:
regcomp.c:2173: error: expected declaration specifiers or '...' before 'Idx'
regcomp.c: In function 'parse_expression':
regcomp.c:2175: error: 'regex_t' has no member named 're_buffer'
regcomp.c:2187: error: 're_dfa_t' has no member named 'mb_cur_max'
regcomp.c:2189: error: 're_string_t' has no member named 'stop'
regcomp.c:2189: error: 're_string_t' has no member named 'cur_idx'
regcomp.c:2190: error: 're_string_t' has no member named 'cur_idx'
regcomp.c:2190: error: 're_string_t' has no member named 'valid_len'
regcomp.c:2190: error: 're_string_t' has no member named 'cur_idx'
regcomp.c:2206: error: 'nest' undeclared (first use in this function)
regcomp.c:2206: error: too many arguments to function 'parse_sub_exp'
regcomp.c:2216: error: 're_dfa_t' has no member named 'completed_bkref_map'
regcomp.c:2216: error: 'union <anonymous>' has no member named 'idx'
regcomp.c:2221: error: 're_dfa_t' has no member named 'used_bkref_map'
regcomp.c:2221: error: 'union <anonymous>' has no member named 'idx'
regcomp.c:2228: error: 're_dfa_t' has no member named 'nbackref'
regcomp.c:2229: error: 're_dfa_t' has no member named 'has_mb_node'
regcomp.c:2232: error: 'REG_CONTEXT_INVALID_DUP' undeclared (first use in this function)
regcomp.c:2241: error: 'REG_CONTEXT_INVALID_OPS' undeclared (first use in this function)
regcomp.c:2246: error: 'REG_CONTEXT_INDEP_OPS' undeclared (first use in this function)
regcomp.c:2249: error: too many arguments to function 'parse_expression'
regcomp.c:2254: error: 'REG_UNMATCHED_RIGHT_PAREN_ORD' undeclared (first use in this function)
regcomp.c:2275: error: 'union <anonymous>' has no member named 'ctx_type'
regcomp.c:2277: error: 're_dfa_t' has no member named 'word_ops_used'
regcomp.c:2279: error: 'union <anonymous>' has no member named 'ctx_type'
regcomp.c:2280: error: 'union <anonymous>' has no member named 'ctx_type'
regcomp.c:2283: error: 'union <anonymous>' has no member named 'ctx_type'
regcomp.c:2285: error: 'union <anonymous>' has no member named 'ctx_type'
regcomp.c:2287: error: 'union <anonymous>' has no member named 'ctx_type'
regcomp.c:2291: error: 'union <anonymous>' has no member named 'ctx_type'
regcomp.c:2293: error: 'union <anonymous>' has no member named 'ctx_type'
regcomp.c:2325: error: 're_dfa_t' has no member named 'mb_cur_max'
regcomp.c:2326: error: 're_dfa_t' has no member named 'has_mb_node'
regcomp.c:2330: error: 're_string_t' has no member named 'trans'
regcomp.c:2333: warning: assignment makes pointer from integer without a cast
regcomp.c:2339: error: 're_string_t' has no member named 'trans'
regcomp.c:2342: warning: assignment makes pointer from integer without a cast
regcomp.c: At top level:
regcomp.c:2389: error: expected declaration specifiers or '...' before 'Idx'
regcomp.c: In function 'parse_sub_exp':
regcomp.c:2391: error: 'regex_t' has no member named 're_buffer'
regcomp.c:2396: error: 'REG_CARET_ANCHORS_HERE' undeclared (first use in this function)
regcomp.c:2403: error: 'nest' undeclared (first use in this function)
regcomp.c:2403: error: too many arguments to function 'parse_reg_exp'
regcomp.c:2411: error: 're_dfa_t' has no member named 'completed_bkref_map'
regcomp.c:2419: error: 'union <anonymous>' has no member named 'idx'
regcomp.c: In function 'parse_dup_op':
regcomp.c:2430: error: expected ';' before 'i'
regcomp.c:2435: error: 'end' undeclared (first use in this function)
regcomp.c:2436: error: 'start' undeclared (first use in this function)
regcomp.c:2457: error: 'REG_INVALID_INTERVAL_ORD' undeclared (first use in this function)
regcomp.c:2468: error: 're_string_t' has no member named 'cur_idx'
regcomp.c:2468: error: 'start_idx' undeclared (first use in this function)
regcomp.c:2503: error: 'i' undeclared (first use in this function)
regcomp.c:2522: error: 'union <anonymous>' has no member named 'idx'
regcomp.c: At top level:
regcomp.c:2570: error: expected declaration specifiers or '...' before 'Idx'
regcomp.c: In function 'build_range_exp':
regcomp.c:2620: error: 'range_alloc' undeclared (first use in this function)
regcomp.c:2620: error: 're_charset_t' has no member named 'nranges'
regcomp.c:2624: error: expected ';' before 'new_nranges'
regcomp.c:2626: error: 'new_nranges' undeclared (first use in this function)
regcomp.c:2626: error: 're_charset_t' has no member named 'nranges'
regcomp.c:2642: error: 're_charset_t' has no member named 'nranges'
regcomp.c:2643: error: 're_charset_t' has no member named 'nranges'
regcomp.c:2652: error: too many arguments to function 'bitset_set'
regcomp.c: At top level:
regcomp.c:2686: error: expected declaration specifiers or '...' before 'Idx'
regcomp.c: In function 'build_collating_symbol':
regcomp.c:2695: error: too many arguments to function 'bitset_set'
regcomp.c: In function 'parse_bracket_exp':
regcomp.c:2960: error: expected ';' before 'coll_sym_alloc'
regcomp.c:2961: error: expected ';' before 'equiv_class_alloc'
regcomp.c:3010: error: 'REG_HAT_LISTS_NOT_NEWLINE' undeclared (first use in this function)
regcomp.c:3011: error: too many arguments to function 'bitset_set'
regcomp.c:3012: error: 're_string_t' has no member named 'cur_idx'
regcomp.c:3058: error: 're_string_t' has no member named 'cur_idx'
regcomp.c:3068: error: 're_string_t' has no member named 'cur_idx'
regcomp.c:3095: error: 're_dfa_t' has no member named 'mb_cur_max'
regcomp.c:3096: error: 'range_alloc' undeclared (first use in this function)
regcomp.c:3096: error: too many arguments to function 'build_range_exp'
regcomp.c:3109: error: too many arguments to function 'bitset_set'
regcomp.c:3114: error: 'mbchar_alloc' undeclared (first use in this function)
regcomp.c:3114: error: 're_charset_t' has no member named 'nmbchars'
regcomp.c:3118: error: 're_charset_t' has no member named 'nmbchars'
regcomp.c:3126: error: 're_charset_t' has no member named 'nmbchars'
regcomp.c:3132: error: 'equiv_class_alloc' undeclared (first use in this function)
regcomp.c:3134: error: too many arguments to function 'build_equiv_class'
regcomp.c:3141: error: 'coll_sym_alloc' undeclared (first use in this function)
regcomp.c:3143: error: too many arguments to function 'build_collating_symbol'
regcomp.c:3148: error: 're_string_t' has no member named 'trans'
regcomp.c:3150: error: 'char_class_alloc' undeclared (first use in this function)
regcomp.c:3170: error: 're_string_t' has no member named 'cur_idx'
regcomp.c:3178: error: 're_dfa_t' has no member named 'mb_cur_max'
regcomp.c:3179: error: 're_dfa_t' has no member named 'sb_char'
regcomp.c:3181: error: 're_charset_t' has no member named 'nmbchars'
regcomp.c:3181: error: 're_charset_t' has no member named 'ncoll_syms'
regcomp.c:3181: error: 're_charset_t' has no member named 'nequiv_classes'
regcomp.c:3182: error: 're_charset_t' has no member named 'nranges'
regcomp.c:3182: error: 're_dfa_t' has no member named 'mb_cur_max'
regcomp.c:3182: error: 're_charset_t' has no member named 'nchar_classes'
regcomp.c:3188: error: 're_dfa_t' has no member named 'has_mb_node'
regcomp.c: In function 'parse_bracket_element':
regcomp.c:3253: error: 're_string_t' has no member named 'cur_idx'
regcomp.c:3253: error: too many arguments to function 're_string_char_size_at'
regcomp.c:3257: error: 're_string_t' has no member named 'cur_idx'
regcomp.c:3257: error: too many arguments to function 're_string_wchar_at'
regcomp.c:3258: error: 're_string_t' has no member named 'cur_idx'
regcomp.c:3262: error: 're_string_t' has no member named 'cur_idx'
regcomp.c: In function 'parse_bracket_symbol':
regcomp.c:3292: error: 're_string_t' has no member named 'stop'
regcomp.c:3292: error: 're_string_t' has no member named 'cur_idx'
regcomp.c:3301: error: 're_string_t' has no member named 'cur_idx'
regcomp.c:3302: error: 're_string_t' has no member named 'stop'
regcomp.c:3302: error: 're_string_t' has no member named 'cur_idx'
regcomp.c:3304: error: 're_string_t' has no member named 'cur_idx'
regcomp.c:3308: error: 're_string_t' has no member named 'cur_idx'
regcomp.c: At top level:
regcomp.c:3336: error: expected declaration specifiers or '...' before 'Idx'
regcomp.c: In function 'build_equiv_class':
regcomp.c:3412: error: too many arguments to function 'bitset_set'
regcomp.c: At top level:
regcomp.c:3424: error: expected ';', ',' or ')' before 'trans'
regcomp.c:3497: error: expected ';', ',' or ')' before 'trans'
regcomp.c:3614: error: expected '=', ',', ';', 'asm' or '__attribute__' before 'fetch_number'
regcomp.c: In function 'create_token_tree':
regcomp.c:3669: error: 're_dfa_t' has no member named 'str_tree_storage_idx'
regcomp.c:3675: error: 're_dfa_t' has no member named 'str_tree_storage'
regcomp.c:3676: error: 're_dfa_t' has no member named 'str_tree_storage'
regcomp.c:3677: error: 're_dfa_t' has no member named 'str_tree_storage_idx'
regcomp.c:3679: error: 're_dfa_t' has no member named 'str_tree_storage'
regcomp.c:3679: error: 're_dfa_t' has no member named 'str_tree_storage_idx'
regcomp.c:3689: error: 'bin_tree_t' has no member named 'node_idx'
regcomp.c: In function 'mark_opt_subexp':
regcomp.c:3704: error: expected ';' before 'idx'
regcomp.c:3705: error: 'union <anonymous>' has no member named 'idx'
regcomp.c:3705: error: 'idx' undeclared (first use in this function)
In file included from regex.c:59:
regexec.c: At top level:
regexec.c:21: error: expected declaration specifiers or '...' before 'Idx'
regexec.c:24: error: expected declaration specifiers or '...' before 'Idx'
regexec.c:25: error: expected declaration specifiers or '...' before 'Idx'
regexec.c:25: error: expected declaration specifiers or '...' before 'Idx'
regexec.c:25: error: expected declaration specifiers or '...' before 'Idx'
regexec.c:27: error: expected '=', ',', ';', 'asm' or '__attribute__' before 'search_cur_bkref_entry'
regexec.c:29: error: expected declaration specifiers or '...' before 'Idx'
regexec.c:30: error: expected declaration specifiers or '...' before 'Idx'
regexec.c:32: error: expected declaration specifiers or '...' before 'Idx'
regexec.c:32: error: expected declaration specifiers or '...' before 'Idx'
regexec.c:35: error: expected declaration specifiers or '...' before 'Idx'
regexec.c:36: error: expected declaration specifiers or '...' before 'Idx'
regexec.c:39: error: expected declaration specifiers or '...' before 'Idx'
regexec.c:40: error: expected declaration specifiers or '...' before 'Idx'
regexec.c:40: error: expected declaration specifiers or '...' before 'Idx'
regexec.c:40: error: expected declaration specifiers or '...' before 'Idx'
regexec.c:44: error: expected declaration specifiers or '...' before 'Idx'
regexec.c:45: error: expected declaration specifiers or '...' before 'Idx'
regexec.c:46: error: expected declaration specifiers or '...' before 'Idx'
regexec.c:48: error: expected declaration specifiers or '...' before 'Idx'
regexec.c:50: error: expected declaration specifiers or '...' before 'Idx'
regexec.c:50: error: expected declaration specifiers or '...' before 'Idx'
regexec.c:51: error: expected declaration specifiers or '...' before 'Idx'
regexec.c:55: error: expected declaration specifiers or '...' before 'Idx'
regexec.c:58: error: expected '=', ',', ';', 'asm' or '__attribute__' before 'check_matching'
regexec.c:61: error: expected '=', ',', ';', 'asm' or '__attribute__' before 'check_halt_state_context'
regexec.c:65: error: expected declaration specifiers or '...' before 'Idx'
regexec.c:66: error: expected declaration specifiers or '...' before 'Idx'
regexec.c:66: error: expected declaration specifiers or '...' before 'Idx'
regexec.c:68: error: expected declaration specifiers or '...' before 'Idx'
regexec.c:68: error: expected declaration specifiers or '...' before 'Idx'
regexec.c:68: error: expected declaration specifiers or '...' before 'Idx'
regexec.c:80: error: expected declaration specifiers or '...' before 'Idx'
regexec.c:80: error: expected declaration specifiers or '...' before 'Idx'
regexec.c:80: error: expected declaration specifiers or '...' before 'Idx'
regexec.c:85: error: expected declaration specifiers or '...' before 'Idx'
regexec.c:89: error: expected declaration specifiers or '...' before 'Idx'
regexec.c:96: error: expected declaration specifiers or '...' before 'Idx'
regexec.c:96: error: expected declaration specifiers or '...' before 'Idx'
regexec.c:96: error: expected declaration specifiers or '...' before 'Idx'
regexec.c:97: error: expected declaration specifiers or '...' before 'Idx'
regexec.c:99: error: expected declaration specifiers or '...' before 'Idx'
regexec.c:100: error: expected declaration specifiers or '...' before 'Idx'
regexec.c:100: error: expected declaration specifiers or '...' before 'Idx'
regexec.c:102: error: expected declaration specifiers or '...' before 'Idx'
regexec.c:102: error: expected declaration specifiers or '...' before 'Idx'
regexec.c:103: error: expected declaration specifiers or '...' before 'Idx'
regexec.c:103: error: expected declaration specifiers or '...' before 'Idx'
regexec.c:104: error: expected declaration specifiers or '...' before 'Idx'
regexec.c:110: error: expected declaration specifiers or '...' before 'Idx'
regexec.c:113: error: expected declaration specifiers or '...' before 'Idx'
regexec.c:115: error: expected declaration specifiers or '...' before 'Idx'
regexec.c:126: error: expected declaration specifiers or '...' before 'Idx'
regexec.c:139: error: expected declaration specifiers or '...' before 'Idx'
regexec.c:139: error: expected declaration specifiers or '...' before 'Idx'
regexec.c:143: error: expected declaration specifiers or '...' before 'Idx'
regexec.c:143: error: expected declaration specifiers or '...' before 'Idx'
regexec.c:144: error: expected '=', ',', ';', 'asm' or '__attribute__' before 'find_subexp_node'
regexec.c:147: error: expected declaration specifiers or '...' before 'Idx'
regexec.c:148: error: expected declaration specifiers or '...' before 'Idx'
regexec.c:148: error: expected declaration specifiers or '...' before 'Idx'
regexec.c:148: error: expected declaration specifiers or '...' before 'Idx'
regexec.c:151: error: expected declaration specifiers or '...' before 'Idx'
regexec.c:156: error: expected declaration specifiers or '...' before 'Idx'
regexec.c:159: error: expected declaration specifiers or '...' before 'Idx'
regexec.c:159: error: expected declaration specifiers or '...' before 'Idx'
regexec.c:162: error: expected declaration specifiers or '...' before 'Idx'
regexec.c:163: error: expected declaration specifiers or '...' before 'Idx'
regexec.c:167: error: expected declaration specifiers or '...' before 'Idx'
regexec.c:168: error: expected declaration specifiers or '...' before 'Idx'
regexec.c:174: error: expected '=', ',', ';', 'asm' or '__attribute__' before 'group_nodes_into_DFAstates'
regexec.c:179: error: expected declaration specifiers or '...' before 'Idx'
regexec.c: In function 'rpl_regexec':
regexec.c:204: error: expected ';' before 'start'
regexec.c:214: error: 'start' undeclared (first use in this function)
regexec.c:215: error: 'length' undeclared (first use in this function)
regexec.c:224: error: 'regex_t' has no member named 're_no_sub'
regexec.c:226: error: too many arguments to function 're_search_internal'
regexec.c:229: error: too many arguments to function 're_search_internal'
regexec.c: At top level:
regexec.c:285: error: expected declaration specifiers or '...' before 'Idx'
regexec.c:285: error: expected declaration specifiers or '...' before 'Idx'
regexec.c:286: error: conflicting types for 'rpl_re_match'
/usr/include/regex.h:489: error: previous declaration of 'rpl_re_match' was here
regexec.c: In function 'rpl_re_match':
regexec.c:287: error: 'length' undeclared (first use in this function)
regexec.c:287: error: 'start' undeclared (first use in this function)
regexec.c:287: error: too many arguments to function 're_search_stub'
regexec.c: At top level:
regexec.c:295: error: expected declaration specifiers or '...' before 'Idx'
regexec.c:295: error: expected declaration specifiers or '...' before 'Idx'
regexec.c:296: error: conflicting types for 'rpl_re_search'
/usr/include/regex.h:475: error: previous declaration of 'rpl_re_search' was here
regexec.c: In function 'rpl_re_search':
regexec.c:297: error: 'length' undeclared (first use in this function)
regexec.c:297: error: 'start' undeclared (first use in this function)
regexec.c:298: error: too many arguments to function 're_search_stub'
regexec.c: At top level:
regexec.c:306: error: expected declaration specifiers or '...' before 'Idx'
regexec.c:307: error: expected declaration specifiers or '...' before 'Idx'
regexec.c:308: error: expected declaration specifiers or '...' before 'Idx'
regexec.c:308: error: expected declaration specifiers or '...' before 'Idx'
regexec.c:309: error: conflicting types for 'rpl_re_match_2'
/usr/include/regex.h:496: error: previous declaration of 'rpl_re_match_2' was here
regexec.c: In function 'rpl_re_match_2':
regexec.c:310: error: 'length1' undeclared (first use in this function)
regexec.c:310: error: 'length2' undeclared (first use in this function)
regexec.c:311: error: 'start' undeclared (first use in this function)
regexec.c:311: error: 'stop' undeclared (first use in this function)
regexec.c:311: warning: passing argument 4 of 're_search_2_stub' makes integer from pointer without a cast
regexec.c:311: error: too many arguments to function 're_search_2_stub'
regexec.c: At top level:
regexec.c:319: error: expected declaration specifiers or '...' before 'Idx'
regexec.c:320: error: expected declaration specifiers or '...' before 'Idx'
regexec.c:321: error: expected declaration specifiers or '...' before 'Idx'
regexec.c:321: error: expected declaration specifiers or '...' before 'Idx'
regexec.c:322: error: conflicting types for 'rpl_re_search_2'
/usr/include/regex.h:483: error: previous declaration of 'rpl_re_search_2' was here
regexec.c: In function 'rpl_re_search_2':
regexec.c:323: error: 'length1' undeclared (first use in this function)
regexec.c:323: error: 'length2' undeclared (first use in this function)
regexec.c:324: error: 'start' undeclared (first use in this function)
regexec.c:324: error: 'stop' undeclared (first use in this function)
regexec.c:324: warning: passing argument 4 of 're_search_2_stub' makes integer from pointer without a cast
regexec.c:324: error: too many arguments to function 're_search_2_stub'
regexec.c: At top level:
regexec.c:333: error: expected declaration specifiers or '...' before 'Idx'
regexec.c:334: error: expected declaration specifiers or '...' before 'Idx'
regexec.c:335: error: expected declaration specifiers or '...' before 'Idx'
regexec.c:336: error: expected declaration specifiers or '...' before 'Idx'
regexec.c: In function 're_search_2_stub':
regexec.c:340: error: expected ';' before 'len'
regexec.c:343: error: 'length1' undeclared (first use in this function)
regexec.c:343: error: 'length2' undeclared (first use in this function)
regexec.c:343: error: 'stop' undeclared (first use in this function)
regexec.c:343: error: 'len' undeclared (first use in this function)
regexec.c:363: error: 'start' undeclared (first use in this function)
regexec.c:364: error: too many arguments to function 're_search_stub'
regexec.c: At top level:
regexec.c:377: error: expected declaration specifiers or '...' before 'Idx'
regexec.c:378: error: expected declaration specifiers or '...' before 'Idx'
regexec.c:378: error: expected declaration specifiers or '...' before 'Idx'
regexec.c: In function 're_search_stub':
regexec.c:383: error: expected ';' before 'nregs'
regexec.c:389: error: expected ';' before 'last_start'
regexec.c:392: error: 'start' undeclared (first use in this function)
regexec.c:392: error: 'length' undeclared (first use in this function)
regexec.c:399: error: 'last_start' undeclared (first use in this function)
regexec.c:422: error: 'struct re_pattern_buffer' has no member named 're_not_bol'
regexec.c:423: error: 'struct re_pattern_buffer' has no member named 're_not_eol'
regexec.c:426: error: 'struct re_pattern_buffer' has no member named 're_fastmap'
regexec.c:427: error: 'struct re_pattern_buffer' has no member named 're_fastmap_accurate'
regexec.c:430: error: 'struct re_pattern_buffer' has no member named 're_no_sub'
regexec.c:435: error: 'nregs' undeclared (first use in this function)
regexec.c:436: error: 'struct re_pattern_buffer' has no member named 're_regs_allocated'
regexec.c:436: error: 'REG_FIXED' undeclared (first use in this function)
regexec.c:436: error: 'struct re_registers' has no member named 'rm_num_regs'
regexec.c:439: error: 'struct re_registers' has no member named 'rm_num_regs'
regexec.c:456: error: 'stop' undeclared (first use in this function)
regexec.c:457: error: too many arguments to function 're_search_internal'
regexec.c:467: error: 'struct re_pattern_buffer' has no member named 're_regs_allocated'
regexec.c:468: error: 'struct re_pattern_buffer' has no member named 're_regs_allocated'
regexec.c:468: error: too many arguments to function 're_copy_regs'
regexec.c:469: error: 'struct re_pattern_buffer' has no member named 're_regs_allocated'
regexec.c:469: error: 'REG_UNALLOCATED' undeclared (first use in this function)
regexec.c: At top level:
regexec.c:491: error: expected declaration specifiers or '...' before 'Idx'
regexec.c: In function 're_copy_regs':
regexec.c:494: error: 'REG_REALLOCATE' undeclared (first use in this function)
regexec.c:495: error: expected ';' before 'i'
regexec.c:496: error: expected ';' before 'need_regs'
regexec.c:501: error: 'REG_UNALLOCATED' undeclared (first use in this function)
regexec.c:503: error: 'struct re_registers' has no member named 'rm_start'
regexec.c:503: error: 'need_regs' undeclared (first use in this function)
regexec.c:504: error: 'struct re_registers' has no member named 'rm_end'
regexec.c:505: error: 'struct re_registers' has no member named 'rm_start'
regexec.c:505: error: 'struct re_registers' has no member named 'rm_end'
regexec.c:507: error: 'struct re_registers' has no member named 'rm_num_regs'
regexec.c:513: error: 'struct re_registers' has no member named 'rm_num_regs'
regexec.c:516: error: 'struct re_registers' has no member named 'rm_start'
regexec.c:517: error: 'struct re_registers' has no member named 'rm_end'
regexec.c:520: error: 'struct re_registers' has no member named 'rm_start'
regexec.c:521: error: 'struct re_registers' has no member named 'rm_end'
regexec.c:522: error: 'struct re_registers' has no member named 'rm_num_regs'
regexec.c:527: error: 'REG_FIXED' undeclared (first use in this function)
regexec.c:529: error: 'struct re_registers' has no member named 'rm_num_regs'
regexec.c:529: error: 'nregs' undeclared (first use in this function)
regexec.c:534: error: 'i' undeclared (first use in this function)
regexec.c:536: error: 'struct re_registers' has no member named 'rm_start'
regexec.c:537: error: 'struct re_registers' has no member named 'rm_end'
regexec.c:539: error: 'struct re_registers' has no member named 'rm_num_regs'
regexec.c:540: error: 'struct re_registers' has no member named 'rm_start'
regexec.c:540: error: 'struct re_registers' has no member named 'rm_end'
regexec.c: At top level:
regexec.c:560: error: expected declaration specifiers or '...' before '__re_size_t'
regexec.c:561: error: conflicting types for 'rpl_re_set_registers'
/usr/include/regex.h:514: error: previous declaration of 'rpl_re_set_registers' was here
regexec.c: In function 'rpl_re_set_registers':
regexec.c:562: error: 'num_regs' undeclared (first use in this function)
regexec.c:564: error: 'struct re_pattern_buffer' has no member named 're_regs_allocated'
regexec.c:564: error: 'REG_REALLOCATE' undeclared (first use in this function)
regexec.c:565: error: 'struct re_registers' has no member named 'rm_num_regs'
regexec.c:566: error: 'struct re_registers' has no member named 'rm_start'
regexec.c:567: error: 'struct re_registers' has no member named 'rm_end'
regexec.c:571: error: 'struct re_pattern_buffer' has no member named 're_regs_allocated'
regexec.c:571: error: 'REG_UNALLOCATED' undeclared (first use in this function)
regexec.c:572: error: 'struct re_registers' has no member named 'rm_num_regs'
regexec.c:573: error: 'struct re_registers' has no member named 'rm_start'
regexec.c:573: error: 'struct re_registers' has no member named 'rm_end'
regexec.c: At top level:
regexec.c:608: error: expected declaration specifiers or '...' before 'Idx'
regexec.c:609: error: expected declaration specifiers or '...' before 'Idx'
regexec.c:609: error: expected declaration specifiers or '...' before 'Idx'
regexec.c:609: error: expected declaration specifiers or '...' before 'Idx'
regexec.c: In function 're_search_internal':
regexec.c:614: error: 'regex_t' has no member named 're_buffer'
regexec.c:615: error: expected ';' before 'left_lim'
regexec.c:619: error: expected ';' before 'match_first'
regexec.c:620: error: expected ';' before 'extra_nmatch'
regexec.c:628: error: 'regex_t' has no member named 're_fastmap'
regexec.c:628: error: 'regex_t' has no member named 're_fastmap_accurate'
regexec.c:629: error: 'start' undeclared (first use in this function)
regexec.c:629: error: 'last_start' undeclared (first use in this function)
regexec.c:629: error: 'regex_t' has no member named 're_can_be_null'
regexec.c:630: error: 'regex_t' has no member named 're_fastmap'
regexec.c:631: error: expected '=', ',', ';', 'asm' or '__attribute__' before 't'
regexec.c:631: error: 't' undeclared (first use in this function)
regexec.c:632: error: 'regex_t' has no member named 're_translate'
regexec.c:639: error: 'extra_nmatch' undeclared (first use in this function)
regexec.c:643: error: 'regex_t' has no member named 're_used'
regexec.c:643: error: 're_dfa_t' has no member named 'init_state'
regexec.c:643: error: 're_dfa_t' has no member named 'init_state_word'
regexec.c:643: error: 're_dfa_t' has no member named 'init_state_nl'
regexec.c:643: error: 're_dfa_t' has no member named 'init_state_begbuf'
regexec.c:656: error: 're_dfa_t' has no member named 'init_state'
regexec.c:657: error: 're_dfa_t' has no member named 'init_state_word'
regexec.c:658: error: 're_dfa_t' has no member named 'init_state_nl'
regexec.c:659: error: 'regex_t' has no member named 're_newline_anchor'
regexec.c:667: error: 're_dfa_t' has no member named 'nbackref'
regexec.c:669: error: 'length' undeclared (first use in this function)
regexec.c:669: error: 're_dfa_t' has no member named 'nodes_len'
regexec.c:670: error: 'regex_t' has no member named 're_translate'
regexec.c:671: error: 'regex_t' has no member named 're_syntax'
regexec.c:671: error: 'REG_IGNORE_CASE' undeclared (first use in this function)
regexec.c:671: error: too many arguments to function 're_string_allocate'
regexec.c:674: error: 're_string_t' has no member named 'stop'
regexec.c:674: error: 'stop' undeclared (first use in this function)
regexec.c:675: error: 're_string_t' has no member named 'raw_stop'
regexec.c:676: error: 're_string_t' has no member named 'newline_anchor'
regexec.c:676: error: 'regex_t' has no member named 're_newline_anchor'
regexec.c:678: error: 're_dfa_t' has no member named 'nbackref'
regexec.c:678: error: too many arguments to function 'match_ctx_init'
regexec.c:686: error: 're_dfa_t' has no member named 'has_mb_node'
regexec.c:688: error: 're_match_context_t' has no member named 'state_log'
regexec.c:688: error: 're_string_t' has no member named 'bufs_len'
regexec.c:689: error: 're_match_context_t' has no member named 'state_log'
regexec.c:696: error: 're_match_context_t' has no member named 'state_log'
regexec.c:698: error: 'match_first' undeclared (first use in this function)
regexec.c:699: error: 're_string_t' has no member named 'tip_context'
regexec.c:704: error: 'left_lim' undeclared (first use in this function)
regexec.c:705: error: 'right_lim' undeclared (first use in this function)
regexec.c:706: error: 're_dfa_t' has no member named 'mb_cur_max'
regexec.c:709: error: 'regex_t' has no member named 're_syntax'
regexec.c:777: error: '__re_size_t' undeclared (first use in this function)
regexec.c:777: error: expected ';' before 'offset'
regexec.c:778: error: 'offset' undeclared (first use in this function)
regexec.c:778: error: expected ')' before 'mctx'
regexec.c:778: error: too few arguments to function '__builtin_expect'
regexec.c:781: error: too many arguments to function 're_string_reconstruct'
regexec.c:785: error: 're_string_t' has no member named 'raw_mbs_idx'
regexec.c:805: error: too many arguments to function 're_string_reconstruct'
regexec.c:812: error: 're_string_t' has no member named 'valid_len'
regexec.c:818: error: 're_match_context_t' has no member named 'state_log_top'
regexec.c:818: error: 're_match_context_t' has no member named 'nbkref_ents'
regexec.c:818: error: 're_match_context_t' has no member named 'max_mb_elem_len'
regexec.c:819: error: 'match_last' undeclared (first use in this function)
regexec.c:830: error: 're_match_context_t' has no member named 'match_last'
regexec.c:831: error: 'regex_t' has no member named 're_no_sub'
regexec.c:831: error: 're_dfa_t' has no member named 'nbackref'
regexec.c:833: error: 're_match_context_t' has no member named 'state_log'
regexec.c:834: error: 're_match_context_t' has no member named 'last_node'
regexec.c:837: error: 'regex_t' has no member named 're_no_sub'
regexec.c:837: error: 're_dfa_t' has no member named 'has_plural_match'
regexec.c:838: error: 're_dfa_t' has no member named 'nbackref'
regexec.c:863: error: expected ';' before 'reg_idx'
regexec.c:866: error: 'reg_idx' undeclared (first use in this function)
regexec.c:871: error: 're_match_context_t' has no member named 'match_last'
regexec.c:876: error: 'regex_t' has no member named 're_no_sub'
regexec.c:879: error: 're_dfa_t' has no member named 'has_plural_match'
regexec.c:879: error: 're_dfa_t' has no member named 'nbackref'
regexec.c:891: error: 're_string_t' has no member named 'offsets_needed'
regexec.c:894: error: 're_string_t' has no member named 'valid_len'
regexec.c:895: error: 're_string_t' has no member named 'valid_raw_len'
regexec.c:896: error: 're_string_t' has no member named 'offsets'
regexec.c:898: error: 're_string_t' has no member named 'valid_len'
regexec.c:899: error: 're_string_t' has no member named 'valid_raw_len'
regexec.c:900: error: 're_string_t' has no member named 'offsets'
regexec.c:914: error: 're_dfa_t' has no member named 'subexp_map'
regexec.c:916: error: 're_dfa_t' has no member named 'subexp_map'
regexec.c:919: error: 're_dfa_t' has no member named 'subexp_map'
regexec.c:921: error: 're_dfa_t' has no member named 'subexp_map'
regexec.c:926: error: 're_match_context_t' has no member named 'state_log'
regexec.c:927: error: 're_dfa_t' has no member named 'nbackref'
regexec.c: In function 'prune_impossible_nodes':
regexec.c:938: error: expected ';' before 'halt_node'
regexec.c:946: error: 'match_last' undeclared (first use in this function)
regexec.c:946: error: 're_match_context_t' has no member named 'match_last'
regexec.c:947: error: 'halt_node' undeclared (first use in this function)
regexec.c:947: error: 're_match_context_t' has no member named 'last_node'
regexec.c:954: error: 're_dfa_t' has no member named 'nbackref'
regexec.c:967: error: too many arguments to function 'sift_ctx_init'
regexec.c:969: error: 're_sift_context_t' has no member named 'limits'
regexec.c:977: error: called object 'Idx' is not a function
regexec.c:982: error: 're_match_context_t' has no member named 'state_log'
regexec.c:983: error: 're_match_context_t' has no member named 'state_log'
regexec.c:985: error: 're_match_context_t' has no member named 'state_log'
regexec.c:989: error: too many arguments to function 'merge_state_array'
regexec.c:997: error: too many arguments to function 'sift_ctx_init'
regexec.c:999: error: 're_sift_context_t' has no member named 'limits'
regexec.c:1003: error: 're_match_context_t' has no member named 'state_log'
regexec.c:1004: error: 're_match_context_t' has no member named 'state_log'
regexec.c:1006: error: 're_match_context_t' has no member named 'last_node'
regexec.c:1007: error: 're_match_context_t' has no member named 'match_last'
regexec.c: At top level:
regexec.c:1022: error: expected declaration specifiers or '...' before 'Idx'
regexec.c: In function 'acquire_init_state_context':
regexec.c:1025: error: 're_dfa_t' has no member named 'init_state'
regexec.c:1028: error: 'idx' undeclared (first use in this function)
regexec.c:1028: error: too many arguments to function 're_string_context_at'
regexec.c:1030: error: 're_dfa_t' has no member named 'init_state_word'
regexec.c:1032: error: 're_dfa_t' has no member named 'init_state'
regexec.c:1034: error: 're_dfa_t' has no member named 'init_state_begbuf'
regexec.c:1036: error: 're_dfa_t' has no member named 'init_state_nl'
regexec.c:1041: error: 're_dfa_t' has no member named 'init_state'
regexec.c:1046: error: 're_dfa_t' has no member named 'init_state'
regexec.c:1049: error: 're_dfa_t' has no member named 'init_state'
regexec.c: At top level:
regexec.c:1063: warning: 'regparm' attribute only applies to function types
regexec.c:1063: warning: 'stdcall' attribute only applies to function types
regexec.c:1063: error: expected ',' or ';' before 'check_matching'
regexec.c:1195: error: expected declaration specifiers or '...' before 'Idx'
regexec.c: In function 'check_halt_node_context':
regexec.c:1197: error: 'node' undeclared (first use in this function)
regexec.c: At top level:
regexec.c:1214: warning: 'regparm' attribute only applies to function types
regexec.c:1214: warning: 'stdcall' attribute only applies to function types
regexec.c:1214: error: expected ',' or ';' before 'check_halt_state_context'
regexec.c:1236: warning: 'regparm' attribute only applies to function types
regexec.c:1236: warning: 'stdcall' attribute only applies to function types
regexec.c:1236: error: expected ',' or ';' before 'proceed_next_node'
regexec.c:1338: error: expected declaration specifiers or '...' before 'Idx'
regexec.c:1338: error: expected declaration specifiers or '...' before 'Idx'
regexec.c:1339: error: expected declaration specifiers or '...' before 'Idx'
regexec.c: In function 'push_fail_stack':
regexec.c:1342: error: expected ';' before 'num'
regexec.c:1343: error: 'struct re_fail_stack_t' has no member named 'num'
regexec.c:1343: error: 'struct re_fail_stack_t' has no member named 'alloc'
regexec.c:1346: error: 'struct re_fail_stack_t' has no member named 'stack'
regexec.c:1346: error: 'struct re_fail_stack_t' has no member named 'alloc'
regexec.c:1349: error: 'struct re_fail_stack_t' has no member named 'stack'
regexec.c:1351: error: 'struct re_fail_stack_t' has no member named 'stack'
regexec.c:1351: error: 'num' undeclared (first use in this function)
regexec.c:1351: error: 'str_idx' undeclared (first use in this function)
regexec.c:1352: error: 'struct re_fail_stack_t' has no member named 'stack'
regexec.c:1352: error: 'dest_node' undeclared (first use in this function)
regexec.c:1353: error: 'struct re_fail_stack_t' has no member named 'stack'
regexec.c:1353: error: 'nregs' undeclared (first use in this function)
regexec.c:1354: error: 'struct re_fail_stack_t' has no member named 'stack'
regexec.c:1356: error: 'struct re_fail_stack_t' has no member named 'stack'
regexec.c:1357: error: 'struct re_fail_stack_t' has no member named 'stack'
regexec.c: At top level:
regexec.c:1363: warning: 'regparm' attribute only applies to function types
regexec.c:1363: warning: 'stdcall' attribute only applies to function types
regexec.c:1363: error: expected ',' or ';' before 'pop_fail_stack'
regexec.c: In function 'set_regs':
regexec.c:1386: error: 'regex_t' has no member named 're_buffer'
regexec.c:1387: error: expected ';' before 'idx'
regexec.c:1390: warning: excess elements in struct initializer
regexec.c:1390: warning: (near initialization for 'fs_body')
regexec.c:1390: warning: excess elements in struct initializer
regexec.c:1390: warning: (near initialization for 'fs_body')
regexec.c:1390: warning: excess elements in struct initializer
regexec.c:1390: warning: (near initialization for 'fs_body')
regexec.c:1401: error: 'struct re_fail_stack_t' has no member named 'stack'
regexec.c:1401: error: 'struct re_fail_stack_t' has no member named 'alloc'
regexec.c:1402: error: 'struct re_fail_stack_t' has no member named 'stack'
regexec.c:1408: error: 'cur_node' undeclared (first use in this function)
regexec.c:1408: error: 're_dfa_t' has no member named 'init_node'
regexec.c:1430: error: 'idx' undeclared (first use in this function)
regexec.c:1432: error: too many arguments to function 'update_regs'
regexec.c:1434: error: 're_match_context_t' has no member named 'last_node'
regexec.c:1436: error: expected ';' before 'reg_idx'
regexec.c:1439: error: 'reg_idx' undeclared (first use in this function)
regexec.c:1444: error: 're_node_set' has no member named 'elems'
regexec.c:1454: error: 're_node_set' has no member named 'elems'
regexec.c:1465: error: called object 'Idx' is not a function
regexec.c:1469: error: 're_node_set' has no member named 'elems'
regexec.c:1480: error: 're_node_set' has no member named 'elems'
regexec.c:1487: error: 're_node_set' has no member named 'elems'
regexec.c: In function 'free_fail_stack_return':
regexec.c:1499: error: expected ';' before 'fs_idx'
regexec.c:1500: error: 'fs_idx' undeclared (first use in this function)
regexec.c:1500: error: 'struct re_fail_stack_t' has no member named 'num'
regexec.c:1502: error: 'struct re_fail_stack_t' has no member named 'stack'
regexec.c:1503: error: 'struct re_fail_stack_t' has no member named 'stack'
regexec.c:1505: error: 'struct re_fail_stack_t' has no member named 'stack'
regexec.c: At top level:
regexec.c:1513: error: expected declaration specifiers or '...' before 'Idx'
regexec.c:1513: error: expected declaration specifiers or '...' before 'Idx'
regexec.c:1513: error: expected declaration specifiers or '...' before 'Idx'
regexec.c: In function 'update_regs':
regexec.c:1515: error: 'cur_node' undeclared (first use in this function)
regexec.c:1518: error: expected ';' before 'reg_num'
regexec.c:1521: error: 'reg_num' undeclared (first use in this function)
regexec.c:1521: error: 'nmatch' undeclared (first use in this function)
regexec.c:1523: error: 'cur_idx' undeclared (first use in this function)
regexec.c:1529: error: expected ';' before 'reg_num'
regexec.c: In function 'sift_states_backward':
regexec.c:1588: error: expected ';' before 'str_idx'
regexec.c:1597: error: 're_sift_context_t' has no member named 'last_node'
regexec.c:1597: error: too many arguments to function 're_node_set_init_1'
regexec.c:1600: error: 'str_idx' undeclared (first use in this function)
regexec.c:1600: error: too many arguments to function 'update_cur_sifted_state'
regexec.c:1609: error: 're_match_context_t' has no member named 'max_mb_elem_len'
regexec.c:1613: error: 're_node_set' has no member named 'elems'
regexec.c:1616: error: 're_node_set' has no member named 'nelem'
regexec.c:1619: error: 're_match_context_t' has no member named 'state_log'
regexec.c:1621: error: too many arguments to function 'build_sifted_states'
regexec.c:1630: error: too many arguments to function 'update_cur_sifted_state'
regexec.c:1636: error: 're_node_set' has no member named 'elems'
regexec.c: At top level:
regexec.c:1643: error: expected declaration specifiers or '...' before 'Idx'
regexec.c: In function 'build_sifted_states':
regexec.c:1646: error: 're_match_context_t' has no member named 'state_log'
regexec.c:1646: error: 'str_idx' undeclared (first use in this function)
regexec.c:1647: error: expected ';' before 'i'
regexec.c:1656: error: 'i' undeclared (first use in this function)
regexec.c:1656: error: 're_node_set' has no member named 'nelem'
regexec.c:1658: error: expected ';' before 'prev_node'
regexec.c:1668: error: 'prev_node' undeclared (first use in this function)
regexec.c:1670: error: 're_sift_context_t' has no member named 'last_str_idx'
regexec.c:1670: error: too many arguments to function 'sift_states_iter_mb'
regexec.c:1676: error: too many arguments to function 'check_node_accept'
regexec.c:1677: error: 're_dfa_t' has no member named 'nexts'
regexec.c:1684: error: 're_sift_context_t' has no member named 'limits'
regexec.c:1686: error: expected ';' before 'to_idx'
regexec.c:1687: error: 're_sift_context_t' has no member named 'limits'
regexec.c:1688: error: 're_dfa_t' has no member named 'nexts'
regexec.c:1688: error: 'to_idx' undeclared (first use in this function)
regexec.c:1689: error: too many arguments to function 'check_dst_limits'
regexec.c:1692: error: too many arguments to function 're_node_set_insert'
regexec.c: At top level:
regexec.c:1704: error: expected declaration specifiers or '...' before 'Idx'
regexec.c: In function 'clean_state_log_if_needed':
regexec.c:1706: error: expected ';' before 'top'
regexec.c:1708: error: 'next_state_log_idx' undeclared (first use in this function)
regexec.c:1708: error: 're_string_t' has no member named 'bufs_len'
regexec.c:1709: error: 're_string_t' has no member named 'valid_len'
regexec.c:1710: error: 're_string_t' has no member named 'valid_len'
regexec.c:1710: error: 're_string_t' has no member named 'len'
regexec.c:1718: error: 'top' undeclared (first use in this function)
regexec.c:1720: error: 're_match_context_t' has no member named 'state_log'
regexec.c:1722: error: 're_match_context_t' has no member named 'state_log_top'
regexec.c: At top level:
regexec.c:1730: error: expected declaration specifiers or '...' before 'Idx'
regexec.c: In function 'merge_state_array':
regexec.c:1732: error: expected ';' before 'st_idx'
regexec.c:1734: error: 'st_idx' undeclared (first use in this function)
regexec.c:1734: error: 'num' undeclared (first use in this function)
regexec.c:1746: error: 're_node_set' has no member named 'elems'
regexec.c: At top level:
regexec.c:1757: error: expected declaration specifiers or '...' before 'Idx'
regexec.c: In function 'update_cur_sifted_state':
regexec.c:1762: error: 're_match_context_t' has no member named 'state_log'
regexec.c:1762: error: 'str_idx' undeclared (first use in this function)
regexec.c:1763: error: 're_match_context_t' has no member named 'state_log'
regexec.c:1765: error: 're_node_set' has no member named 'nelem'
regexec.c:1778: error: 're_sift_context_t' has no member named 'limits'
regexec.c:1780: error: 're_sift_context_t' has no member named 'limits'
regexec.c:1781: error: 're_match_context_t' has no member named 'bkref_ents'
regexec.c:1781: error: too many arguments to function 'check_subexp_limits'
regexec.c:1792: error: 're_match_context_t' has no member named 'state_log'
regexec.c:1794: error: too many arguments to function 'sift_states_bkref'
regexec.c: In function 'add_epsilon_src_nodes':
regexec.c:1807: error: expected ';' before 'i'
regexec.c:1813: error: 're_dfastate_t' has no member named 'inveclosure'
regexec.c:1815: error: 're_dfastate_t' has no member named 'inveclosure'
regexec.c:1815: error: 're_node_set' has no member named 'nelem'
regexec.c:1815: error: too many arguments to function 're_node_set_alloc'
regexec.c:1818: error: 'i' undeclared (first use in this function)
regexec.c:1818: error: 're_node_set' has no member named 'nelem'
regexec.c:1819: error: 're_dfastate_t' has no member named 'inveclosure'
regexec.c:1820: error: 're_dfa_t' has no member named 'inveclosures'
regexec.c:1820: error: 're_node_set' has no member named 'elems'
regexec.c:1823: error: 're_dfastate_t' has no member named 'inveclosure'
regexec.c: At top level:
regexec.c:1828: error: expected declaration specifiers or '...' before 'Idx'
regexec.c: In function 'sub_epsilon_src_nodes':
regexec.c:1831: error: expected ';' before 'ecl_idx'
regexec.c:1833: error: 're_dfa_t' has no member named 'inveclosures'
regexec.c:1833: error: 'node' undeclared (first use in this function)
regexec.c:1836: error: 'ecl_idx' undeclared (first use in this function)
regexec.c:1836: error: 're_node_set' has no member named 'nelem'
regexec.c:1838: error: expected ';' before 'cur_node'
regexec.c:1839: error: 'cur_node' undeclared (first use in this function)
regexec.c:1843: error: expected ';' before 'edst1'
regexec.c:1844: error: expected ';' before 'edst2'
regexec.c:1846: error: 'edst1' undeclared (first use in this function)
regexec.c:1848: error: 'edst2' undeclared (first use in this function)
regexec.c:1848: error: called object 'Idx' is not a function
regexec.c:1848: error: called object 'Idx' is not a function
regexec.c:1853: error: 're_dfa_t' has no member named 'inveclosures'
regexec.c:1856: error: 're_node_set' has no member named 'elems'
regexec.c:1862: error: 're_node_set' has no member named 'nelem'
regexec.c:1864: error: expected ';' before 'cur_node'
regexec.c:1867: error: expected ';' before 'idx'
regexec.c:1868: error: 'idx' undeclared (first use in this function)
regexec.c:1868: error: too many arguments to function 're_node_set_remove_at'
regexec.c:1871: error: 're_node_set' has no member named 'elems'
regexec.c: At top level:
regexec.c:1878: error: expected declaration specifiers or '...' before 'Idx'
regexec.c:1878: error: expected declaration specifiers or '...' before 'Idx'
regexec.c:1878: error: expected declaration specifiers or '...' before 'Idx'
regexec.c:1878: error: expected declaration specifiers or '...' before 'Idx'
regexec.c: In function 'check_dst_limits':
regexec.c:1881: error: expected ';' before 'lim_idx'
regexec.c:1883: error: expected ';' before 'dst_bkref_idx'
regexec.c:1884: error: expected ';' before 'src_bkref_idx'
regexec.c:1885: error: 'lim_idx' undeclared (first use in this function)
regexec.c:1885: error: 're_node_set' has no member named 'nelem'
regexec.c:1887: error: expected ';' before 'subexp_idx'
regexec.c:1889: error: 're_match_context_t' has no member named 'bkref_ents'
regexec.c:1889: error: 're_node_set' has no member named 'elems'
regexec.c:1890: error: 'subexp_idx' undeclared (first use in this function)
regexec.c:1890: error: 'struct re_backref_cache_entry' has no member named 'node'
regexec.c:1892: error: 'dst_pos' undeclared (first use in this function)
regexec.c:1892: error: 're_node_set' has no member named 'elems'
regexec.c:1893: error: 'dst_node' undeclared (first use in this function)
regexec.c:1893: error: 'dst_idx' undeclared (first use in this function)
regexec.c:1894: error: 'dst_bkref_idx' undeclared (first use in this function)
regexec.c:1894: error: too many arguments to function 'check_dst_limits_calc_pos'
regexec.c:1895: error: 'src_pos' undeclared (first use in this function)
regexec.c:1895: error: 're_node_set' has no member named 'elems'
regexec.c:1896: error: 'src_node' undeclared (first use in this function)
regexec.c:1896: error: 'src_idx' undeclared (first use in this function)
regexec.c:1897: error: 'src_bkref_idx' undeclared (first use in this function)
regexec.c:1897: error: too many arguments to function 'check_dst_limits_calc_pos'
regexec.c: At top level:
regexec.c:1914: error: expected declaration specifiers or '...' before 'Idx'
regexec.c:1914: error: expected declaration specifiers or '...' before 'Idx'
regexec.c:1914: error: expected declaration specifiers or '...' before 'Idx'
regexec.c: In function 'check_dst_limits_calc_pos_1':
regexec.c:1917: error: 're_dfa_t' has no member named 'eclosures'
regexec.c:1917: error: 'from_node' undeclared (first use in this function)
regexec.c:1918: error: expected ';' before 'node_idx'
regexec.c:1922: error: 'node_idx' undeclared (first use in this function)
regexec.c:1922: error: 're_node_set' has no member named 'nelem'
regexec.c:1924: error: expected ';' before 'node'
regexec.c:1925: error: 'node' undeclared (first use in this function)
regexec.c:1928: error: 'bkref_idx' undeclared (first use in this function)
regexec.c:1930: error: 're_match_context_t' has no member named 'bkref_ents'
regexec.c:1933: error: expected ';' before 'dst'
regexec.c:1936: error: 'struct re_backref_cache_entry' has no member named 'node'
regexec.c:1939: error: 'subexp_idx' undeclared (first use in this function)
regexec.c:1940: error: 'struct re_backref_cache_entry' has no member named 'eps_reachable_subexps_map'
regexec.c:1950: error: 'dst' undeclared (first use in this function)
regexec.c:1950: error: 're_dfa_t' has no member named 'edests'
regexec.c:1961: error: too many arguments to function 'check_dst_limits_calc_pos_1'
regexec.c:1968: error: 'struct re_backref_cache_entry' has no member named 'eps_reachable_subexps_map'
regexec.c:1971: error: 'struct re_backref_cache_entry' has no member named 'more'
regexec.c: At top level:
regexec.c:1996: error: expected declaration specifiers or '...' before 'Idx'
regexec.c:1996: error: expected declaration specifiers or '...' before 'Idx'
regexec.c:1997: error: expected declaration specifiers or '...' before 'Idx'
regexec.c:1997: error: expected declaration specifiers or '...' before 'Idx'
regexec.c:1997: error: expected declaration specifiers or '...' before 'Idx'
regexec.c: In function 'check_dst_limits_calc_pos':
regexec.c:1999: error: 're_match_context_t' has no member named 'bkref_ents'
regexec.c:1999: error: 'limit' undeclared (first use in this function)
regexec.c:2003: error: 'str_idx' undeclared (first use in this function)
regexec.c:2003: error: 'struct re_backref_cache_entry' has no member named 'subexp_from'
regexec.c:2006: error: 'struct re_backref_cache_entry' has no member named 'subexp_to'
regexec.c:2010: error: 'struct re_backref_cache_entry' has no member named 'subexp_from'
regexec.c:2011: error: 'struct re_backref_cache_entry' has no member named 'subexp_to'
regexec.c:2016: error: 'subexp_idx' undeclared (first use in this function)
regexec.c:2017: error: 'from_node' undeclared (first use in this function)
regexec.c:2017: error: 'bkref_idx' undeclared (first use in this function)
regexec.c:2017: error: too many arguments to function 'check_dst_limits_calc_pos_1'
regexec.c: At top level:
regexec.c:2027: error: expected declaration specifiers or '...' before 'Idx'
regexec.c: In function 'check_subexp_limits':
regexec.c:2030: error: expected ';' before 'node_idx'
regexec.c:2032: error: 'lim_idx' undeclared (first use in this function)
regexec.c:2032: error: 're_node_set' has no member named 'nelem'
regexec.c:2034: error: expected ';' before 'subexp_idx'
regexec.c:2036: error: 're_node_set' has no member named 'elems'
regexec.c:2038: error: 'str_idx' undeclared (first use in this function)
regexec.c:2038: error: 'struct re_backref_cache_entry' has no member named 'subexp_from'
regexec.c:2038: error: 'struct re_backref_cache_entry' has no member named 'str_idx'
regexec.c:2041: error: 'subexp_idx' undeclared (first use in this function)
regexec.c:2041: error: 'struct re_backref_cache_entry' has no member named 'node'
regexec.c:2042: error: 'struct re_backref_cache_entry' has no member named 'subexp_to'
regexec.c:2044: error: expected ';' before 'ops_node'
regexec.c:2045: error: expected ';' before 'cls_node'
regexec.c:2046: error: 'node_idx' undeclared (first use in this function)
regexec.c:2046: error: 're_node_set' has no member named 'nelem'
regexec.c:2048: error: expected ';' before 'node'
regexec.c:2049: error: 'node' undeclared (first use in this function)
regexec.c:2052: error: 'ops_node' undeclared (first use in this function)
regexec.c:2055: error: 'cls_node' undeclared (first use in this function)
regexec.c:2060: error: called object 'Idx' is not a function
regexec.c:2063: error: too many arguments to function 'sub_epsilon_src_nodes'
regexec.c:2069: error: called object 'Idx' is not a function
regexec.c:2070: error: 're_node_set' has no member named 'nelem'
regexec.c:2072: error: expected ';' before 'node'
regexec.c:2073: error: 're_dfa_t' has no member named 'inveclosures'
regexec.c:2075: error: 're_dfa_t' has no member named 'eclosures'
regexec.c:2081: error: too many arguments to function 'sub_epsilon_src_nodes'
regexec.c:2090: error: 're_node_set' has no member named 'nelem'
regexec.c:2092: error: expected ';' before 'node'
regexec.c:2101: error: too many arguments to function 'sub_epsilon_src_nodes'
regexec.c: At top level:
regexec.c:2114: error: expected declaration specifiers or '...' before 'Idx'
regexec.c: In function 'sift_states_bkref':
regexec.c:2118: error: expected ';' before 'node_idx'
regexec.c:2120: error: expected ';' before 'first_idx'
regexec.c:2122: error: 'first_idx' undeclared (first use in this function)
regexec.c:2127: error: 'node_idx' undeclared (first use in this function)
regexec.c:2127: error: 're_node_set' has no member named 'nelem'
regexec.c:2129: error: expected ';' before 'enabled_idx'
regexec.c:2132: error: 'node' undeclared (first use in this function)
regexec.c:2132: error: 're_node_set' has no member named 'elems'
regexec.c:2135: error: 're_sift_context_t' has no member named 'last_node'
regexec.c:2135: error: 'str_idx' undeclared (first use in this function)
regexec.c:2135: error: 're_sift_context_t' has no member named 'last_str_idx'
regexec.c:2140: error: 're_match_context_t' has no member named 'bkref_ents'
regexec.c:2141: error: 'enabled_idx' undeclared (first use in this function)
regexec.c:2145: error: expected ';' before 'subexp_len'
regexec.c:2148: error: 'struct re_backref_cache_entry' has no member named 'node'
regexec.c:2150: error: 'subexp_len' undeclared (first use in this function)
regexec.c:2150: error: 'struct re_backref_cache_entry' has no member named 'subexp_to'
regexec.c:2150: error: 'struct re_backref_cache_entry' has no member named 'subexp_from'
regexec.c:2151: error: 'to_idx' undeclared (first use in this function)
regexec.c:2152: error: 'dst_node' undeclared (first use in this function)
regexec.c:2152: error: 're_dfa_t' has no member named 'nexts'
regexec.c:2153: error: 're_dfa_t' has no member named 'edests'
regexec.c:2155: error: 're_sift_context_t' has no member named 'last_str_idx'
regexec.c:2158: error: 're_sift_context_t' has no member named 'limits'
regexec.c:2159: error: too many arguments to function 'check_dst_limits'
regexec.c:2165: error: 're_sift_context_t' has no member named 'limits'
regexec.c:2165: error: 're_sift_context_t' has no member named 'limits'
regexec.c:2169: error: 're_sift_context_t' has no member named 'last_node'
regexec.c:2170: error: 're_sift_context_t' has no member named 'last_str_idx'
regexec.c:2171: error: 're_sift_context_t' has no member named 'limits'
regexec.c:2171: error: too many arguments to function 're_node_set_insert'
regexec.c:2185: error: too many arguments to function 'merge_state_array'
regexec.c:2190: error: 're_sift_context_t' has no member named 'limits'
regexec.c:2190: error: 're_sift_context_t' has no member named 'limits'
regexec.c:2190: error: too many arguments to function 're_node_set_remove_at'
regexec.c:2193: error: 're_match_context_t' has no member named 'bkref_ents'
regexec.c:2195: error: 'struct re_backref_cache_entry' has no member named 'more'
regexec.c:2201: error: 're_sift_context_t' has no member named 'limits'
regexec.c: At top level:
regexec.c:2212: error: expected declaration specifiers or '...' before 'Idx'
regexec.c:2212: error: expected declaration specifiers or '...' before 'Idx'
regexec.c:2212: error: expected declaration specifiers or '...' before 'Idx'
regexec.c: In function 'sift_states_iter_mb':
regexec.c:2217: error: 'node_idx' undeclared (first use in this function)
regexec.c:2217: error: 'str_idx' undeclared (first use in this function)
regexec.c:2217: error: too many arguments to function 'check_node_accept_bytes'
regexec.c:2218: error: 'max_str_idx' undeclared (first use in this function)
regexec.c:2219: error: 're_dfa_t' has no member named 'nexts'
regexec.c: In function 'transit_state':
regexec.c:2249: error: 're_dfastate_t' has no member named 'accept_mb'
regexec.c:2265: error: 're_string_t' has no member named 'cur_idx'
regexec.c:2268: error: 're_dfastate_t' has no member named 'trtable'
regexec.c:2272: error: 're_dfastate_t' has no member named 'word_trtable'
regexec.c:2278: error: 're_string_t' has no member named 'cur_idx'
regexec.c:2279: error: too many arguments to function 're_string_context_at'
regexec.c: In function 'merge_state_with_log':
regexec.c:2303: error: expected ';' before 'cur_idx'
regexec.c:2305: error: 'cur_idx' undeclared (first use in this function)
regexec.c:2305: error: 're_match_context_t' has no member named 'state_log_top'
regexec.c:2307: error: 're_match_context_t' has no member named 'state_log'
regexec.c:2308: error: 're_match_context_t' has no member named 'state_log_top'
regexec.c:2310: error: 're_match_context_t' has no member named 'state_log'
regexec.c:2312: error: 're_match_context_t' has no member named 'state_log'
regexec.c:2323: error: 're_match_context_t' has no member named 'state_log'
regexec.c:2324: error: 're_dfastate_t' has no member named 'entrance_nodes'
regexec.c:2327: error: 're_dfastate_t' has no member named 'entrance_nodes'
regexec.c:2339: error: 're_string_t' has no member named 'cur_idx'
regexec.c:2340: error: too many arguments to function 're_string_context_at'
regexec.c:2341: error: 're_match_context_t' has no member named 'state_log'
regexec.c:2347: error: 're_node_set' has no member named 'elems'
regexec.c:2350: error: 're_dfa_t' has no member named 'nbackref'
regexec.c:2355: error: 're_dfastate_t' has no member named 'nodes'
regexec.c:2356: error: too many arguments to function 'check_subexp_matching_top'
regexec.c:2361: error: 're_dfastate_t' has no member named 'has_backref'
regexec.c:2363: error: 're_dfastate_t' has no member named 'nodes'
regexec.c:2366: error: 're_match_context_t' has no member named 'state_log'
regexec.c: In function 'find_recover_state':
regexec.c:2383: error: expected ';' before 'max'
regexec.c:2384: error: expected ';' before 'cur_str_idx'
regexec.c:2388: error: 'cur_str_idx' undeclared (first use in this function)
regexec.c:2388: error: 'max' undeclared (first use in this function)
regexec.c:2390: error: 're_string_t' has no member named 'cur_idx'
regexec.c:2392: error: 're_match_context_t' has no member named 'state_log'
regexec.c: At top level:
regexec.c:2410: error: expected declaration specifiers or '...' before 'Idx'
regexec.c: In function 'check_subexp_matching_top':
regexec.c:2413: error: expected ';' before 'node_idx'
regexec.c:2421: error: 'node_idx' undeclared (first use in this function)
regexec.c:2421: error: 're_node_set' has no member named 'nelem'
regexec.c:2423: error: expected ';' before 'node'
regexec.c:2424: error: 'node' undeclared (first use in this function)
regexec.c:2426: error: 're_dfa_t' has no member named 'used_bkref_map'
regexec.c:2429: error: 'str_idx' undeclared (first use in this function)
regexec.c:2429: error: too many arguments to function 'match_ctx_add_subtop'
regexec.c: In function 'transit_state_mb':
regexec.c:2486: error: expected ';' before 'i'
regexec.c:2488: error: 'i' undeclared (first use in this function)
regexec.c:2488: error: 're_dfastate_t' has no member named 'nodes'
regexec.c:2491: error: expected ';' before 'cur_node_idx'
regexec.c:2493: error: expected ';' before 'dest_idx'
regexec.c:2497: error: 'cur_node_idx' undeclared (first use in this function)
regexec.c:2503: error: 're_string_t' has no member named 'cur_idx'
regexec.c:2504: error: too many arguments to function 're_string_context_at'
regexec.c:2512: error: 're_string_t' has no member named 'cur_idx'
regexec.c:2512: error: too many arguments to function 'check_node_accept_bytes'
regexec.c:2517: error: 'dest_idx' undeclared (first use in this function)
regexec.c:2517: error: 're_string_t' has no member named 'cur_idx'
regexec.c:2518: error: 're_match_context_t' has no member named 'max_mb_elem_len'
regexec.c:2518: error: 're_match_context_t' has no member named 'max_mb_elem_len'
regexec.c:2519: error: 're_match_context_t' has no member named 'max_mb_elem_len'
regexec.c:2520: error: too many arguments to function 'clean_state_log_if_needed'
regexec.c:2526: error: 're_dfa_t' has no member named 'eclosures'
regexec.c:2526: error: 're_dfa_t' has no member named 'nexts'
regexec.c:2528: error: 're_match_context_t' has no member named 'state_log'
regexec.c:2534: error: 're_dfastate_t' has no member named 'entrance_nodes'
regexec.c:2538: error: too many arguments to function 're_string_context_at'
regexec.c:2539: error: 're_match_context_t' has no member named 'state_log'
regexec.c:2542: error: 're_node_set' has no member named 'elems'
regexec.c:2543: error: 're_match_context_t' has no member named 'state_log'
regexec.c: In function 'transit_state_bkref':
regexec.c:2556: error: expected ';' before 'i'
regexec.c:2557: error: expected ';' before 'cur_str_idx'
regexec.c:2559: error: 'i' undeclared (first use in this function)
regexec.c:2559: error: 're_node_set' has no member named 'nelem'
regexec.c:2561: error: expected ';' before 'dest_str_idx'
regexec.c:2562: error: expected ';' before 'node_idx'
regexec.c:2564: error: 'node_idx' undeclared (first use in this function)
regexec.c:2573: error: 'cur_str_idx' undeclared (first use in this function)
regexec.c:2574: error: too many arguments to function 're_string_context_at'
regexec.c:2581: error: 'bkc_idx' undeclared (first use in this function)
regexec.c:2581: error: 're_match_context_t' has no member named 'nbkref_ents'
regexec.c:2582: error: too many arguments to function 'get_subexp'
regexec.c:2591: error: 're_match_context_t' has no member named 'nbkref_ents'
regexec.c:2593: error: expected ';' before 'subexp_len'
regexec.c:2596: error: 're_match_context_t' has no member named 'bkref_ents'
regexec.c:2597: error: 'struct re_backref_cache_entry' has no member named 'node'
regexec.c:2597: error: 'struct re_backref_cache_entry' has no member named 'str_idx'
regexec.c:2599: error: 'subexp_len' undeclared (first use in this function)
regexec.c:2599: error: 'struct re_backref_cache_entry' has no member named 'subexp_to'
regexec.c:2599: error: 'struct re_backref_cache_entry' has no member named 'subexp_from'
regexec.c:2601: error: 're_dfa_t' has no member named 'eclosures'
regexec.c:2601: error: 're_dfa_t' has no member named 'edests'
regexec.c:2602: error: 're_dfa_t' has no member named 'eclosures'
regexec.c:2602: error: 're_dfa_t' has no member named 'nexts'
regexec.c:2603: error: 'dest_str_idx' undeclared (first use in this function)
regexec.c:2603: error: 'struct re_backref_cache_entry' has no member named 'subexp_to'
regexec.c:2604: error: 'struct re_backref_cache_entry' has no member named 'subexp_from'
regexec.c:2606: error: too many arguments to function 're_string_context_at'
regexec.c:2607: error: 're_match_context_t' has no member named 'state_log'
regexec.c:2608: error: 'prev_nelem' undeclared (first use in this function)
regexec.c:2608: error: 're_match_context_t' has no member named 'state_log'
regexec.c:2609: error: 're_match_context_t' has no member named 'state_log'
regexec.c:2613: error: 're_match_context_t' has no member named 'state_log'
regexec.c:2616: error: 're_match_context_t' has no member named 'state_log'
regexec.c:2624: error: 're_dfastate_t' has no member named 'entrance_nodes'
regexec.c:2628: error: 're_node_set' has no member named 'elems'
regexec.c:2631: error: 're_match_context_t' has no member named 'state_log'
regexec.c:2633: error: 're_node_set' has no member named 'elems'
regexec.c:2634: error: 're_match_context_t' has no member named 'state_log'
regexec.c:2641: error: 're_match_context_t' has no member named 'state_log'
regexec.c:2644: error: too many arguments to function 'check_subexp_matching_top'
regexec.c: At top level:
regexec.c:2666: error: expected declaration specifiers or '...' before 'Idx'
regexec.c:2666: error: expected declaration specifiers or '...' before 'Idx'
regexec.c: In function 'get_subexp':
regexec.c:2669: error: expected ';' before 'subexp_num'
regexec.c:2672: error: expected ';' before 'cache_idx'
regexec.c:2673: error: 'cache_idx' undeclared (first use in this function)
regexec.c:2675: error: 're_match_context_t' has no member named 'bkref_ents'
regexec.c:2677: error: 'const struct re_backref_cache_entry' has no member named 'node'
regexec.c:2677: error: 'bkref_node' undeclared (first use in this function)
regexec.c:2679: error: 'const struct re_backref_cache_entry' has no member named 'more'
regexec.c:2682: error: 'subexp_num' undeclared (first use in this function)
regexec.c:2685: error: 'sub_top_idx' undeclared (first use in this function)
regexec.c:2685: error: 're_match_context_t' has no member named 'nsub_tops'
regexec.c:2688: error: 're_match_context_t' has no member named 'sub_tops'
regexec.c:2690: error: expected ';' before 'sub_last_idx'
regexec.c:2692: error: 're_sub_match_top_t' has no member named 'node'
regexec.c:2695: error: 'sl_str' undeclared (first use in this function)
regexec.c:2695: error: 're_sub_match_top_t' has no member named 'str_idx'
regexec.c:2696: error: 'bkref_str_off' undeclared (first use in this function)
regexec.c:2696: error: 'bkref_str_idx' undeclared (first use in this function)
regexec.c:2699: error: 'sub_last_idx' undeclared (first use in this function)
regexec.c:2699: error: 're_sub_match_top_t' has no member named 'nlasts'
regexec.c:2702: error: 're_sub_match_top_t' has no member named 'lasts'
regexec.c:2703: error: 're_sub_match_last_t' has no member named 'str_idx'
regexec.c:2708: error: 're_string_t' has no member named 'valid_len'
regexec.c:2711: error: 're_string_t' has no member named 'len'
regexec.c:2716: error: too many arguments to function 'clean_state_log_if_needed'
regexec.c:2727: error: too many arguments to function 'get_subexp_sub'
regexec.c:2739: error: 're_sub_match_top_t' has no member named 'nlasts'
regexec.c:2746: error: expected ';' before 'cls_node'
regexec.c:2749: error: 're_sub_match_top_t' has no member named 'str_idx'
regexec.c:2754: error: 're_string_t' has no member named 'valid_len'
regexec.c:2757: error: 're_string_t' has no member named 'len'
regexec.c:2770: error: 're_match_context_t' has no member named 'state_log'
regexec.c:2773: error: 're_match_context_t' has no member named 'state_log'
regexec.c:2774: error: 'cls_node' undeclared (first use in this function)
regexec.c:2777: error: 're_sub_match_top_t' has no member named 'path'
regexec.c:2779: error: 're_sub_match_top_t' has no member named 'path'
regexec.c:2779: error: 're_sub_match_top_t' has no member named 'str_idx'
regexec.c:2781: error: 're_sub_match_top_t' has no member named 'path'
regexec.c:2786: error: 're_sub_match_top_t' has no member named 'path'
regexec.c:2786: error: 're_sub_match_top_t' has no member named 'node'
regexec.c:2787: error: 're_sub_match_top_t' has no member named 'str_idx'
regexec.c:2787: error: too many arguments to function 'check_arrival'
regexec.c:2792: error: too many arguments to function 'match_ctx_add_sublast'
regexec.c:2796: error: too many arguments to function 'get_subexp_sub'
regexec.c: At top level:
regexec.c:2813: error: expected declaration specifiers or '...' before 'Idx'
regexec.c:2813: error: expected declaration specifiers or '...' before 'Idx'
regexec.c: In function 'get_subexp_sub':
regexec.c:2816: error: expected ';' before 'to_idx'
regexec.c:2818: error: 're_sub_match_last_t' has no member named 'path'
regexec.c:2818: error: 're_sub_match_last_t' has no member named 'node'
regexec.c:2819: error: 're_sub_match_last_t' has no member named 'str_idx'
regexec.c:2819: error: 'bkref_node' undeclared (first use in this function)
regexec.c:2819: error: 'bkref_str' undeclared (first use in this function)
regexec.c:2819: error: too many arguments to function 'check_arrival'
regexec.c:2822: error: 're_sub_match_top_t' has no member named 'str_idx'
regexec.c:2823: error: 're_sub_match_last_t' has no member named 'str_idx'
regexec.c:2823: error: too many arguments to function 'match_ctx_add_entry'
regexec.c:2826: error: 'to_idx' undeclared (first use in this function)
regexec.c:2826: error: 're_sub_match_last_t' has no member named 'str_idx'
regexec.c:2826: error: 're_sub_match_top_t' has no member named 'str_idx'
regexec.c:2827: error: too many arguments to function 'clean_state_log_if_needed'
regexec.c: At top level:
regexec.c:2840: warning: 'regparm' attribute only applies to function types
regexec.c:2840: warning: 'stdcall' attribute only applies to function types
regexec.c:2840: error: expected ',' or ';' before 'find_subexp_node'
regexec.c:2863: error: expected declaration specifiers or '...' before 'Idx'
regexec.c:2863: error: expected declaration specifiers or '...' before 'Idx'
regexec.c:2863: error: expected declaration specifiers or '...' before 'Idx'
regexec.c:2863: error: expected declaration specifiers or '...' before 'Idx'
regexec.c: In function 'check_arrival':
regexec.c:2868: error: expected ';' before 'subexp_num'
regexec.c:2874: error: 'subexp_num' undeclared (first use in this function)
regexec.c:2874: error: 'top_node' undeclared (first use in this function)
regexec.c:2876: error: 'state_array_t' has no member named 'alloc'
regexec.c:2876: error: 'last_str' undeclared (first use in this function)
regexec.c:2876: error: 're_match_context_t' has no member named 'max_mb_elem_len'
regexec.c:2879: error: expected ';' before 'old_alloc'
regexec.c:2880: error: expected ';' before 'new_alloc'
regexec.c:2881: error: 'new_alloc' undeclared (first use in this function)
regexec.c:2881: error: 'old_alloc' undeclared (first use in this function)
regexec.c:2883: error: 'state_array_t' has no member named 'array'
regexec.c:2886: error: 'state_array_t' has no member named 'array'
regexec.c:2887: error: 'state_array_t' has no member named 'alloc'
regexec.c:2892: error: 'str_idx' undeclared (first use in this function)
regexec.c:2892: error: 'state_array_t' has no member named 'next_idx'
regexec.c:2892: error: 'top_str' undeclared (first use in this function)
regexec.c:2892: error: 'state_array_t' has no member named 'next_idx'
regexec.c:2895: error: 're_match_context_t' has no member named 'state_log'
regexec.c:2896: error: 'backup_cur_idx' undeclared (first use in this function)
regexec.c:2896: error: 're_string_t' has no member named 'cur_idx'
regexec.c:2897: error: 're_match_context_t' has no member named 'state_log'
regexec.c:2897: error: 'state_array_t' has no member named 'array'
regexec.c:2898: error: 're_string_t' has no member named 'cur_idx'
regexec.c:2901: error: too many arguments to function 're_string_context_at'
regexec.c:2904: error: too many arguments to function 're_node_set_init_1'
regexec.c:2907: error: too many arguments to function 'check_arrival_expand_ecl'
regexec.c:2910: error: 're_node_set' has no member named 'elems'
regexec.c:2916: error: 're_match_context_t' has no member named 'state_log'
regexec.c:2917: error: 're_dfastate_t' has no member named 'has_backref'
regexec.c:2919: error: 're_dfastate_t' has no member named 'nodes'
regexec.c:2926: error: 're_dfastate_t' has no member named 'has_backref'
regexec.c:2928: error: 're_node_set' has no member named 'nelem'
regexec.c:2931: error: too many arguments to function 'expand_bkref_cache'
regexec.c:2934: error: 're_node_set' has no member named 'elems'
regexec.c:2941: error: 're_node_set' has no member named 'elems'
regexec.c:2944: error: 're_match_context_t' has no member named 'state_log'
regexec.c:2947: error: 'null_cnt' undeclared (first use in this function)
regexec.c:2947: error: 're_match_context_t' has no member named 'max_mb_elem_len'
regexec.c:2949: error: 're_node_set' has no member named 'nelem'
regexec.c:2950: error: 're_match_context_t' has no member named 'state_log'
regexec.c:2953: error: 're_match_context_t' has no member named 'state_log'
regexec.c:2956: error: 're_node_set' has no member named 'elems'
regexec.c:2963: error: 're_dfastate_t' has no member named 'non_eps_nodes'
regexec.c:2963: error: too many arguments to function 'check_arrival_add_next_nodes'
regexec.c:2966: error: 're_node_set' has no member named 'elems'
regexec.c:2971: error: 're_node_set' has no member named 'nelem'
regexec.c:2973: error: too many arguments to function 'check_arrival_expand_ecl'
regexec.c:2976: error: 're_node_set' has no member named 'elems'
regexec.c:2980: error: too many arguments to function 'expand_bkref_cache'
regexec.c:2983: error: 're_node_set' has no member named 'elems'
regexec.c:2987: error: too many arguments to function 're_string_context_at'
regexec.c:2991: error: 're_node_set' has no member named 'elems'
regexec.c:2994: error: 're_match_context_t' has no member named 'state_log'
regexec.c:2997: error: 're_node_set' has no member named 'elems'
regexec.c:2998: error: 're_match_context_t' has no member named 'state_log'
regexec.c:2999: error: 're_match_context_t' has no member named 'state_log'
regexec.c:3000: error: 'state_array_t' has no member named 'next_idx'
regexec.c:3003: error: 're_match_context_t' has no member named 'state_log'
regexec.c:3004: error: 're_string_t' has no member named 'cur_idx'
regexec.c:3007: error: 'last_node' undeclared (first use in this function)
regexec.c: At top level:
regexec.c:3023: error: expected declaration specifiers or '...' before 'Idx'
regexec.c: In function 'check_arrival_add_next_nodes':
regexec.c:3029: error: expected ';' before 'cur_idx'
regexec.c:3033: error: 'cur_idx' undeclared (first use in this function)
regexec.c:3033: error: 're_node_set' has no member named 'nelem'
regexec.c:3036: error: expected ';' before 'cur_node'
regexec.c:3043: error: 'cur_node' undeclared (first use in this function)
regexec.c:3046: error: 'str_idx' undeclared (first use in this function)
regexec.c:3046: error: too many arguments to function 'check_node_accept_bytes'
regexec.c:3050: error: expected ';' before 'next_node'
regexec.c:3051: error: expected ';' before 'next_idx'
regexec.c:3052: error: 're_match_context_t' has no member named 'state_log'
regexec.c:3052: error: 'next_idx' undeclared (first use in this function)
regexec.c:3053: error: 're_node_set' has no member named 'nelem'
regexec.c:3056: error: 're_dfastate_t' has no member named 'nodes'
regexec.c:3059: error: 're_node_set' has no member named 'elems'
regexec.c:3063: error: 'next_node' undeclared (first use in this function)
regexec.c:3063: error: too many arguments to function 're_node_set_insert'
regexec.c:3066: error: 're_node_set' has no member named 'elems'
regexec.c:3069: error: 're_match_context_t' has no member named 'state_log'
regexec.c:3071: error: 're_match_context_t' has no member named 'state_log'
regexec.c:3074: error: 're_node_set' has no member named 'elems'
regexec.c:3081: error: too many arguments to function 'check_node_accept'
regexec.c:3083: error: 're_dfa_t' has no member named 'nexts'
regexec.c:3083: error: too many arguments to function 're_node_set_insert'
regexec.c:3086: error: 're_node_set' has no member named 'elems'
regexec.c:3091: error: 're_node_set' has no member named 'elems'
regexec.c: At top level:
regexec.c:3104: error: expected declaration specifiers or '...' before 'Idx'
regexec.c: In function 'check_arrival_expand_ecl':
regexec.c:3107: error: expected ';' before 'idx'
regexec.c:3112: error: 're_node_set' has no member named 'nelem'
regexec.c:3112: error: too many arguments to function 're_node_set_alloc'
regexec.c:3118: error: 'idx' undeclared (first use in this function)
regexec.c:3118: error: 're_node_set' has no member named 'nelem'
regexec.c:3120: error: expected ';' before 'cur_node'
regexec.c:3121: error: 're_dfa_t' has no member named 'eclosures'
regexec.c:3121: error: 'cur_node' undeclared (first use in this function)
regexec.c:3122: error: 'outside_node' undeclared (first use in this function)
regexec.c:3122: error: 'ex_subexp' undeclared (first use in this function)
regexec.c:3129: error: 're_node_set' has no member named 'elems'
regexec.c:3137: error: too many arguments to function 'check_arrival_expand_ecl_sub'
regexec.c:3140: error: 're_node_set' has no member named 'elems'
regexec.c:3145: error: 're_node_set' has no member named 'elems'
regexec.c: At top level:
regexec.c:3157: error: expected declaration specifiers or '...' before 'Idx'
regexec.c:3157: error: expected declaration specifiers or '...' before 'Idx'
regexec.c: In function 'check_arrival_expand_ecl_sub':
regexec.c:3159: error: expected ';' before 'cur_node'
regexec.c:3160: error: 'cur_node' undeclared (first use in this function)
regexec.c:3160: error: 'target' undeclared (first use in this function)
regexec.c:3165: error: 'ex_subexp' undeclared (first use in this function)
regexec.c:3169: error: too many arguments to function 're_node_set_insert'
regexec.c:3175: error: too many arguments to function 're_node_set_insert'
regexec.c:3178: error: 're_dfa_t' has no member named 'edests'
regexec.c:3180: error: 're_dfa_t' has no member named 'edests'
regexec.c:3184: error: 're_dfa_t' has no member named 'edests'
regexec.c:3185: error: too many arguments to function 'check_arrival_expand_ecl_sub'
regexec.c:3189: error: 're_dfa_t' has no member named 'edests'
regexec.c: At top level:
regexec.c:3202: error: expected declaration specifiers or '...' before 'Idx'
regexec.c:3202: error: expected declaration specifiers or '...' before 'Idx'
regexec.c: In function 'expand_bkref_cache':
regexec.c:3206: error: expected ';' before 'cache_idx_start'
regexec.c:3209: error: 'cache_idx_start' undeclared (first use in this function)
regexec.c:3213: error: 're_match_context_t' has no member named 'bkref_ents'
regexec.c:3216: error: expected ';' before 'to_idx'
regexec.c:3219: error: 'struct re_backref_cache_entry' has no member named 'node'
regexec.c:3222: error: 'to_idx' undeclared (first use in this function)
regexec.c:3222: error: 'cur_str' undeclared (first use in this function)
regexec.c:3222: error: 'struct re_backref_cache_entry' has no member named 'subexp_to'
regexec.c:3222: error: 'struct re_backref_cache_entry' has no member named 'subexp_from'
regexec.c:3231: error: 'next_node' undeclared (first use in this function)
regexec.c:3231: error: 're_dfa_t' has no member named 'edests'
regexec.c:3231: error: 'struct re_backref_cache_entry' has no member named 'node'
regexec.c:3234: error: too many arguments to function 're_node_set_init_1'
regexec.c:3235: error: 'subexp_num' undeclared (first use in this function)
regexec.c:3235: error: too many arguments to function 'check_arrival_expand_ecl'
regexec.c:3237: error: 're_node_set' has no member named 'elems'
regexec.c:3251: error: 're_dfa_t' has no member named 'nexts'
regexec.c:3251: error: 'struct re_backref_cache_entry' has no member named 'node'
regexec.c:3252: error: 're_match_context_t' has no member named 'state_log'
regexec.c:3255: error: 're_match_context_t' has no member named 'state_log'
regexec.c:3259: error: 're_match_context_t' has no member named 'state_log'
regexec.c:3260: error: too many arguments to function 're_node_set_insert'
regexec.c:3263: error: 're_node_set' has no member named 'elems'
regexec.c:3270: error: too many arguments to function 're_node_set_init_1'
regexec.c:3274: error: 're_match_context_t' has no member named 'state_log'
regexec.c:3275: error: 're_node_set' has no member named 'elems'
regexec.c:3276: error: 're_match_context_t' has no member named 'state_log'
regexec.c:3281: error: 'struct re_backref_cache_entry' has no member named 'more'
regexec.c: In function 'build_trtable':
regexec.c:3293: error: expected ';' before 'i'
regexec.c:3298: error: expected ';' before 'ndests'
regexec.c:3328: error: 're_dfastate_t' has no member named 'word_trtable'
regexec.c:3328: error: 're_dfastate_t' has no member named 'trtable'
regexec.c:3332: error: 'ndests' undeclared (first use in this function)
regexec.c:3333: error: called object 'Idx' is not a function
regexec.c:3333: error: called object 'Idx' is not a function
regexec.c:3339: error: 're_dfastate_t' has no member named 'trtable'
regexec.c:3345: error: too many arguments to function 're_node_set_alloc'
regexec.c:3368: error: 're_node_set' has no member named 'elems'
regexec.c:3369: error: 'i' undeclared (first use in this function)
regexec.c:3384: error: expected ';' before 'next_node'
regexec.c:3385: error: 're_node_set' has no member named 'nelem'
regexec.c:3387: error: 'j' undeclared (first use in this function)
regexec.c:3389: error: 'next_node' undeclared (first use in this function)
regexec.c:3389: error: 're_dfa_t' has no member named 'nexts'
regexec.c:3392: error: 're_dfa_t' has no member named 'eclosures'
regexec.c:3409: error: 're_dfa_t' has no member named 'mb_cur_max'
regexec.c:3431: error: 're_dfastate_t' has no member named 'trtable'
regexec.c:3448: error: 're_dfa_t' has no member named 'word_char'
regexec.c:3461: error: 're_dfastate_t' has no member named 'word_trtable'
regexec.c:3484: error: too many arguments to function 'bitset_contain'
regexec.c:3488: error: too many arguments to function 'bitset_contain'
regexec.c:3503: error: 're_node_set' has no member named 'elems'
regexec.c: At top level:
regexec.c:3520: warning: 'regparm' attribute only applies to function types
regexec.c:3520: warning: 'stdcall' attribute only applies to function types
regexec.c:3520: error: expected ',' or ';' before 'group_nodes_into_DFAstates'
regexec.c:3713: error: expected declaration specifiers or '...' before 'Idx'
regexec.c:3714: error: expected declaration specifiers or '...' before 'Idx'
regexec.c: In function 'check_node_accept_bytes':
regexec.c:3716: error: 'node_idx' undeclared (first use in this function)
regexec.c:3718: error: expected ';' before 'i'
regexec.c:3722: error: 'str_idx' undeclared (first use in this function)
regexec.c:3726: error: 're_string_t' has no member named 'len'
regexec.c:3759: error: 're_string_t' has no member named 'len'
regexec.c:3762: error: 'i' undeclared (first use in this function)
regexec.c:3771: error: too many arguments to function 're_string_char_size_at'
regexec.c:3779: error: 're_dfa_t' has no member named 'syntax'
regexec.c:3779: error: 'REG_DOT_NEWLINE' undeclared (first use in this function)
regexec.c:3781: error: 're_dfa_t' has no member named 'syntax'
regexec.c:3781: error: 'REG_DOT_NOT_NULL' undeclared (first use in this function)
regexec.c:3787: error: too many arguments to function 're_string_elem_size_at'
regexec.c:3801: error: 're_charset_t' has no member named 'nranges'
regexec.c:3801: error: 're_charset_t' has no member named 'nchar_classes'
regexec.c:3801: error: 're_charset_t' has no member named 'nmbchars'
regexec.c:3802: error: too many arguments to function 're_string_wchar_at'
regexec.c:3805: error: 're_charset_t' has no member named 'nmbchars'
regexec.c:3812: error: 're_charset_t' has no member named 'nchar_classes'
regexec.c:3920: error: 're_charset_t' has no member named 'nranges'
regexec.c: At top level:
regexec.c:4013: error: expected declaration specifiers or '...' before 'Idx'
regexec.c: In function 'check_node_accept':
regexec.c:4016: error: 'idx' undeclared (first use in this function)
regexec.c:4025: error: too many arguments to function 'bitset_contain'
regexec.c:4036: error: 're_dfa_t' has no member named 'syntax'
regexec.c:4036: error: 'REG_DOT_NEWLINE' undeclared (first use in this function)
regexec.c:4037: error: 're_dfa_t' has no member named 'syntax'
regexec.c:4037: error: 'REG_DOT_NOT_NULL' undeclared (first use in this function)
regexec.c:4050: error: too many arguments to function 're_string_context_at'
regexec.c: In function 'extend_buffers':
regexec.c:4068: error: 're_string_t' has no member named 'bufs_len'
regexec.c:4068: error: too many arguments to function 're_string_realloc_buffers'
regexec.c:4072: error: 're_match_context_t' has no member named 'state_log'
regexec.c:4078: error: 're_match_context_t' has no member named 'state_log'
regexec.c:4078: error: 're_string_t' has no member named 'bufs_len'
regexec.c:4082: error: 're_match_context_t' has no member named 'state_log'
regexec.c:4086: error: 're_string_t' has no member named 'icase'
regexec.c:4089: error: 're_string_t' has no member named 'mb_cur_max'
regexec.c:4102: error: 're_string_t' has no member named 'mb_cur_max'
regexec.c:4107: error: 're_string_t' has no member named 'trans'
regexec.c: At top level:
regexec.c:4121: error: expected declaration specifiers or '...' before 'Idx'
regexec.c: In function 'match_ctx_init':
regexec.c:4124: error: 're_match_context_t' has no member named 'match_last'
regexec.c:4125: error: 'n' undeclared (first use in this function)
regexec.c:4127: error: 're_match_context_t' has no member named 'bkref_ents'
regexec.c:4128: error: 're_match_context_t' has no member named 'sub_tops'
regexec.c:4129: error: 're_match_context_t' has no member named 'bkref_ents'
regexec.c:4129: error: 're_match_context_t' has no member named 'sub_tops'
regexec.c:4137: error: 're_match_context_t' has no member named 'abkref_ents'
regexec.c:4138: error: 're_match_context_t' has no member named 'max_mb_elem_len'
regexec.c:4139: error: 're_match_context_t' has no member named 'asub_tops'
regexec.c: In function 'match_ctx_clean':
regexec.c:4151: error: expected ';' before 'st_idx'
regexec.c:4152: error: 'st_idx' undeclared (first use in this function)
regexec.c:4152: error: 're_match_context_t' has no member named 'nsub_tops'
regexec.c:4154: error: expected ';' before 'sl_idx'
regexec.c:4155: error: 're_match_context_t' has no member named 'sub_tops'
regexec.c:4156: error: 'sl_idx' undeclared (first use in this function)
regexec.c:4156: error: 're_sub_match_top_t' has no member named 'nlasts'
regexec.c:4158: error: 're_sub_match_top_t' has no member named 'lasts'
regexec.c:4159: error: 're_sub_match_last_t' has no member named 'path'
regexec.c:4162: error: 're_sub_match_top_t' has no member named 'lasts'
regexec.c:4163: error: 're_sub_match_top_t' has no member named 'path'
regexec.c:4165: error: 're_sub_match_top_t' has no member named 'path'
regexec.c:4166: error: 're_sub_match_top_t' has no member named 'path'
regexec.c:4171: error: 're_match_context_t' has no member named 'nsub_tops'
regexec.c:4172: error: 're_match_context_t' has no member named 'nbkref_ents'
regexec.c: In function 'match_ctx_free':
regexec.c:4183: error: 're_match_context_t' has no member named 'sub_tops'
regexec.c:4184: error: 're_match_context_t' has no member named 'bkref_ents'
regexec.c: At top level:
regexec.c:4194: error: expected declaration specifiers or '...' before 'Idx'
regexec.c:4194: error: expected declaration specifiers or '...' before 'Idx'
regexec.c:4195: error: expected declaration specifiers or '...' before 'Idx'
regexec.c:4195: error: expected declaration specifiers or '...' before 'Idx'
regexec.c: In function 'match_ctx_add_entry':
regexec.c:4197: error: 're_match_context_t' has no member named 'nbkref_ents'
regexec.c:4197: error: 're_match_context_t' has no member named 'abkref_ents'
regexec.c:4200: error: 're_match_context_t' has no member named 'bkref_ents'
regexec.c:4200: error: 're_match_context_t' has no member named 'abkref_ents'
regexec.c:4204: error: 're_match_context_t' has no member named 'bkref_ents'
regexec.c:4207: error: 're_match_context_t' has no member named 'bkref_ents'
regexec.c:4208: error: 're_match_context_t' has no member named 'bkref_ents'
regexec.c:4208: error: 're_match_context_t' has no member named 'nbkref_ents'
regexec.c:4210: error: 're_match_context_t' has no member named 'abkref_ents'
regexec.c:4210: error: 're_match_context_t' has no member named 'nbkref_ents'
regexec.c:4212: error: 're_match_context_t' has no member named 'nbkref_ents'
regexec.c:4213: error: 're_match_context_t' has no member named 'bkref_ents'
regexec.c:4213: error: 're_match_context_t' has no member named 'nbkref_ents'
regexec.c:4213: error: 'str_idx' undeclared (first use in this function)
regexec.c:4214: error: 're_match_context_t' has no member named 'bkref_ents'
regexec.c:4214: error: 're_match_context_t' has no member named 'nbkref_ents'
regexec.c:4216: error: 're_match_context_t' has no member named 'bkref_ents'
regexec.c:4216: error: 're_match_context_t' has no member named 'nbkref_ents'
regexec.c:4216: error: 'node' undeclared (first use in this function)
regexec.c:4217: error: 're_match_context_t' has no member named 'bkref_ents'
regexec.c:4217: error: 're_match_context_t' has no member named 'nbkref_ents'
regexec.c:4218: error: 're_match_context_t' has no member named 'bkref_ents'
regexec.c:4218: error: 're_match_context_t' has no member named 'nbkref_ents'
regexec.c:4218: error: 'from' undeclared (first use in this function)
regexec.c:4219: error: 're_match_context_t' has no member named 'bkref_ents'
regexec.c:4219: error: 're_match_context_t' has no member named 'nbkref_ents'
regexec.c:4219: error: 'to' undeclared (first use in this function)
regexec.c:4229: error: 're_match_context_t' has no member named 'bkref_ents'
regexec.c:4229: error: 're_match_context_t' has no member named 'nbkref_ents'
regexec.c:4232: error: 're_match_context_t' has no member named 'bkref_ents'
regexec.c:4232: error: 're_match_context_t' has no member named 'nbkref_ents'
regexec.c:4233: error: 're_match_context_t' has no member named 'max_mb_elem_len'
regexec.c:4234: error: 're_match_context_t' has no member named 'max_mb_elem_len'
regexec.c: At top level:
regexec.c:4243: warning: 'regparm' attribute only applies to function types
regexec.c:4243: warning: 'stdcall' attribute only applies to function types
regexec.c:4243: error: expected ',' or ';' before 'search_cur_bkref_entry'
regexec.c:4266: error: expected declaration specifiers or '...' before 'Idx'
regexec.c:4266: error: expected declaration specifiers or '...' before 'Idx'
regexec.c: In function 'match_ctx_add_subtop':
regexec.c:4272: error: 're_match_context_t' has no member named 'nsub_tops'
regexec.c:4272: error: 're_match_context_t' has no member named 'asub_tops'
regexec.c:4274: error: expected ';' before 'new_asub_tops'
regexec.c:4275: error: 're_match_context_t' has no member named 'sub_tops'
regexec.c:4275: error: 'new_asub_tops' undeclared (first use in this function)
regexec.c:4280: error: 're_match_context_t' has no member named 'sub_tops'
regexec.c:4281: error: 're_match_context_t' has no member named 'asub_tops'
regexec.c:4283: error: 're_match_context_t' has no member named 'sub_tops'
regexec.c:4283: error: 're_match_context_t' has no member named 'nsub_tops'
regexec.c:4284: error: 're_match_context_t' has no member named 'sub_tops'
regexec.c:4284: error: 're_match_context_t' has no member named 'nsub_tops'
regexec.c:4286: error: 're_match_context_t' has no member named 'sub_tops'
regexec.c:4286: error: 're_match_context_t' has no member named 'nsub_tops'
regexec.c:4286: error: 'node' undeclared (first use in this function)
regexec.c:4287: error: 're_match_context_t' has no member named 'sub_tops'
regexec.c:4287: error: 're_match_context_t' has no member named 'nsub_tops'
regexec.c:4287: error: 'str_idx' undeclared (first use in this function)
regexec.c: At top level:
regexec.c:4296: error: expected declaration specifiers or '...' before 'Idx'
regexec.c:4296: error: expected declaration specifiers or '...' before 'Idx'
regexec.c: In function 'match_ctx_add_sublast':
regexec.c:4299: error: 're_sub_match_top_t' has no member named 'nlasts'
regexec.c:4299: error: 're_sub_match_top_t' has no member named 'alasts'
regexec.c:4301: error: expected ';' before 'new_alasts'
regexec.c:4302: error: 're_sub_match_top_t' has no member named 'lasts'
regexec.c:4302: error: 'new_alasts' undeclared (first use in this function)
regexec.c:4307: error: 're_sub_match_top_t' has no member named 'lasts'
regexec.c:4308: error: 're_sub_match_top_t' has no member named 'alasts'
regexec.c:4313: error: 're_sub_match_top_t' has no member named 'lasts'
regexec.c:4313: error: 're_sub_match_top_t' has no member named 'nlasts'
regexec.c:4314: error: 're_sub_match_last_t' has no member named 'node'
regexec.c:4314: error: 'node' undeclared (first use in this function)
regexec.c:4315: error: 're_sub_match_last_t' has no member named 'str_idx'
regexec.c:4315: error: 'str_idx' undeclared (first use in this function)
regexec.c:4316: error: 're_sub_match_top_t' has no member named 'nlasts'
regexec.c: At top level:
regexec.c:4326: error: expected declaration specifiers or '...' before 'Idx'
regexec.c:4326: error: expected declaration specifiers or '...' before 'Idx'
regexec.c: In function 'sift_ctx_init':
regexec.c:4330: error: 're_sift_context_t' has no member named 'last_node'
regexec.c:4330: error: 'last_node' undeclared (first use in this function)
regexec.c:4331: error: 're_sift_context_t' has no member named 'last_str_idx'
regexec.c:4331: error: 'last_str_idx' undeclared (first use in this function)
regexec.c:4332: error: 're_sift_context_t' has no member named 'limits'
i686-pc-linux-gnu-gcc -DHAVE_CONFIG_H -I. -I. -I../.. -O2 -march=i686 -fomit-frame-pointer -c dup-safer.c
make[4]: *** [regex.o] Error 1
make[4]: *** Waiting for unfinished jobs....
make[4]: Leaving directory `/var/tmp/paludis/sys-apps/findutils-4.3.0/work/findutils-4.3.0/gnulib/lib'
make[3]: *** [all] Error 2
make[3]: Leaving directory `/var/tmp/paludis/sys-apps/findutils-4.3.0/work/findutils-4.3.0/gnulib/lib'
make[2]: *** [all-recursive] Error 1
make[2]: Leaving directory `/var/tmp/paludis/sys-apps/findutils-4.3.0/work/findutils-4.3.0/gnulib'
make[1]: *** [all-recursive] Error 1
make[1]: Leaving directory `/var/tmp/paludis/sys-apps/findutils-4.3.0/work/findutils-4.3.0'
make: *** [all] Error 2
!!! ERROR in sys-apps/findutils-4.3.0:
!!! In src_compile at line 58
!!! make failed
!!! Call stack:
!!! * src_compile (/mnt/storage/stagepaludis/var/paludis/repositories/gentoo/sys-apps/findutils/findutils-4.3.0.ebuild:58)
!!! * ebuild_f_compile (/usr/libexec/paludis/src_compile.bash:43)
!!! * ebuild_main (/usr/libexec/paludis/ebuild.bash:281)
!!! * main (/usr/libexec/paludis/ebuild.bash:293)
die trap: exiting with error.
Install error:
* In program paludis --config-suffix bootstrap --install --dl-drop-circular system:
* When performing install action from command line:
* When executing install task:
* Install error: Install failed for 'sys-apps/findutils-4.3.0::gentoo'