tdfx_accel.c:899: error 'struct _TDFXRec' has no member named 'sst2DDstFmtShadow'
tdfx_accel.c:908: error 'struct _TDFXRec' has no member named 'sst2DDstFmtShadow'
make[2]: *** [tdfx_accel.lo] Error 1
make[2]: Leaving directory '/var/tmp/portage/xf86-video-tdfx-1.1.1.3/work/xf86-video-tdfx-1.1.1.3/src'
make[1]: *** [all-recursive] Error 1
make[1]: Leaving directory '/var/tmp/portage/xf86-video-tdfx-1.1.1.3/work/xf86-video-tdfx-1.1.1.3/src'
make: *** [all] Error 2
!!! ERROR: x11-drivers/xf86-video-tdfx-1.1.1.3 failed.
Call stack:
ebuild.sh, line 1539: Called dyn_compile
ebuild.sh, line 939: Called src_compile
ebuild.sh, line 1248: Called x-modular_src_compile
x-modular.eclass, line 331: Called x-modular_src_make
x-modular.eclass, line 326: Called die
!!! emake failed
!!! If you need support, post the topmost build error, and the call stack if relevant.