All pastes #159090 Raw Edit

Mine

public text v1 · immutable
·published 2006-09-02 17:46 UTC
rendered paste body
config.status: creating src/config.h
dh_testdir
# Add here commands to compile the package.
/usr/bin/make
make[1]: Entering directory `/tmp/buildd/shmux-1.0'
make[2]: Entering directory `/tmp/buildd/shmux-1.0/src'
i486-linux-gnu-gcc -Wall -g -O0 -Wl,-z,defs   -c -o analyzer.o analyzer.c
i486-linux-gnu-gcc: -z: linker input file unused because linking not done
i486-linux-gnu-gcc: defs: linker input file unused because linking not done
i486-linux-gnu-gcc -Wall -g -O0 -Wl,-z,defs   -c -o byteset.o byteset.c
i486-linux-gnu-gcc: -z: linker input file unused because linking not done
i486-linux-gnu-gcc: defs: linker input file unused because linking not done
i486-linux-gnu-gcc -Wall -g -O0 -Wl,-z,defs   -c -o exec.o exec.c
i486-linux-gnu-gcc: -z: linker input file unused because linking not done
i486-linux-gnu-gcc: defs: linker input file unused because linking not done
i486-linux-gnu-gcc -Wall -g -O0 -Wl,-z,defs   -c -o loop.o loop.c
loop.c: In function 'parse_user':
loop.c:512: warning: suggest explicit braces to avoid ambiguous 'else'
loop.c:522: warning: suggest explicit braces to avoid ambiguous 'else'
loop.c: In function 'loop':
loop.c:1211: warning: implicit declaration of function 'time'
loop.c:1377: warning: implicit declaration of function 'strsignal'
loop.c:1377: warning: format '%s' expects type 'char *', but argument 4 has type 'int'
loop.c:1607: warning: format '%s' expects type 'char *', but argument 4 has type 'int'
loop.c:1623: warning: format '%s' expects type 'char *', but argument 4 has type 'int'
loop.c:1671: warning: zero-length printf format string
i486-linux-gnu-gcc: -z: linker input file unused because linking not done
i486-linux-gnu-gcc: defs: linker input file unused because linking not done
i486-linux-gnu-gcc -Wall -g -O0 -Wl,-z,defs   -c -o shmux.o shmux.c
shmux.c: In function 'main':
shmux.c:343: warning: zero-length printf format string
i486-linux-gnu-gcc: -z: linker input file unused because linking not done
i486-linux-gnu-gcc: defs: linker input file unused because linking not done
cat /usr/include/signal.h /usr/include/sys/signal.h \
                /usr/include/sys/iso/signal_iso.h \
                /usr/include/bits/signum.h 2> /dev/null | \
                awk -f signals.awk > signals.h
i486-linux-gnu-gcc -Wall -g -O0 -Wl,-z,defs   -c -o siglist.o siglist.c
i486-linux-gnu-gcc: -z: linker input file unused because linking not done
i486-linux-gnu-gcc: defs: linker input file unused because linking not done
i486-linux-gnu-gcc -Wall -g -O0 -Wl,-z,defs   -c -o status.o status.c
i486-linux-gnu-gcc: -z: linker input file unused because linking not done
i486-linux-gnu-gcc: defs: linker input file unused because linking not done
i486-linux-gnu-gcc -Wall -g -O0 -Wl,-z,defs   -c -o target.o target.c
target.c: In function 'target_start':
target.c:515: warning: implicit declaration of function 'time'
target.c: In function 'target_results':
target.c:758: warning: zero-length printf format string
target.c:775: warning: zero-length printf format string
target.c:791: warning: zero-length printf format string
target.c:807: warning: zero-length printf format string
i486-linux-gnu-gcc: -z: linker input file unused because linking not done
i486-linux-gnu-gcc: defs: linker input file unused because linking not done
i486-linux-gnu-gcc -Wall -g -O0 -Wl,-z,defs   -c -o term.o term.c
term.c: In function 'term_init':
term.c:142: warning: implicit declaration of function 'tgetent'
term.c:154: warning: implicit declaration of function 'tgetnum'
term.c:163: warning: implicit declaration of function 'tgetstr'
term.c:163: warning: assignment makes pointer from integer without a cast
term.c:166: warning: assignment makes pointer from integer without a cast
term.c:172: warning: assignment makes pointer from integer without a cast
term.c:175: warning: assignment makes pointer from integer without a cast
term.c:178: warning: assignment makes pointer from integer without a cast
term.c:179: warning: assignment makes pointer from integer without a cast
term.c: In function 'term_togglemsg':
term.c:320: warning: control reaches end of non-void function
term.c: In function 'term_toggledbg':
term.c:330: warning: control reaches end of non-void function
term.c: In function 'sprint':
term.c:375: warning: implicit declaration of function 'tputs'
i486-linux-gnu-gcc: -z: linker input file unused because linking not done
i486-linux-gnu-gcc: defs: linker input file unused because linking not done
i486-linux-gnu-gcc -Wall -g -O0 -Wl,-z,defs   -c -o units.o units.c
i486-linux-gnu-gcc: -z: linker input file unused because linking not done
i486-linux-gnu-gcc: defs: linker input file unused because linking not done
i486-linux-gnu-gcc  -Wall -g -O0 -Wl,-z,defs analyzer.o byteset.o exec.o loop.o shmux.o siglist.o status.o target.o term.o units.o   -o shmux
term.o: In function `term_init':/tmp/buildd/shmux-1.0/src/term.c:142: undefined reference to `tgetent'
:/tmp/buildd/shmux-1.0/src/term.c:154: undefined reference to `tgetnum'
:/tmp/buildd/shmux-1.0/src/term.c:163: undefined reference to `tgetstr'
:/tmp/buildd/shmux-1.0/src/term.c:166: undefined reference to `tgetstr'
:/tmp/buildd/shmux-1.0/src/term.c:172: undefined reference to `tgetstr'
:/tmp/buildd/shmux-1.0/src/term.c:175: undefined reference to `tgetstr'
:/tmp/buildd/shmux-1.0/src/term.c:178: undefined reference to `tgetstr'
term.o:/tmp/buildd/shmux-1.0/src/term.c:179: more undefined references to `tgetstr' follow
term.o: In function `sprint':/tmp/buildd/shmux-1.0/src/term.c:375: undefined reference to `tputs'
:/tmp/buildd/shmux-1.0/src/term.c:383: undefined reference to `tputs'
:/tmp/buildd/shmux-1.0/src/term.c:391: undefined reference to `tputs'
:/tmp/buildd/shmux-1.0/src/term.c:392: undefined reference to `tputs'
term.o: In function `uprint':/tmp/buildd/shmux-1.0/src/term.c:430: undefined reference to `tputs'
term.o:/tmp/buildd/shmux-1.0/src/term.c:436: more undefined references to `tputs' follow
collect2: ld returned 1 exit status
make[2]: *** [shmux] Error 1
make[2]: Leaving directory `/tmp/buildd/shmux-1.0/src'
make[1]: *** [shmux] Error 2
make[1]: Leaving directory `/tmp/buildd/shmux-1.0'
make: *** [build-stamp] Error 2
pbuilder: Failed autobuilding of package
 -> Aborting with an error
 -> unmounting dev/pts filesystem
 -> unmounting proc filesystem
 -> cleaning the build env
    -> removing directory /var/cache/pbuilder/build//3196 and its subdirectories