All pastes #1575202 Raw Edit

Stuff

public text v1 · immutable
#1575202 ·published 2009-09-22 13:26 UTC
rendered paste body
cat: ../../VERSION: No such file or directory
mkdir -p cbfs
make -C /home/dave/code/cbtmp/coreboot-v2/util/cbfstool obj=/home/dave/code/cbtmp/coreboot-v2/targets/gigabyte/m57sli/m57sli/cbfs
make[1]: Entering directory `/home/dave/code/cbtmp/coreboot-v2/util/cbfstool'
make[1]: Nothing to be done for `all'.
make[1]: Leaving directory `/home/dave/code/cbtmp/coreboot-v2/util/cbfstool'
make -C normal coreboot.rom
make[1]: Entering directory `/home/dave/code/cbtmp/coreboot-v2/targets/gigabyte/m57sli/m57sli/normal'
gcc -m32 -fno-stack-protector  -fno-stack-protector -I/home/dave/code/cbtmp/coreboot-v2/src/include -I/home/dave/code/cbtmp/coreboot-v2/src/arch/i386/include -I/usr/lib/gcc/i686-pc-linux-gnu/4.4.1/include -include /home/dave/code/cbtmp/coreboot-v2/targets/gigabyte/m57sli/m57sli/normal/settings.h -I/home/dave/code/cbtmp/coreboot-v2/util/x86emu/include -Os -nostdinc -nostdlib -Wall -Wundef -Wstrict-prototypes -Wmissing-prototypes -Wwrite-strings -Wredundant-decls -Wno-trigraphs -Werror-implicit-function-declaration -Wstrict-aliasing -Wshadow -fno-common -ffreestanding -fno-builtin -fomit-frame-pointer -I/home/dave/code/cbtmp/coreboot-v2/src/include -I/home/dave/code/cbtmp/coreboot-v2/src/arch/i386/include -I/usr/lib/gcc/i686-pc-linux-gnu/4.4.1/include -include /home/dave/code/cbtmp/coreboot-v2/targets/gigabyte/m57sli/m57sli/normal/settings.h -I/home/dave/code/cbtmp/coreboot-v2/util/x86emu/include  -I/home/dave/code/cbtmp/coreboot-v2/src -I. -c -S /home/dave/code/cbtmp/coreboot-v2/src/mainboard/gigabyte/m57sli/cache_as_ram_auto.c -o cache_as_ram_auto.inc
In file included from /home/dave/code/cbtmp/coreboot-v2/src/mainboard/gigabyte/m57sli/cache_as_ram_auto.c:60:
/home/dave/code/cbtmp/coreboot-v2/src/pc80/serial.c:101: warning: no previous prototype for uart_init
In file included from /home/dave/code/cbtmp/coreboot-v2/src/mainboard/gigabyte/m57sli/cache_as_ram_auto.c:66:
/home/dave/code/cbtmp/coreboot-v2/src/ram/ramtest.c:137: warning: no previous prototype for ram_check
In file included from /home/dave/code/cbtmp/coreboot-v2/src/mainboard/gigabyte/m57sli/cache_as_ram_auto.c:72:
/home/dave/code/cbtmp/coreboot-v2/src/cpu/amd/model_fxx/apic_timer.c:6: warning: no previous prototype for init_timer
/home/dave/code/cbtmp/coreboot-v2/src/cpu/amd/model_fxx/apic_timer.c:19: warning: no previous prototype for udelay
In file included from /home/dave/code/cbtmp/coreboot-v2/src/mainboard/gigabyte/m57sli/cache_as_ram_auto.c:73:
/home/dave/code/cbtmp/coreboot-v2/src/lib/delay.c:2: warning: no previous prototype for mdelay
/home/dave/code/cbtmp/coreboot-v2/src/lib/delay.c:9: warning: no previous prototype for delay
In file included from /home/dave/code/cbtmp/coreboot-v2/src/cpu/amd/mtrr/amd_earlymtrr.c:5,
                    from /home/dave/code/cbtmp/coreboot-v2/src/mainboard/gigabyte/m57sli/cache_as_ram_auto.c:88:
					/home/dave/code/cbtmp/coreboot-v2/src/cpu/x86/mtrr/earlymtrr.c:22:3: error: #error "CONFIG_XIP_ROM_BASE is not a multiple of CONFIG_XIP_ROM_SIZE"
					In file included from /home/dave/code/cbtmp/coreboot-v2/src/mainboard/gigabyte/m57sli/cache_as_ram_auto.c:115:
					/home/dave/code/cbtmp/coreboot-v2/src/northbridge/amd/amdk8/amdk8_f.h:522: warning: redundant redeclaration of soft_reset
					/home/dave/code/cbtmp/coreboot-v2/src/southbridge/nvidia/mcp55/mcp55_early_ctrl.c:51: note: previous definition of soft_reset was here
					In file included from /home/dave/code/cbtmp/coreboot-v2/src/mainboard/gigabyte/m57sli/cache_as_ram_auto.c:116:
					/home/dave/code/cbtmp/coreboot-v2/src/northbridge/amd/amdk8/coherent_ht.c: In function apply_cpu_errata_fixes:
					/home/dave/code/cbtmp/coreboot-v2/src/northbridge/amd/amdk8/coherent_ht.c:1665: warning: unused variable cmd
					In file included from /home/dave/code/cbtmp/coreboot-v2/src/mainboard/gigabyte/m57sli/cache_as_ram_auto.c:118:
					/home/dave/code/cbtmp/coreboot-v2/src/northbridge/amd/amdk8/incoherent_ht.c: At top level:
					/home/dave/code/cbtmp/coreboot-v2/src/northbridge/amd/amdk8/incoherent_ht.c:841: warning: redundant redeclaration of get_nodes
					/home/dave/code/cbtmp/coreboot-v2/src/northbridge/amd/amdk8/coherent_ht.c:1747: note: previous definition of get_nodes was here
					In file included from /home/dave/code/cbtmp/coreboot-v2/src/mainboard/gigabyte/m57sli/cache_as_ram_auto.c:120:
					/home/dave/code/cbtmp/coreboot-v2/src/northbridge/amd/amdk8/raminit_f.c:732:2: warning: #warning "FIXME implement a better test for opterons"
					In file included from /home/dave/code/cbtmp/coreboot-v2/src/mainboard/gigabyte/m57sli/cache_as_ram_auto.c:120:
					/home/dave/code/cbtmp/coreboot-v2/src/northbridge/amd/amdk8/raminit_f.c:1261: warning: no previous prototype for memory_end_k
					In file included from /home/dave/code/cbtmp/coreboot-v2/src/mainboard/gigabyte/m57sli/cache_as_ram_auto.c:120:
					/home/dave/code/cbtmp/coreboot-v2/src/northbridge/amd/amdk8/raminit_f.c:1701: warning: no previous prototype for find_optimum_spd_latency
					/home/dave/code/cbtmp/coreboot-v2/src/northbridge/amd/amdk8/raminit_f.c: In function spd_set_memclk:
					/home/dave/code/cbtmp/coreboot-v2/src/northbridge/amd/amdk8/raminit_f.c:1862: warning: declaration of value shadows a previous local
					/home/dave/code/cbtmp/coreboot-v2/src/northbridge/amd/amdk8/raminit_f.c:1795: warning: shadowed declaration is here
					/home/dave/code/cbtmp/coreboot-v2/src/northbridge/amd/amdk8/raminit_f.c: At top level:
					/home/dave/code/cbtmp/coreboot-v2/src/northbridge/amd/amdk8/raminit_f.c:1949: warning: no previous prototype for get_dimm_Trc_clocks
					/home/dave/code/cbtmp/coreboot-v2/src/northbridge/amd/amdk8/raminit_f.c:1970:2: warning: #warning We should die here or at least disable this bank.
					In file included from /home/dave/code/cbtmp/coreboot-v2/src/northbridge/amd/amdk8/raminit_f.c:2881,
					                 from /home/dave/code/cbtmp/coreboot-v2/src/mainboard/gigabyte/m57sli/cache_as_ram_auto.c:120:
									 /home/dave/code/cbtmp/coreboot-v2/src/northbridge/amd/amdk8/raminit_f_dqs.c:134: warning: function declaration isnt a prototype
									 /home/dave/code/cbtmp/coreboot-v2/src/northbridge/amd/amdk8/raminit_f_dqs.c:142: warning: function declaration isnt a prototype
									 /home/dave/code/cbtmp/coreboot-v2/src/northbridge/amd/amdk8/raminit_f_dqs.c: In function TrainRcvrEn:
									 /home/dave/code/cbtmp/coreboot-v2/src/northbridge/amd/amdk8/raminit_f_dqs.c:533: warning: unused variable cpu_f0_f1
									 /home/dave/code/cbtmp/coreboot-v2/src/northbridge/amd/amdk8/raminit_f_dqs.c: At top level:
									 /home/dave/code/cbtmp/coreboot-v2/src/northbridge/amd/amdk8/raminit_f_dqs.c:1830: warning: no previous prototype for s3_save_nvram_early
									 /home/dave/code/cbtmp/coreboot-v2/src/northbridge/amd/amdk8/raminit_f_dqs.c:1835: warning: no previous prototype for s3_load_nvram_early
									 In file included from /home/dave/code/cbtmp/coreboot-v2/src/northbridge/amd/amdk8/raminit_f.c:2992,
									                  from /home/dave/code/cbtmp/coreboot-v2/src/mainboard/gigabyte/m57sli/cache_as_ram_auto.c:120:
													  /home/dave/code/cbtmp/coreboot-v2/src/northbridge/amd/amdk8/exit_from_self.c:20: warning: no previous prototype for exit_from_self
													  /home/dave/code/cbtmp/coreboot-v2/src/northbridge/amd/amdk8/exit_from_self.c: In function exit_from_self:
													  /home/dave/code/cbtmp/coreboot-v2/src/northbridge/amd/amdk8/exit_from_self.c:28: warning: declaration of cpuid shadows a global declaration
													  /home/dave/code/cbtmp/coreboot-v2/src/arch/i386/include/arch/cpu.h:34: warning: shadowed declaration is here
													  In file included from /home/dave/code/cbtmp/coreboot-v2/src/mainboard/gigabyte/m57sli/cache_as_ram_auto.c:120:
													  /home/dave/code/cbtmp/coreboot-v2/src/northbridge/amd/amdk8/raminit_f.c: In function sdram_enable:
													  /home/dave/code/cbtmp/coreboot-v2/src/northbridge/amd/amdk8/raminit_f.c:3020: warning: unused variable dtl
													  /home/dave/code/cbtmp/coreboot-v2/src/northbridge/amd/amdk8/raminit_f.c:3099: warning: unused variable dch
													  /home/dave/code/cbtmp/coreboot-v2/src/northbridge/amd/amdk8/raminit_f.c:3011: warning: unused variable dword
													  In file included from /home/dave/code/cbtmp/coreboot-v2/src/mainboard/gigabyte/m57sli/cache_as_ram_auto.c:122:
													  /home/dave/code/cbtmp/coreboot-v2/src/sdram/generic_sdram.c: At top level:
													  /home/dave/code/cbtmp/coreboot-v2/src/sdram/generic_sdram.c:15: warning: no previous prototype for sdram_no_memory
													  /home/dave/code/cbtmp/coreboot-v2/src/sdram/generic_sdram.c:25: warning: no previous prototype for sdram_initialize
													  In file included from /home/dave/code/cbtmp/coreboot-v2/src/mainboard/gigabyte/m57sli/cache_as_ram_auto.c:143:
													  /home/dave/code/cbtmp/coreboot-v2/src/southbridge/nvidia/mcp55/mcp55_early_setup_car.c:22: warning: redundant redeclaration of set_ht_link_buffer_counts_chain
													  /home/dave/code/cbtmp/coreboot-v2/src/northbridge/amd/amdk8/incoherent_ht.c:723: note: previous definition of set_ht_link_buffer_counts_chain was here
													  /home/dave/code/cbtmp/coreboot-v2/src/southbridge/nvidia/mcp55/mcp55_early_setup_car.c: In function mcp55_early_pcie_setup:
													  /home/dave/code/cbtmp/coreboot-v2/src/southbridge/nvidia/mcp55/mcp55_early_setup_car.c:180: warning: large integer implicitly truncated to unsigned type
													  /home/dave/code/cbtmp/coreboot-v2/src/southbridge/nvidia/mcp55/mcp55_early_setup_car.c: In function mcp55_early_setup_x:
													  /home/dave/code/cbtmp/coreboot-v2/src/southbridge/nvidia/mcp55/mcp55_early_setup_car.c:391: warning: unused variable j
													  In file included from /home/dave/code/cbtmp/coreboot-v2/src/mainboard/gigabyte/m57sli/cache_as_ram_auto.c:145:
													  /home/dave/code/cbtmp/coreboot-v2/src/cpu/amd/car/copy_and_run.c: In function copy_and_run:
													  /home/dave/code/cbtmp/coreboot-v2/src/cpu/amd/car/copy_and_run.c:14: warning: passing argument 1 of cbfs_and_run_core discards qualifiers from pointer target type
													  /home/dave/code/cbtmp/coreboot-v2/src/cpu/amd/car/copy_and_run.c:7: note: expected char * but argument is of type const char *
													  In file included from /home/dave/code/cbtmp/coreboot-v2/src/mainboard/gigabyte/m57sli/cache_as_ram_auto.c:147:
													  /home/dave/code/cbtmp/coreboot-v2/src/cpu/amd/car/post_cache_as_ram.c: In function vErrata343:
													  /home/dave/code/cbtmp/coreboot-v2/src/cpu/amd/car/post_cache_as_ram.c:31: warning: unused variable uiMask
													  /home/dave/code/cbtmp/coreboot-v2/src/cpu/amd/car/post_cache_as_ram.c:30: warning: unused variable msr
													  /home/dave/code/cbtmp/coreboot-v2/src/mainboard/gigabyte/m57sli/cache_as_ram_auto.c: At top level:
													  /home/dave/code/cbtmp/coreboot-v2/src/mainboard/gigabyte/m57sli/cache_as_ram_auto.c:233: warning: no previous prototype for cache_as_ram_main
													  /home/dave/code/cbtmp/coreboot-v2/src/mainboard/gigabyte/m57sli/cache_as_ram_auto.c: In function real_main:
													  /home/dave/code/cbtmp/coreboot-v2/src/mainboard/gigabyte/m57sli/cache_as_ram_auto.c:262: warning: initialization makes pointer from integer without a cast
													  make[1]: *** [cache_as_ram_auto.inc] Error 1
													  make[1]: Leaving directory `/home/dave/code/cbtmp/coreboot-v2/targets/gigabyte/m57sli/m57sli/normal'
													  make: *** [normal/coreboot.rom] Error 2
													  zsh: exit 2     make
													  -(~/code/cbtmp/coreboot-v2/targets/gigabyte/m57sli/m57sli)---------------------------------------------------(16:25 Tue Sep 22)
	dave@devbox [1302] -->