gcc -pipe -Wall -Wstrict-prototypes -Wmissing-prototypes -Wmissing-declarations -g -Iinclude -I../include -D_REENTRANT -D_GNU_SOURCE -O6 -march=i686 -DZAPTEL_OPTIMIZATIONS -DASTERISK_VERSION=\"\" -DINSTALL_PREFIX=\"\" -DASTETCDIR=\"/etc/asterisk\" -DASTLIBDIR=\"/usr/lib/asterisk\" -DASTVARLIBDIR=\"/var/lib/asterisk\" -DASTVARRUNDIR=\"/var/run\" -DASTSPOOLDIR=\"/var/spool/asterisk\" -DASTLOGDIR=\"/var/log/asterisk\" -DASTCONFPATH=\"/etc/asterisk/asterisk.conf\" -DASTMODDIR=\"/usr/lib/asterisk/modules\" -DASTAGIDIR=\"/var/lib/asterisk/agi-bin\" -DBUSYDETECT_MARTIN -fPIC -DUSEMYSQLVM -c -o app_rxfax.o app_rxfax.c
app_rxfax.c:50: warning: no previous prototype for `t30_flush'
app_rxfax.c:57: warning: no previous prototype for `phase_e_handler'
app_rxfax.c: In function `phase_e_handler':
app_rxfax.c:68: error: structure has no member named `resolution'
app_rxfax.c:79: error: structure has no member named `resolution'
app_rxfax.c:81: error: structure has no member named `rx_file'
make[1]: *** [app_rxfax.o] Error 1
make[1]: Leaving directory `/usr/src/asterisk/apps'
make: *** [subdirs] Error 1