All pastes #157284 Raw Edit

Anonymous

public text v1 · immutable
·published 2006-09-01 13:50 UTC
rendered paste body
/usr/share/qt3/bin/moc /home/brandon/files/devel/kdebase_suse/suse_kickoff/./kicker/kicker/core/kicker.h -o kicker.moc
/usr/share/qt3/bin/moc /home/brandon/files/devel/kdebase_suse/suse_kickoff/./kicker/kicker/core/panelextension.h -o panelextension.moc
/usr/share/qt3/bin/moc /home/brandon/files/devel/kdebase_suse/suse_kickoff/./kicker/kicker/core/userrectsel.h -o userrectsel.moc
creating libkicker_core_la.all_cpp.cpp ...
/bin/bash ../../../libtool --silent --tag=CXX --mode=compile g++ -DHAVE_CONFIG_H -I. -I/home/brandon/files/devel/kdebase_suse/suse_kicko
ff/./kicker/kicker/core -I../../.. -I/home/brandon/files/devel/kdebase_suse/suse_kickoff/./kicker/kicker/core/../../libkicker -I../../li
bkicker -I../ui -I/home/brandon/files/devel/kdebase_suse/suse_kickoff/./kicker/kicker/core/../ui -I/home/brandon/files/devel/kdebase_sus
e/suse_kickoff/./kicker/kicker/core/../buttons -I/home/brandon/files/devel/kdebase_suse/suse_kickoff/./libkonq -I/usr/include/kde -I/usr
/share/qt3/include -I.  -I/usr/include/sasl  -pthread -I/usr/include/glib-2.0 -I/usr/lib/glib-2.0/include    -DQT_THREAD_SUPPORT  -D_REE
NTRANT -D_FILE_OFFSET_BITS=64  -Wno-long-long -Wundef -ansi -D_XOPEN_SOURCE=500 -D_BSD_SOURCE -Wcast-align -Wconversion -Wchar-subscript
s -Wall -W -Wpointer-arith -DNDEBUG -DNO_DEBUG -O2 -g -Wall -O2 -Wformat-security -Wmissing-format-attribute -Wno-non-virtual-dtor -fno-
exceptions -fno-check-new -fno-common -DQT_CLEAN_NAMESPACE -DQT_NO_ASCII_CAST -DQT_NO_STL -DQT_NO_COMPAT -DQT_NO_TRANSLATION -D_GNU_SOUR
CE  -c -o libkicker_core_la.all_cpp.lo libkicker_core_la.all_cpp.cpp
In file included from /home/brandon/files/devel/kdebase_suse/suse_kickoff/./kicker/kicker/core/../ui/k_new_mnu.h:43,
                 from /home/brandon/files/devel/kdebase_suse/suse_kickoff/./kicker/kicker/core/kicker.cpp:51,
                 from libkicker_core_la.all_cpp.cpp:3:
/home/brandon/files/devel/kdebase_suse/suse_kickoff/./kicker/kicker/core/../ui/beaglesearch.h:36:27: error: beagle/beagle.h: No such fil
e or directory
In file included from /home/brandon/files/devel/kdebase_suse/suse_kickoff/./kicker/kicker/core/kicker.cpp:51,
                 from libkicker_core_la.all_cpp.cpp:3:
/home/brandon/files/devel/kdebase_suse/suse_kickoff/./kicker/kicker/core/../ui/k_new_mnu.h:46:23: error: kmenubase.h: No such file or di
rectory
/home/brandon/files/devel/kdebase_suse/suse_kickoff/./kicker/kicker/core/../ui/beaglesearch.h:58: error: expected `)' before '*' token
/home/brandon/files/devel/kdebase_suse/suse_kickoff/./kicker/kicker/core/../ui/beaglesearch.h:83: error: ISO C++ forbids declaration of
'BeagleHit' with no type
/home/brandon/files/devel/kdebase_suse/suse_kickoff/./kicker/kicker/core/../ui/beaglesearch.h:83: error: expected ';' before '*' token
/home/brandon/files/devel/kdebase_suse/suse_kickoff/./kicker/kicker/core/../ui/beaglesearch.h: In member function 'const KURL Hit::getUr
i() const':
/home/brandon/files/devel/kdebase_suse/suse_kickoff/./kicker/kicker/core/../ui/beaglesearch.h:63: error: 'hit' was not declared in this
scope
/home/brandon/files/devel/kdebase_suse/suse_kickoff/./kicker/kicker/core/../ui/beaglesearch.h:63: error: 'beagle_hit_get_uri' was not de
clared in this scope
/home/brandon/files/devel/kdebase_suse/suse_kickoff/./kicker/kicker/core/../ui/beaglesearch.h: In member function 'const QString Hit::ge
tType() const':
/home/brandon/files/devel/kdebase_suse/suse_kickoff/./kicker/kicker/core/../ui/beaglesearch.h:64: error: 'hit' was not declared in this
scope
/home/brandon/files/devel/kdebase_suse/suse_kickoff/./kicker/kicker/core/../ui/beaglesearch.h:64: error: 'beagle_hit_get_type' was not d
eclared in this scope
/home/brandon/files/devel/kdebase_suse/suse_kickoff/./kicker/kicker/core/../ui/beaglesearch.h: In member function 'const QString Hit::ge
tMimeType() const':
/home/brandon/files/devel/kdebase_suse/suse_kickoff/./kicker/kicker/core/../ui/beaglesearch.h:65: error: 'hit' was not declared in this
scope
/home/brandon/files/devel/kdebase_suse/suse_kickoff/./kicker/kicker/core/../ui/beaglesearch.h:65: error: 'beagle_hit_get_mime_type' was
not declared in this scope
/home/brandon/files/devel/kdebase_suse/suse_kickoff/./kicker/kicker/core/../ui/beaglesearch.h: In member function 'const QString Hit::ge
tSource() const':
/home/brandon/files/devel/kdebase_suse/suse_kickoff/./kicker/kicker/core/../ui/beaglesearch.h:66: error: 'hit' was not declared in this
scope
/home/brandon/files/devel/kdebase_suse/suse_kickoff/./kicker/kicker/core/../ui/beaglesearch.h:66: error: 'beagle_hit_get_source' was not
 declared in this scope
/home/brandon/files/devel/kdebase_suse/suse_kickoff/./kicker/kicker/core/../ui/beaglesearch.h: In member function 'const KURL Hit::getPa
rentUri() const':
/home/brandon/files/devel/kdebase_suse/suse_kickoff/./kicker/kicker/core/../ui/beaglesearch.h:67: error: 'hit' was not declared in this
scope
/home/brandon/files/devel/kdebase_suse/suse_kickoff/./kicker/kicker/core/../ui/beaglesearch.h:67: error: 'beagle_hit_get_parent_uri' was
 not declared in this scope
/home/brandon/files/devel/kdebase_suse/suse_kickoff/./kicker/kicker/core/../ui/beaglesearch.h: At global scope:
/home/brandon/files/devel/kdebase_suse/suse_kickoff/./kicker/kicker/core/../ui/beaglesearch.h:94: error: 'BeagleHit' has not been declar
ed
/home/brandon/files/devel/kdebase_suse/suse_kickoff/./kicker/kicker/core/../ui/beaglesearch.h:118: error: 'BeagleClient' has not been de
clared
/home/brandon/files/devel/kdebase_suse/suse_kickoff/./kicker/kicker/core/../ui/beaglesearch.h:119: error: 'BeagleQuery' has not been dec
lared
/home/brandon/files/devel/kdebase_suse/suse_kickoff/./kicker/kicker/core/../ui/beaglesearch.h:156: error: 'BeagleQuery' has not been dec
lared
/home/brandon/files/devel/kdebase_suse/suse_kickoff/./kicker/kicker/core/../ui/beaglesearch.h:157: error: 'BeagleHitsAddedResponse' has
not been declared
/home/brandon/files/devel/kdebase_suse/suse_kickoff/./kicker/kicker/core/../ui/beaglesearch.h:160: error: 'BeagleQuery' has not been dec
lared
/home/brandon/files/devel/kdebase_suse/suse_kickoff/./kicker/kicker/core/../ui/beaglesearch.h:161: error: 'BeagleFinishedResponse' has n
ot been declared
/home/brandon/files/devel/kdebase_suse/suse_kickoff/./kicker/kicker/core/../ui/beaglesearch.h:216: error: ISO C++ forbids declaration of
 'BeagleClient' with no type
/home/brandon/files/devel/kdebase_suse/suse_kickoff/./kicker/kicker/core/../ui/beaglesearch.h:216: error: expected ';' before '*' token
/home/brandon/files/devel/kdebase_suse/suse_kickoff/./kicker/kicker/core/../ui/beaglesearch.h:217: error: ISO C++ forbids declaration of
 'BeagleQuery' with no type
/home/brandon/files/devel/kdebase_suse/suse_kickoff/./kicker/kicker/core/../ui/beaglesearch.h:217: error: expected ';' before '*' token
/home/brandon/files/devel/kdebase_suse/suse_kickoff/./kicker/kicker/core/../ui/beaglesearch.h: In constructor 'BeagleSearchClient::Beagl
eSearchClient(int, QObject*, int*, int*, bool)':
/home/brandon/files/devel/kdebase_suse/suse_kickoff/./kicker/kicker/core/../ui/beaglesearch.h:121: error: class 'BeagleSearchClient' doe
s not have any field named 'client'
/home/brandon/files/devel/kdebase_suse/suse_kickoff/./kicker/kicker/core/../ui/beaglesearch.h:122: error: class 'BeagleSearchClient' doe
s not have any field named 'query'
/home/brandon/files/devel/kdebase_suse/suse_kickoff/./kicker/kicker/core/../ui/beaglesearch.h:125: error: 'beagle_client_new' was not de
clared in this scope
/home/brandon/files/devel/kdebase_suse/suse_kickoff/./kicker/kicker/core/../ui/beaglesearch.h: In destructor 'virtual BeagleSearchClient
::~BeagleSearchClient()':
/home/brandon/files/devel/kdebase_suse/suse_kickoff/./kicker/kicker/core/../ui/beaglesearch.h:148: error: 'client' was not declared in t
his scope
/home/brandon/files/devel/kdebase_suse/suse_kickoff/./kicker/kicker/core/../ui/beaglesearch.h:148: error: 'g_object_unref' was not decla
red in this scope
/home/brandon/files/devel/kdebase_suse/suse_kickoff/./kicker/kicker/core/../ui/beaglesearch.h:150: error: 'query' was not declared in th
is scope
/home/brandon/files/devel/kdebase_suse/suse_kickoff/./kicker/kicker/core/../ui/beaglesearch.h:150: error: 'g_object_unref' was not decla
red in this scope
/home/brandon/files/devel/kdebase_suse/suse_kickoff/./kicker/kicker/core/../ui/beaglesearch.h: At global scope:
/home/brandon/files/devel/kdebase_suse/suse_kickoff/./kicker/kicker/core/../ui/beaglesearch.h:227: error: ISO C++ forbids declaration of
 'BeagleQuery' with no type
/home/brandon/files/devel/kdebase_suse/suse_kickoff/./kicker/kicker/core/../ui/beaglesearch.h:227: error: expected ';' before '*' token
/home/brandon/files/devel/kdebase_suse/suse_kickoff/./kicker/kicker/core/../ui/beaglesearch.h:231: error: ISO C++ forbids declaration of
 'BeagleTimestamp' with no type
/home/brandon/files/devel/kdebase_suse/suse_kickoff/./kicker/kicker/core/../ui/beaglesearch.h:231: error: expected ';' before '*' token
/home/brandon/files/devel/kdebase_suse/suse_kickoff/./kicker/kicker/core/../ui/k_new_mnu.h:126: error: expected class-name before '{' to
ken
/home/brandon/files/devel/kdebase_suse/suse_kickoff/./kicker/kicker/core/menumanager.cpp: In member function 'void MenuManager::register                                          KButton(PanelPopupButton*)':
/home/brandon/files/devel/kdebase_suse/suse_kickoff/./kicker/kicker/core/menumanager.cpp:128: warning: format '%x' expects type 'unsigne                                          d int', but argument 2 has type 'PanelPopupButton*'
/home/brandon/files/devel/kdebase_suse/suse_kickoff/./kicker/kicker/core/menumanager.cpp: In member function 'void MenuManager::unregist                                          erKButton(PanelPopupButton*)':
/home/brandon/files/devel/kdebase_suse/suse_kickoff/./kicker/kicker/core/menumanager.cpp:139: warning: format '%x' expects type 'unsigne                                          d int', but argument 2 has type 'PanelPopupButton*'
/home/brandon/files/devel/kdebase_suse/suse_kickoff/./kicker/kicker/core/menumanager.cpp: In member function 'void MenuManager::kmenuAcc                                          elActivated()':
/home/brandon/files/devel/kdebase_suse/suse_kickoff/./kicker/kicker/core/menumanager.cpp:195: warning: format '%x' expects type 'unsigne                                          d int', but argument 2 has type 'KMenuStub*'
/home/brandon/files/devel/kdebase_suse/suse_kickoff/./kicker/kicker/core/menumanager.cpp:217: warning: format '%x' expects type 'unsigne                                          d int', but argument 2 has type 'PanelPopupButton*'
/home/brandon/files/devel/kdebase_suse/suse_kickoff/./kicker/kicker/core/containerarealayout.cpp: In member function 'QWidget* Container                                          AreaLayout::widgetAt(int) const':
/home/brandon/files/devel/kdebase_suse/suse_kickoff/./kicker/kicker/core/containerarealayout.cpp:379: warning: comparison between signed                                           and unsigned integer expressions
make[5]: *** [libkicker_core_la.all_cpp.lo] Error 1
make[5]: Leaving directory `/home/brandon/files/devel/kdebase_suse/suse_kickoff/obj-i486-linux-gnu/kicker/kicker/core'
make[4]: *** [all-recursive] Error 1
make[4]: Leaving directory `/home/brandon/files/devel/kdebase_suse/suse_kickoff/obj-i486-linux-gnu/kicker/kicker'
make[3]: *** [all-recursive] Error 1
make[3]: Leaving directory `/home/brandon/files/devel/kdebase_suse/suse_kickoff/obj-i486-linux-gnu/kicker'
make[2]: *** [all-recursive] Error 1
make[2]: Leaving directory `/home/brandon/files/devel/kdebase_suse/suse_kickoff/obj-i486-linux-gnu'
make[1]: *** [all] Error 2
make[1]: Leaving directory `/home/brandon/files/devel/kdebase_suse/suse_kickoff/obj-i486-linux-gnu'
make: *** [debian/stamp-makefile-build] Error 2
debuild: fatal error at line 1224:
debian/rules build failed