All pastes #156928 Raw Edit

Anonymous

public text v1 · immutable
·published 2006-09-01 04:28 UTC
rendered paste body
[root@sellingblock asterisk-addons]$ make
make[1]: Entering directory `/usr/src/asterisk-addons/menuselect'
make[2]: Entering directory `/usr/src/asterisk-addons/menuselect'
gcc -Wall  -o menuselect.o -g -c -D_GNU_SOURCE menuselect.c
gcc -Wall  -o menuselect_curses.o -g -c -D_GNU_SOURCE  menuselect_curses.c
gcc -g -Wall -o menuselect menuselect.o menuselect_curses.o mxml/libmxml.a -lncurses
make[2]: Leaving directory `/usr/src/asterisk-addons/menuselect'
make[1]: Leaving directory `/usr/src/asterisk-addons/menuselect'
make[1]: Entering directory `/usr/src/asterisk-addons'
build_tools/mkdep -fPIC -fPIC app_addon_sql_mysql.c app_saycountpl.c cdr_addon_mysql.c res_config_mysql.c
gcc -g -c -fPIC -fPIC -o app_addon_sql_mysql.o app_addon_sql_mysql.c
app_addon_sql_mysql.c:78: warning: data definition has no type or storage class
app_addon_sql_mysql.c:440: warning: data definition has no type or storage class
gcc -shared -Xlinker -x -o app_addon_sql_mysql.so app_addon_sql_mysql.o -L/usr/lib/mysql -lmysqlclient -lz -lcrypt -lnsl -lm -L/usr/lib -lssl -lcrypto
gcc -fPIC -fPIC   -c -o app_saycountpl.o app_saycountpl.c
app_saycountpl.c:35: warning: data definition has no type or storage class
app_saycountpl.c: In function `sayword_exec':
app_saycountpl.c:78: warning: assignment from incompatible pointer type
app_saycountpl.c:98: warning: passing arg 2 of `__ast_module_user_remove' from incompatible pointer type
app_saycountpl.c:104: warning: passing arg 2 of `__ast_module_user_remove' from incompatible pointer type
app_saycountpl.c:113: warning: passing arg 2 of `__ast_module_user_remove' from incompatible pointer type
app_saycountpl.c: At top level:
app_saycountpl.c:142: warning: data definition has no type or storage class
gcc -shared -Xlinker -x -o app_saycountpl.so app_saycountpl.o
gcc -g -c -fPIC -fPIC -o cdr_addon_mysql.o cdr_addon_mysql.c
cdr_addon_mysql.c: In function `mysql_log':
cdr_addon_mysql.c:119: error: conflicting types for 'u'
cdr_addon_mysql.c:118: error: previous declaration of 'u' was here
cdr_addon_mysql.c: At top level:
cdr_addon_mysql.c:487: warning: initialization from incompatible pointer type
cdr_addon_mysql.c:487: warning: initialization from incompatible pointer type
make[1]: *** [cdr_addon_mysql.o] Error 1
rm app_saycountpl.o
make[1]: Leaving directory `/usr/src/asterisk-addons'
make: *** [all] Error 2