===> eclipse-3.4.2_1 depends on executable: ant - found
===> eclipse-3.4.2_1 depends on executable: zip - found
===> eclipse-3.4.2_1 depends on executable: unzip - found
===> eclipse-3.4.2_1 depends on file: /usr/local/diablo-jdk1.6.0/bin/java - found
===> eclipse-3.4.2_1 depends on file: /usr/local/lib/libxul/libxul.so - found
===> eclipse-3.4.2_1 depends on executable: gmake - found
===> eclipse-3.4.2_1 depends on file: /usr/local/bin/intltool-extract - found
===> eclipse-3.4.2_1 depends on file: /usr/local/libdata/pkgconfig/gnome-mime-data-2.0.pc - found
===> eclipse-3.4.2_1 depends on executable: pkg-config - found
===> eclipse-3.4.2_1 depends on executable: update-desktop-database - found
===> eclipse-3.4.2_1 depends on shared library: cairo.2 - found
===> eclipse-3.4.2_1 depends on shared library: GLU.1 - found
===> eclipse-3.4.2_1 depends on shared library: esd.2 - found
===> eclipse-3.4.2_1 depends on shared library: atk-1.0.0 - found
===> eclipse-3.4.2_1 depends on shared library: gconf-2.4 - found
===> eclipse-3.4.2_1 depends on shared library: glib-2.0.0 - found
===> eclipse-3.4.2_1 depends on shared library: gnomevfs-2.0 - found
===> eclipse-3.4.2_1 depends on shared library: gtk-x11-2.0.0 - found
===> eclipse-3.4.2_1 depends on shared library: art_lgpl_2.5 - found
===> eclipse-3.4.2_1 depends on shared library: bonobo-2.0 - found
===> eclipse-3.4.2_1 depends on shared library: bonoboui-2.0 - found
===> eclipse-3.4.2_1 depends on shared library: glade-2.0.0 - found
===> eclipse-3.4.2_1 depends on shared library: gnome-2.0 - found
===> eclipse-3.4.2_1 depends on shared library: gnomecanvas-2.0 - found
===> eclipse-3.4.2_1 depends on shared library: gnomeui-2.0 - not found
===> Verifying install for gnomeui-2.0 in /usr/ports/x11-toolkits/libgnomeui
===> libgnomeui-2.24.1_1 depends on executable: gmake - found
===> libgnomeui-2.24.1_1 depends on executable: bison - found
===> libgnomeui-2.24.1_1 depends on file: /usr/local/libdata/pkgconfig/sm.pc - found
===> libgnomeui-2.24.1_1 depends on package: libtool>=2.2 - found
===> libgnomeui-2.24.1_1 depends on file: /usr/local/bin/intltool-extract - found
===> libgnomeui-2.24.1_1 depends on file: /usr/local/libdata/pkgconfig/gnome-mime-data-2.0.pc - found
===> libgnomeui-2.24.1_1 depends on executable: pkg-config - found
===> libgnomeui-2.24.1_1 depends on shared library: gnome-keyring.0 - found
===> libgnomeui-2.24.1_1 depends on shared library: startup-notification-1.0 - found
===> libgnomeui-2.24.1_1 depends on shared library: intl - found
===> libgnomeui-2.24.1_1 depends on shared library: esd.2 - found
===> libgnomeui-2.24.1_1 depends on shared library: atk-1.0.0 - found
===> libgnomeui-2.24.1_1 depends on shared library: gconf-2.4 - found
===> libgnomeui-2.24.1_1 depends on shared library: glib-2.0.0 - found
===> libgnomeui-2.24.1_1 depends on shared library: gnomevfs-2.0 - found
===> libgnomeui-2.24.1_1 depends on shared library: gtk-x11-2.0.0 - found
===> libgnomeui-2.24.1_1 depends on shared library: gvfscommon.0 - not found
===> Verifying install for gvfscommon.0 in /usr/ports/devel/gvfs
===> gvfs-1.2.3_2 depends on executable: gmake - found
===> gvfs-1.2.3_2 depends on file: /usr/local/bin/intltool-extract - found
===> gvfs-1.2.3_2 depends on executable: pkg-config - found
===> gvfs-1.2.3_2 depends on shared library: dbus-1.3 - found
===> gvfs-1.2.3_2 depends on shared library: hal.1 - found
===> gvfs-1.2.3_2 depends on shared library: soup-2.4.1 - not found
===> Verifying install for soup-2.4.1 in /usr/ports/devel/libsoup
===> Building for libsoup-2.26.3_2
gmake all-recursive
gmake[1]: Entering directory `/usr/ports/devel/libsoup/work/libsoup-2.26.3'
Making all in libsoup
gmake[2]: Entering directory `/usr/ports/devel/libsoup/work/libsoup-2.26.3/libsoup'
gmake all-am
gmake[3]: Entering directory `/usr/ports/devel/libsoup/work/libsoup-2.26.3/libsoup'
/bin/sh /usr/ports/devel/libsoup/work/gnome-libtool --tag=CC --mode=compile cc -DHAVE_CONFIG_H -I. -I.. -DG_LOG_DOMAIN=\"libsoup\" -I.. -D_REENTRANT -I/usr/local/include/glib-2.0 -I/usr/local/lib/glib-2.0/include -DG_DISABLE_SINGLE_INCLUDES -I/usr/local/include/libxml2 -I/usr/local/include -DORBIT2=1 -D_REENTRANT -I/usr/local/include/gconf/2 -I/usr/local/include/orbit-2.0 -I/usr/local/include/dbus-1.0 -I/usr/local/include/dbus-1.0/include -I/usr/local/include/glib-2.0 -I/usr/local/lib/glib-2.0/include -I/usr/local/include -I/usr/local/include -I/usr/local/include -I/usr/local/include -I/usr/local/include -O2 -pipe -fno-strict-aliasing -Wall -Wstrict-prototypes -Wmissing-declarations -Wmissing-prototypes -Wnested-externs -Wpointer-arith -Wdeclaration-after-statement -Wformat=2 -Winit-self -Waggregate-return -Wmissing-format-attribute -Wundef -D_REENTRANT -MT soup-gnutls.lo -MD -MP -MF .deps/soup-gnutls.Tpo -c -o soup-gnutls.lo soup-gnutls.c
gnome-libtool: compile: cc -DHAVE_CONFIG_H -I. -I.. -DG_LOG_DOMAIN=\"libsoup\" -I.. -D_REENTRANT -I/usr/local/include/glib-2.0 -I/usr/local/lib/glib-2.0/include -DG_DISABLE_SINGLE_INCLUDES -I/usr/local/include/libxml2 -I/usr/local/include -DORBIT2=1 -D_REENTRANT -I/usr/local/include/gconf/2 -I/usr/local/include/orbit-2.0 -I/usr/local/include/dbus-1.0 -I/usr/local/include/dbus-1.0/include -I/usr/local/include/glib-2.0 -I/usr/local/lib/glib-2.0/include -I/usr/local/include -I/usr/local/include -I/usr/local/include -I/usr/local/include -I/usr/local/include -O2 -pipe -fno-strict-aliasing -Wall -Wstrict-prototypes -Wmissing-declarations -Wmissing-prototypes -Wnested-externs -Wpointer-arith -Wdeclaration-after-statement -Wformat=2 -Winit-self -Waggregate-return -Wmissing-format-attribute -Wundef -D_REENTRANT -MT soup-gnutls.lo -MD -MP -MF .deps/soup-gnutls.Tpo -c soup-gnutls.c -fPIC -DPIC -o .libs/soup-gnutls.o
soup-gnutls.c:27:27: error: gnutls/gnutls.h: No such file or directory
soup-gnutls.c:28:25: error: gnutls/x509.h: No such file or directory
soup-gnutls.c:43: error: expected specifier-qualifier-list before 'gnutls_certificate_credentials'
soup-gnutls.c:52: error: expected specifier-qualifier-list before 'gnutls_session'
soup-gnutls.c:60: error: expected ')' before 'session'
soup-gnutls.c: In function 'do_handshake':
soup-gnutls.c:146: warning: implicit declaration of function 'gnutls_handshake'
soup-gnutls.c:146: warning: nested extern declaration of 'gnutls_handshake'
soup-gnutls.c:146: error: 'SoupGNUTLSChannel' has no member named 'session'
soup-gnutls.c:148: error: 'GNUTLS_E_AGAIN' undeclared (first use in this function)
soup-gnutls.c:148: error: (Each undeclared identifier is reported only once
soup-gnutls.c:148: error: for each function it appears in.)
soup-gnutls.c:148: error: 'GNUTLS_E_INTERRUPTED' undeclared (first use in this function)
soup-gnutls.c:151: warning: implicit declaration of function 'gnutls_record_get_direction'
soup-gnutls.c:151: warning: nested extern declaration of 'gnutls_record_get_direction'
soup-gnutls.c:151: error: 'SoupGNUTLSChannel' has no member named 'session'
soup-gnutls.c:167: error: 'SoupGNUTLSChannel' has no member named 'type'
soup-gnutls.c:167: error: 'SoupGNUTLSChannel' has no member named 'creds'
soup-gnutls.c:168: warning: implicit declaration of function 'verify_certificate'
soup-gnutls.c:168: warning: nested extern declaration of 'verify_certificate'
soup-gnutls.c:168: error: 'SoupGNUTLSChannel' has no member named 'session'
soup-gnutls.c:168: error: 'SoupGNUTLSChannel' has no member named 'hostname'
soup-gnutls.c: In function 'soup_gnutls_read':
soup-gnutls.c:187: error: 'SoupGNUTLSChannel' has no member named 'established'
soup-gnutls.c:194: error: 'SoupGNUTLSChannel' has no member named 'established'
soup-gnutls.c:197: warning: implicit declaration of function 'gnutls_record_recv'
soup-gnutls.c:197: warning: nested extern declaration of 'gnutls_record_recv'
soup-gnutls.c:197: error: 'SoupGNUTLSChannel' has no member named 'session'
soup-gnutls.c:199: error: 'GNUTLS_E_REHANDSHAKE' undeclared (first use in this function)
soup-gnutls.c:200: error: 'SoupGNUTLSChannel' has no member named 'established'
soup-gnutls.c:204: error: 'GNUTLS_E_INTERRUPTED' undeclared (first use in this function)
soup-gnutls.c:204: error: 'GNUTLS_E_AGAIN' undeclared (first use in this function)
soup-gnutls.c:211: error: 'GNUTLS_E_UNEXPECTED_PACKET_LENGTH' undeclared (first use in this function)
soup-gnutls.c: In function 'soup_gnutls_write':
soup-gnutls.c:249: error: 'SoupGNUTLSChannel' has no member named 'established'
soup-gnutls.c:256: error: 'SoupGNUTLSChannel' has no member named 'established'
soup-gnutls.c:259: warning: implicit declaration of function 'gnutls_record_send'
soup-gnutls.c:259: warning: nested extern declaration of 'gnutls_record_send'
soup-gnutls.c:259: error: 'SoupGNUTLSChannel' has no member named 'session'
soup-gnutls.c:264: error: 'GNUTLS_E_REHANDSHAKE' undeclared (first use in this function)
soup-gnutls.c:265: error: 'SoupGNUTLSChannel' has no member named 'established'
soup-gnutls.c:269: error: 'GNUTLS_E_INTERRUPTED' undeclared (first use in this function)
soup-gnutls.c:269: error: 'GNUTLS_E_AGAIN' undeclared (first use in this function)
soup-gnutls.c: In function 'soup_gnutls_close':
soup-gnutls.c:305: error: 'SoupGNUTLSChannel' has no member named 'established'
soup-gnutls.c:309: warning: implicit declaration of function 'gnutls_bye'
soup-gnutls.c:309: warning: nested extern declaration of 'gnutls_bye'
soup-gnutls.c:309: error: 'SoupGNUTLSChannel' has no member named 'session'
soup-gnutls.c:309: error: 'GNUTLS_SHUT_WR' undeclared (first use in this function)
soup-gnutls.c:310: error: 'GNUTLS_E_INTERRUPTED' undeclared (first use in this function)
soup-gnutls.c: In function 'soup_gnutls_free':
soup-gnutls.c:331: warning: implicit declaration of function 'gnutls_deinit'
soup-gnutls.c:331: warning: nested extern declaration of 'gnutls_deinit'
soup-gnutls.c:331: error: 'SoupGNUTLSChannel' has no member named 'session'
soup-gnutls.c:332: error: 'SoupGNUTLSChannel' has no member named 'hostname'
soup-gnutls.c: At top level:
soup-gnutls.c:365: error: expected '=', ',', ';', 'asm' or '__attribute__' before 'dh_params'
soup-gnutls.c: In function 'init_dh_params':
soup-gnutls.c:373: warning: implicit declaration of function 'gnutls_dh_params_init'
soup-gnutls.c:373: warning: nested extern declaration of 'gnutls_dh_params_init'
soup-gnutls.c:373: error: 'dh_params' undeclared (first use in this function)
soup-gnutls.c:374: warning: implicit declaration of function 'gnutls_dh_params_generate2'
soup-gnutls.c:374: warning: nested extern declaration of 'gnutls_dh_params_generate2'
soup-gnutls.c:376: warning: implicit declaration of function 'gnutls_dh_params_deinit'
soup-gnutls.c:376: warning: nested extern declaration of 'gnutls_dh_params_deinit'
soup-gnutls.c: At top level:
soup-gnutls.c:387: error: expected ')' before 'transport_data'
soup-gnutls.c:399: error: expected ')' before 'transport_data'
soup-gnutls.c: In function 'soup_ssl_wrap_iochannel':
soup-gnutls.c:431: error: 'gnutls_session' undeclared (first use in this function)
soup-gnutls.c:431: error: expected ';' before 'session'
soup-gnutls.c:432: warning: ISO C90 forbids mixed declarations and code
soup-gnutls.c:444: warning: implicit declaration of function 'gnutls_init'
soup-gnutls.c:444: warning: nested extern declaration of 'gnutls_init'
soup-gnutls.c:444: error: 'session' undeclared (first use in this function)
soup-gnutls.c:445: error: 'GNUTLS_CLIENT' undeclared (first use in this function)
soup-gnutls.c:445: error: 'GNUTLS_SERVER' undeclared (first use in this function)
soup-gnutls.c:450: warning: implicit declaration of function 'gnutls_priority_set_direct'
soup-gnutls.c:450: warning: nested extern declaration of 'gnutls_priority_set_direct'
soup-gnutls.c:453: warning: implicit declaration of function 'gnutls_credentials_set'
soup-gnutls.c:453: warning: nested extern declaration of 'gnutls_credentials_set'
soup-gnutls.c:453: error: 'GNUTLS_CRD_CERTIFICATE' undeclared (first use in this function)
soup-gnutls.c:454: error: 'SoupSSLCredentials' has no member named 'creds'
soup-gnutls.c:458: warning: implicit declaration of function 'gnutls_dh_set_prime_bits'
soup-gnutls.c:458: warning: nested extern declaration of 'gnutls_dh_set_prime_bits'
soup-gnutls.c:463: error: 'SoupGNUTLSChannel' has no member named 'session'
soup-gnutls.c:464: error: 'SoupGNUTLSChannel' has no member named 'creds'
soup-gnutls.c:465: error: 'SoupGNUTLSChannel' has no member named 'hostname'
soup-gnutls.c:466: error: 'SoupGNUTLSChannel' has no member named 'type'
soup-gnutls.c:470: warning: implicit declaration of function 'gnutls_transport_set_ptr'
soup-gnutls.c:470: warning: nested extern declaration of 'gnutls_transport_set_ptr'
soup-gnutls.c:471: warning: implicit declaration of function 'gnutls_transport_set_push_function'
soup-gnutls.c:471: warning: nested extern declaration of 'gnutls_transport_set_push_function'
soup-gnutls.c:471: error: 'soup_gnutls_push_func' undeclared (first use in this function)
soup-gnutls.c:472: warning: implicit declaration of function 'gnutls_transport_set_pull_function'
soup-gnutls.c:472: warning: nested extern declaration of 'gnutls_transport_set_pull_function'
soup-gnutls.c:472: error: 'soup_gnutls_pull_func' undeclared (first use in this function)
soup-gnutls.c: In function 'soup_gnutls_init':
soup-gnutls.c:501: warning: implicit declaration of function 'gnutls_global_init'
soup-gnutls.c:501: warning: nested extern declaration of 'gnutls_global_init'
soup-gnutls.c: In function 'soup_ssl_get_client_credentials':
soup-gnutls.c:530: warning: implicit declaration of function 'gnutls_certificate_allocate_credentials'
soup-gnutls.c:530: warning: nested extern declaration of 'gnutls_certificate_allocate_credentials'
soup-gnutls.c:530: error: 'SoupSSLCredentials' has no member named 'creds'
soup-gnutls.c:533: error: 'SoupSSLCredentials' has no member named 'have_ca_file'
soup-gnutls.c:534: warning: implicit declaration of function 'gnutls_certificate_set_x509_trust_file'
soup-gnutls.c:534: warning: nested extern declaration of 'gnutls_certificate_set_x509_trust_file'
soup-gnutls.c:535: error: 'SoupSSLCredentials' has no member named 'creds'
soup-gnutls.c:535: error: 'GNUTLS_X509_FMT_PEM' undeclared (first use in this function)
soup-gnutls.c: In function 'soup_ssl_free_client_credentials':
soup-gnutls.c:560: warning: implicit declaration of function 'gnutls_certificate_free_credentials'
soup-gnutls.c:560: warning: nested extern declaration of 'gnutls_certificate_free_credentials'
soup-gnutls.c:560: error: 'SoupSSLCredentials' has no member named 'creds'
soup-gnutls.c: In function 'soup_ssl_get_server_credentials':
soup-gnutls.c:587: error: 'SoupSSLCredentials' has no member named 'creds'
soup-gnutls.c:589: warning: implicit declaration of function 'gnutls_certificate_set_x509_key_file'
soup-gnutls.c:589: warning: nested extern declaration of 'gnutls_certificate_set_x509_key_file'
soup-gnutls.c:589: error: 'SoupSSLCredentials' has no member named 'creds'
soup-gnutls.c:591: error: 'GNUTLS_X509_FMT_PEM' undeclared (first use in this function)
soup-gnutls.c:598: warning: implicit declaration of function 'gnutls_certificate_set_dh_params'
soup-gnutls.c:598: warning: nested extern declaration of 'gnutls_certificate_set_dh_params'
soup-gnutls.c:598: error: 'SoupSSLCredentials' has no member named 'creds'
soup-gnutls.c:598: error: 'dh_params' undeclared (first use in this function)
soup-gnutls.c: In function 'soup_ssl_free_server_credentials':
soup-gnutls.c:612: error: 'SoupSSLCredentials' has no member named 'creds'
gmake[3]: *** [soup-gnutls.lo] Error 1
gmake[3]: Leaving directory `/usr/ports/devel/libsoup/work/libsoup-2.26.3/libsoup'
gmake[2]: *** [all] Error 2
gmake[2]: Leaving directory `/usr/ports/devel/libsoup/work/libsoup-2.26.3/libsoup'
gmake[1]: *** [all-recursive] Error 1
gmake[1]: Leaving directory `/usr/ports/devel/libsoup/work/libsoup-2.26.3'
gmake: *** [all] Error 2
*** Error code 1
Stop in /usr/ports/devel/libsoup.
*** Error code 1
Stop in /usr/ports/devel/gvfs.
*** Error code 1
Stop in /usr/ports/devel/gvfs.
*** Error code 1
Stop in /usr/ports/x11-toolkits/libgnomeui.
*** Error code 1
Stop in /usr/ports/java/eclipse.