build/genmodes -m > tmp-min-modes.c
/bin/sh /var/tmp/portage/gcc-4.1.1/work/gcc-4.1.1/gcc/../move-if-change tmp-min-modes.c min-insn-modes.c
build/genmodes > tmp-modes.c
/bin/sh /var/tmp/portage/gcc-4.1.1/work/gcc-4.1.1/gcc/../move-if-change tmp-modes.c insn-modes.c
echo timestamp > s-modes
gcc -c -O -DENABLE_CHECKING -DENABLE_ASSERT_CHECKING -DIN_GCC -W -Wall -Wwrite-strings -Wstrict-prototypes -Wmissing-prototypes -Wold-style-definition -Wmissing-format-attribute -DHAVE_CONFIG_H -DGENERATOR_FILE -I. -Ibuild -I/var/tmp/portage/gcc-4.1.1/work/gcc-4.1.1/gcc -I/var/tmp/portage/gcc-4.1.1/work/gcc-4.1.1/gcc/build -I/var/tmp/portage/gcc-4.1.1/work/gcc-4.1.1/gcc/../include -I/var/tmp/portage/gcc-4.1.1/work/gcc-4.1.1/gcc/../libcpp/include -o build/genmddeps.o /var/tmp/portage/gcc-4.1.1/work/gcc-4.1.1/gcc/genmddeps.c
In file included from ./tm.h:4,
from /var/tmp/portage/gcc-4.1.1/work/gcc-4.1.1/gcc/genmddeps.c:21:
./options.h:376: error: redeclaration of enumerator `OP___'
./options.h:375: error: previous definition of 'OP___' was here
./options.h:801: error: redeclaration of enumerator `OP__f_rap_'
./options.h:751: error: previous definition of 'OP__f_rap_' was here
./options.h:909: error: redeclaration of enumerator `OP___'
./options.h:376: error: previous definition of 'OP___' was here
./options.h:909: error: redeclaration of enumerator `OP___'
./options.h:376: error: previous definition of 'OP___' was here
./options.h:911: error: redeclaration of enumerator `OP___'
./options.h:909: error: previous definition of 'OP___' was here
./options.h:911: error: redeclaration of enumerator `OP___'
./options.h:376: error: previous definition of 'OP___' was here
make[2]: *** [build/genmddeps.o] Error 1
make[2]: Leaving directory `/var/tmp/portage/gcc-4.1.1/work/build/gcc'
make[1]: *** [stage1_build] Error 2
make[1]: Leaving directory `/var/tmp/portage/gcc-4.1.1/work/build/gcc'
make: *** [profiledbootstrap] Error 2
!!! ERROR: sys-devel/gcc-4.1.1 failed.
Call stack:
ebuild.sh, line 1539: Called dyn_compile
ebuild.sh, line 939: Called src_compile
ebuild.sh, line 1248: Called toolchain_src_compile
toolchain.eclass, line 24: Called gcc_src_compile
toolchain.eclass, line 1528: Called gcc_do_make
toolchain.eclass, line 1402: Called die
!!! emake failed with profiledbootstrap
!!! If you need support, post the topmost build error, and the call stack if relevant.