rendered paste bodyThis file contains any messages produced by compilers while
running configure, to aid debugging if configure makes a mistake.
It was created by KQ configure 0.99, which was
generated by GNU Autoconf 2.64. Invocation command line was
$ ./configure
## --------- ##
## Platform. ##
## --------- ##
hostname = qbox
uname -m = x86_64
uname -r = 2.6.30-ARCH
uname -s = Linux
uname -v = #1 SMP PREEMPT Mon Aug 17 16:06:45 CEST 2009
/usr/bin/uname -p = unknown
/bin/uname -X = unknown
/bin/arch = x86_64
/usr/bin/arch -k = unknown
/usr/convex/getsysinfo = unknown
/usr/bin/hostinfo = unknown
/bin/machine = unknown
/usr/bin/oslevel = unknown
/bin/universe = unknown
PATH: /bin
PATH: /usr/bin
PATH: /sbin
PATH: /usr/sbin
PATH: /usr/share/java/apache-ant/bin
PATH: /opt/glest/bin
PATH: /opt/java/bin
PATH: /opt/java/jre/bin
PATH: /opt/kde/bin
PATH: /usr/bin/perlbin/site
PATH: /usr/bin/perlbin/vendor
PATH: /usr/bin/perlbin/core
PATH: /opt/qt/bin
PATH: /home/qubodup/.local/bin
## ----------- ##
## Core tests. ##
## ----------- ##
configure:2482: checking build system type
configure:2496: result: x86_64-unknown-linux-gnu
configure:2516: checking host system type
configure:2529: result: x86_64-unknown-linux-gnu
configure:2549: checking for a thread-safe mkdir -p
configure:2588: result: /bin/mkdir -p
configure:2607: checking for a BSD-compatible install
configure:2675: result: /bin/install -c
configure:2686: checking whether build environment is sane
configure:2736: result: yes
configure:2906: checking for gawk
configure:2922: found /bin/gawk
configure:2933: result: gawk
configure:2944: checking whether make sets $(MAKE)
configure:2966: result: yes
configure:3096: checking for gcc
configure:3112: found /usr/bin/gcc
configure:3123: result: gcc
configure:3352: checking for C compiler version
configure:3361: gcc --version >&5
gcc (GCC) 4.4.1
Copyright (C) 2009 Free Software Foundation, Inc.
This is free software; see the source for copying conditions. There is NO
warranty; not even for MERCHANTABILITY or FITNESS FOR A PARTICULAR PURPOSE.
configure:3372: $? = 0
configure:3361: gcc -v >&5
Using built-in specs.
Target: x86_64-unknown-linux-gnu
Configured with: ../configure --prefix=/usr --enable-shared --enable-languages=c,c++,fortran,objc,obj-c++ --enable-threads=posix --mandir=/usr/share/man --infodir=/usr/share/info --enable-__cxa_atexit --disable-multilib --libdir=/usr/lib --libexecdir=/usr/lib --enable-clocale=gnu --disable-libstdcxx-pch --with-tune=generic
Thread model: posix
gcc version 4.4.1 (GCC)
configure:3372: $? = 0
configure:3361: gcc -V >&5
gcc: '-V' option must have argument
configure:3372: $? = 1
configure:3361: gcc -qversion >&5
gcc: unrecognized option '-qversion'
gcc: no input files
configure:3372: $? = 1
configure:3394: checking for C compiler default output file name
configure:3416: gcc conftest.c >&5
configure:3420: $? = 0
configure:3457: result: a.out
configure:3473: checking whether the C compiler works
configure:3482: ./a.out
configure:3486: $? = 0
configure:3501: result: yes
configure:3508: checking whether we are cross compiling
configure:3510: result: no
configure:3513: checking for suffix of executables
configure:3520: gcc -o conftest conftest.c >&5
configure:3524: $? = 0
configure:3546: result:
configure:3552: checking for suffix of object files
configure:3574: gcc -c conftest.c >&5
configure:3578: $? = 0
configure:3599: result: o
configure:3603: checking whether we are using the GNU C compiler
configure:3622: gcc -c conftest.c >&5
configure:3622: $? = 0
configure:3631: result: yes
configure:3640: checking whether gcc accepts -g
configure:3660: gcc -c -g conftest.c >&5
configure:3660: $? = 0
configure:3701: result: yes
configure:3718: checking for gcc option to accept ISO C89
configure:3782: gcc -c -g -O2 conftest.c >&5
configure:3782: $? = 0
configure:3795: result: none needed
configure:3826: checking for style of include used by make
configure:3854: result: GNU
configure:3879: checking dependency style of gcc
configure:3989: result: gcc3
configure:4005: checking whether gcc and cc understand -c and -o together
configure:4036: gcc -c conftest.c -o conftest2.o >&5
configure:4040: $? = 0
configure:4046: gcc -c conftest.c -o conftest2.o >&5
configure:4050: $? = 0
configure:4061: cc -c conftest.c >&5
configure:4065: $? = 0
configure:4073: cc -c conftest.c -o conftest2.o >&5
configure:4077: $? = 0
configure:4083: cc -c conftest.c -o conftest2.o >&5
configure:4087: $? = 0
configure:4105: result: yes
configure:4135: checking how to run the C preprocessor
configure:4166: gcc -E conftest.c
configure:4166: $? = 0
configure:4180: gcc -E conftest.c
conftest.c:11:28: error: ac_nonexistent.h: No such file or directory
configure:4180: $? = 1
configure: failed program was:
| /* confdefs.h */
| #define PACKAGE_NAME "KQ"
| #define PACKAGE_TARNAME "kq"
| #define PACKAGE_VERSION "0.99"
| #define PACKAGE_STRING "KQ 0.99"
| #define PACKAGE_BUGREPORT "peterhull90@users.sourceforge.net"
| #define PACKAGE_URL ""
| #define PACKAGE "kq"
| #define VERSION "0.99"
| /* end confdefs.h. */
| #include <ac_nonexistent.h>
configure:4205: result: gcc -E
configure:4225: gcc -E conftest.c
configure:4225: $? = 0
configure:4239: gcc -E conftest.c
conftest.c:11:28: error: ac_nonexistent.h: No such file or directory
configure:4239: $? = 1
configure: failed program was:
| /* confdefs.h */
| #define PACKAGE_NAME "KQ"
| #define PACKAGE_TARNAME "kq"
| #define PACKAGE_VERSION "0.99"
| #define PACKAGE_STRING "KQ 0.99"
| #define PACKAGE_BUGREPORT "peterhull90@users.sourceforge.net"
| #define PACKAGE_URL ""
| #define PACKAGE "kq"
| #define VERSION "0.99"
| /* end confdefs.h. */
| #include <ac_nonexistent.h>
configure:4272: checking for gcc
configure:4288: found /usr/bin/gcc
configure:4299: result: gcc
configure:4319: checking dependency style of gcc
configure:4427: result: gcc3
configure:4447: checking for grep that handles long lines and -e
configure:4505: result: /bin/grep
configure:4510: checking for egrep
configure:4572: result: /bin/grep -E
configure:4577: checking for ANSI C header files
configure:4597: gcc -c -g -O2 conftest.c >&5
configure:4597: $? = 0
configure:4670: gcc -o conftest -g -O2 conftest.c >&5
configure:4670: $? = 0
configure:4670: ./conftest
configure:4670: $? = 0
configure:4681: result: yes
configure:4694: checking for sys/types.h
configure:4694: gcc -c -g -O2 conftest.c >&5
configure:4694: $? = 0
configure:4694: result: yes
configure:4694: checking for sys/stat.h
configure:4694: gcc -c -g -O2 conftest.c >&5
configure:4694: $? = 0
configure:4694: result: yes
configure:4694: checking for stdlib.h
configure:4694: gcc -c -g -O2 conftest.c >&5
configure:4694: $? = 0
configure:4694: result: yes
configure:4694: checking for string.h
configure:4694: gcc -c -g -O2 conftest.c >&5
configure:4694: $? = 0
configure:4694: result: yes
configure:4694: checking for memory.h
configure:4694: gcc -c -g -O2 conftest.c >&5
configure:4694: $? = 0
configure:4694: result: yes
configure:4694: checking for strings.h
configure:4694: gcc -c -g -O2 conftest.c >&5
configure:4694: $? = 0
configure:4694: result: yes
configure:4694: checking for inttypes.h
configure:4694: gcc -c -g -O2 conftest.c >&5
configure:4694: $? = 0
configure:4694: result: yes
configure:4694: checking for stdint.h
configure:4694: gcc -c -g -O2 conftest.c >&5
configure:4694: $? = 0
configure:4694: result: yes
configure:4694: checking for unistd.h
configure:4694: gcc -c -g -O2 conftest.c >&5
configure:4694: $? = 0
configure:4694: result: yes
configure:4708: checking minix/config.h usability
configure:4708: gcc -c -g -O2 conftest.c >&5
conftest.c:54:26: error: minix/config.h: No such file or directory
configure:4708: $? = 1
configure: failed program was:
| /* confdefs.h */
| #define PACKAGE_NAME "KQ"
| #define PACKAGE_TARNAME "kq"
| #define PACKAGE_VERSION "0.99"
| #define PACKAGE_STRING "KQ 0.99"
| #define PACKAGE_BUGREPORT "peterhull90@users.sourceforge.net"
| #define PACKAGE_URL ""
| #define PACKAGE "kq"
| #define VERSION "0.99"
| #define STDC_HEADERS 1
| #define HAVE_SYS_TYPES_H 1
| #define HAVE_SYS_STAT_H 1
| #define HAVE_STDLIB_H 1
| #define HAVE_STRING_H 1
| #define HAVE_MEMORY_H 1
| #define HAVE_STRINGS_H 1
| #define HAVE_INTTYPES_H 1
| #define HAVE_STDINT_H 1
| #define HAVE_UNISTD_H 1
| /* end confdefs.h. */
| #include <stdio.h>
| #ifdef HAVE_SYS_TYPES_H
| # include <sys/types.h>
| #endif
| #ifdef HAVE_SYS_STAT_H
| # include <sys/stat.h>
| #endif
| #ifdef STDC_HEADERS
| # include <stdlib.h>
| # include <stddef.h>
| #else
| # ifdef HAVE_STDLIB_H
| # include <stdlib.h>
| # endif
| #endif
| #ifdef HAVE_STRING_H
| # if !defined STDC_HEADERS && defined HAVE_MEMORY_H
| # include <memory.h>
| # endif
| # include <string.h>
| #endif
| #ifdef HAVE_STRINGS_H
| # include <strings.h>
| #endif
| #ifdef HAVE_INTTYPES_H
| # include <inttypes.h>
| #endif
| #ifdef HAVE_STDINT_H
| # include <stdint.h>
| #endif
| #ifdef HAVE_UNISTD_H
| # include <unistd.h>
| #endif
| #include <minix/config.h>
configure:4708: result: no
configure:4708: checking minix/config.h presence
configure:4708: gcc -E conftest.c
conftest.c:21:26: error: minix/config.h: No such file or directory
configure:4708: $? = 1
configure: failed program was:
| /* confdefs.h */
| #define PACKAGE_NAME "KQ"
| #define PACKAGE_TARNAME "kq"
| #define PACKAGE_VERSION "0.99"
| #define PACKAGE_STRING "KQ 0.99"
| #define PACKAGE_BUGREPORT "peterhull90@users.sourceforge.net"
| #define PACKAGE_URL ""
| #define PACKAGE "kq"
| #define VERSION "0.99"
| #define STDC_HEADERS 1
| #define HAVE_SYS_TYPES_H 1
| #define HAVE_SYS_STAT_H 1
| #define HAVE_STDLIB_H 1
| #define HAVE_STRING_H 1
| #define HAVE_MEMORY_H 1
| #define HAVE_STRINGS_H 1
| #define HAVE_INTTYPES_H 1
| #define HAVE_STDINT_H 1
| #define HAVE_UNISTD_H 1
| /* end confdefs.h. */
| #include <minix/config.h>
configure:4708: result: no
configure:4708: checking for minix/config.h
configure:4708: result: no
configure:4729: checking whether it is safe to define __EXTENSIONS__
configure:4747: gcc -c -g -O2 conftest.c >&5
configure:4747: $? = 0
configure:4754: result: yes
configure:4769: checking whether NLS is requested
configure:4778: result: yes
configure:4816: checking for msgfmt
configure: trying /usr/bin/msgfmt...
0 translated messages.
configure:4848: result: /usr/bin/msgfmt
configure:4857: checking for gmsgfmt
configure:4888: result: /usr/bin/msgfmt
configure:4939: checking for xgettext
configure: trying /usr/bin/xgettext...
/usr/bin/xgettext: warning: file `/dev/null' extension `' is unknown; will try C
configure:4971: result: /usr/bin/xgettext
configure:5017: checking for msgmerge
configure: trying /usr/bin/msgmerge...
configure:5048: result: /usr/bin/msgmerge
configure:5063: checking whether we are using the GNU C Library 2 or newer
configure:5090: result: yes
configure:5139: checking for ranlib
configure:5155: found /usr/bin/ranlib
configure:5166: result: ranlib
configure:5193: checking for simple visibility declarations
configure:5215: gcc -c -g -O2 -fvisibility=hidden conftest.c >&5
configure:5215: $? = 0
configure:5224: result: yes
configure:5239: checking for inline
configure:5255: gcc -c -g -O2 conftest.c >&5
configure:5255: $? = 0
configure:5263: result: inline
configure:5281: checking for size_t
configure:5281: gcc -c -g -O2 conftest.c >&5
configure:5281: $? = 0
configure:5281: gcc -c -g -O2 conftest.c >&5
conftest.c: In function 'main':
conftest.c:63: error: expected expression before ')' token
configure:5281: $? = 1
configure: failed program was:
| /* confdefs.h */
| #define PACKAGE_NAME "KQ"
| #define PACKAGE_TARNAME "kq"
| #define PACKAGE_VERSION "0.99"
| #define PACKAGE_STRING "KQ 0.99"
| #define PACKAGE_BUGREPORT "peterhull90@users.sourceforge.net"
| #define PACKAGE_URL ""
| #define PACKAGE "kq"
| #define VERSION "0.99"
| #define STDC_HEADERS 1
| #define HAVE_SYS_TYPES_H 1
| #define HAVE_SYS_STAT_H 1
| #define HAVE_STDLIB_H 1
| #define HAVE_STRING_H 1
| #define HAVE_MEMORY_H 1
| #define HAVE_STRINGS_H 1
| #define HAVE_INTTYPES_H 1
| #define HAVE_STDINT_H 1
| #define HAVE_UNISTD_H 1
| #define __EXTENSIONS__ 1
| #define _ALL_SOURCE 1
| #define _GNU_SOURCE 1
| #define _POSIX_PTHREAD_SEMANTICS 1
| #define _TANDEM_SOURCE 1
| #define HAVE_VISIBILITY 1
| /* end confdefs.h. */
| #include <stdio.h>
| #ifdef HAVE_SYS_TYPES_H
| # include <sys/types.h>
| #endif
| #ifdef HAVE_SYS_STAT_H
| # include <sys/stat.h>
| #endif
| #ifdef STDC_HEADERS
| # include <stdlib.h>
| # include <stddef.h>
| #else
| # ifdef HAVE_STDLIB_H
| # include <stdlib.h>
| # endif
| #endif
| #ifdef HAVE_STRING_H
| # if !defined STDC_HEADERS && defined HAVE_MEMORY_H
| # include <memory.h>
| # endif
| # include <string.h>
| #endif
| #ifdef HAVE_STRINGS_H
| # include <strings.h>
| #endif
| #ifdef HAVE_INTTYPES_H
| # include <inttypes.h>
| #endif
| #ifdef HAVE_STDINT_H
| # include <stdint.h>
| #endif
| #ifdef HAVE_UNISTD_H
| # include <unistd.h>
| #endif
| int
| main ()
| {
| if (sizeof ((size_t)))
| return 0;
| ;
| return 0;
| }
configure:5281: result: yes
configure:5293: checking for stdint.h
configure:5310: gcc -c -g -O2 conftest.c >&5
configure:5310: $? = 0
configure:5317: result: yes
configure:5329: checking for working alloca.h
configure:5346: gcc -o conftest -g -O2 conftest.c >&5
configure:5346: $? = 0
configure:5354: result: yes
configure:5362: checking for alloca
configure:5399: gcc -o conftest -g -O2 conftest.c >&5
configure:5399: $? = 0
configure:5407: result: yes
configure:5520: checking for stdlib.h
configure:5520: result: yes
configure:5520: checking for unistd.h
configure:5520: result: yes
configure:5533: checking for getpagesize
configure:5533: gcc -o conftest -g -O2 conftest.c >&5
configure:5533: $? = 0
configure:5533: result: yes
configure:5542: checking for working mmap
configure:5679: gcc -o conftest -g -O2 conftest.c >&5
configure:5679: $? = 0
configure:5679: ./conftest
configure:5679: $? = 0
configure:5689: result: yes
configure:5700: checking whether integer division by zero raises SIGFPE
configure:5757: gcc -o conftest -g -O2 conftest.c >&5
conftest.c:52: warning: built-in function 'nan' declared as non-function
configure:5757: $? = 0
configure:5757: ./conftest
configure:5757: $? = 0
configure:5768: result: yes
configure:5781: checking for inttypes.h
configure:5798: gcc -c -g -O2 conftest.c >&5
configure:5798: $? = 0
configure:5805: result: yes
configure:5816: checking for unsigned long long int
configure:5837: gcc -o conftest -g -O2 conftest.c >&5
configure:5837: $? = 0
configure:5845: result: yes
configure:5884: checking for inttypes.h
configure:5884: result: yes
configure:5895: checking whether the inttypes.h PRIxNN macros are broken
configure:5916: gcc -c -g -O2 conftest.c >&5
configure:5916: $? = 0
configure:5924: result: no
configure:6019: checking for ld used by GCC
configure:6083: result: /usr/bin/ld
configure:6090: checking if the linker (/usr/bin/ld) is GNU ld
configure:6103: result: yes
configure:6110: checking for shared library run path origin
configure:6123: result: done
configure:6167: checking whether imported symbols can be declared weak
configure:6182: gcc -o conftest -g -O2 conftest.c >&5
configure:6182: $? = 0
configure:6187: result: yes
configure:6192: checking pthread.h usability
configure:6192: gcc -c -g -O2 conftest.c >&5
configure:6192: $? = 0
configure:6192: result: yes
configure:6192: checking pthread.h presence
configure:6192: gcc -E conftest.c
configure:6192: $? = 0
configure:6192: result: yes
configure:6192: checking for pthread.h
configure:6192: result: yes
configure:6220: gcc -o conftest -g -O2 conftest.c >&5
/tmp/cc0Rzdvk.o: In function `main':
/home/qubodup/src/cvs/kq/conftest.c:45: undefined reference to `pthread_mutexattr_init'
collect2: ld returned 1 exit status
configure:6220: $? = 1
configure: failed program was:
| /* confdefs.h */
| #define PACKAGE_NAME "KQ"
| #define PACKAGE_TARNAME "kq"
| #define PACKAGE_VERSION "0.99"
| #define PACKAGE_STRING "KQ 0.99"
| #define PACKAGE_BUGREPORT "peterhull90@users.sourceforge.net"
| #define PACKAGE_URL ""
| #define PACKAGE "kq"
| #define VERSION "0.99"
| #define STDC_HEADERS 1
| #define HAVE_SYS_TYPES_H 1
| #define HAVE_SYS_STAT_H 1
| #define HAVE_STDLIB_H 1
| #define HAVE_STRING_H 1
| #define HAVE_MEMORY_H 1
| #define HAVE_STRINGS_H 1
| #define HAVE_INTTYPES_H 1
| #define HAVE_STDINT_H 1
| #define HAVE_UNISTD_H 1
| #define __EXTENSIONS__ 1
| #define _ALL_SOURCE 1
| #define _GNU_SOURCE 1
| #define _POSIX_PTHREAD_SEMANTICS 1
| #define _TANDEM_SOURCE 1
| #define HAVE_VISIBILITY 1
| #define HAVE_STDINT_H_WITH_UINTMAX 1
| #define HAVE_ALLOCA_H 1
| #define HAVE_ALLOCA 1
| #define HAVE_STDLIB_H 1
| #define HAVE_UNISTD_H 1
| #define HAVE_GETPAGESIZE 1
| #define HAVE_MMAP 1
| #define INTDIV0_RAISES_SIGFPE 1
| #define HAVE_INTTYPES_H_WITH_UINTMAX 1
| #define HAVE_UNSIGNED_LONG_LONG_INT 1
| #define HAVE_UNSIGNED_LONG_LONG 1
| #define HAVE_UINTMAX_T 1
| #define HAVE_INTTYPES_H 1
| /* end confdefs.h. */
| #include <pthread.h>
| int
| main ()
| {
| pthread_mutex_lock((pthread_mutex_t*)0);
| pthread_mutexattr_init((pthread_mutexattr_t*)0);
| ;
| return 0;
| }
configure:6283: checking for pthread_kill in -lpthread
configure:6308: gcc -o conftest -g -O2 conftest.c -lpthread >&5
configure:6308: $? = 0
configure:6317: result: yes
configure:6387: checking for pthread_rwlock_t
configure:6387: gcc -c -g -O2 conftest.c >&5
configure:6387: $? = 0
configure:6387: gcc -c -g -O2 conftest.c >&5
conftest.c: In function 'main':
conftest.c:47: error: expected expression before ')' token
configure:6387: $? = 1
configure: failed program was:
| /* confdefs.h */
| #define PACKAGE_NAME "KQ"
| #define PACKAGE_TARNAME "kq"
| #define PACKAGE_VERSION "0.99"
| #define PACKAGE_STRING "KQ 0.99"
| #define PACKAGE_BUGREPORT "peterhull90@users.sourceforge.net"
| #define PACKAGE_URL ""
| #define PACKAGE "kq"
| #define VERSION "0.99"
| #define STDC_HEADERS 1
| #define HAVE_SYS_TYPES_H 1
| #define HAVE_SYS_STAT_H 1
| #define HAVE_STDLIB_H 1
| #define HAVE_STRING_H 1
| #define HAVE_MEMORY_H 1
| #define HAVE_STRINGS_H 1
| #define HAVE_INTTYPES_H 1
| #define HAVE_STDINT_H 1
| #define HAVE_UNISTD_H 1
| #define __EXTENSIONS__ 1
| #define _ALL_SOURCE 1
| #define _GNU_SOURCE 1
| #define _POSIX_PTHREAD_SEMANTICS 1
| #define _TANDEM_SOURCE 1
| #define HAVE_VISIBILITY 1
| #define HAVE_STDINT_H_WITH_UINTMAX 1
| #define HAVE_ALLOCA_H 1
| #define HAVE_ALLOCA 1
| #define HAVE_STDLIB_H 1
| #define HAVE_UNISTD_H 1
| #define HAVE_GETPAGESIZE 1
| #define HAVE_MMAP 1
| #define INTDIV0_RAISES_SIGFPE 1
| #define HAVE_INTTYPES_H_WITH_UINTMAX 1
| #define HAVE_UNSIGNED_LONG_LONG_INT 1
| #define HAVE_UNSIGNED_LONG_LONG 1
| #define HAVE_UINTMAX_T 1
| #define HAVE_INTTYPES_H 1
| #define USE_POSIX_THREADS 1
| #define USE_POSIX_THREADS_WEAK 1
| /* end confdefs.h. */
| #include <pthread.h>
|
| int
| main ()
| {
| if (sizeof ((pthread_rwlock_t)))
| return 0;
| ;
| return 0;
| }
configure:6387: result: yes
configure:6412: gcc -c -g -O2 conftest.c >&5
configure:6412: $? = 0
configure:6965: checking for multithread API to use
configure:6967: result: posix
configure:7393: gcc -o conftest -g -O2 conftest.c >&5
configure:7393: $? = 0
configure:7404: checking argz.h usability
configure:7404: gcc -c -g -O2 conftest.c >&5
configure:7404: $? = 0
configure:7404: result: yes
configure:7404: checking argz.h presence
configure:7404: gcc -E conftest.c
configure:7404: $? = 0
configure:7404: result: yes
configure:7404: checking for argz.h
configure:7404: result: yes
configure:7404: checking for inttypes.h
configure:7404: result: yes
configure:7404: checking limits.h usability
configure:7404: gcc -c -g -O2 conftest.c >&5
configure:7404: $? = 0
configure:7404: result: yes
configure:7404: checking limits.h presence
configure:7404: gcc -E conftest.c
configure:7404: $? = 0
configure:7404: result: yes
configure:7404: checking for limits.h
configure:7404: result: yes
configure:7404: checking for unistd.h
configure:7404: result: yes
configure:7404: checking sys/param.h usability
configure:7404: gcc -c -g -O2 conftest.c >&5
configure:7404: $? = 0
configure:7404: result: yes
configure:7404: checking sys/param.h presence
configure:7404: gcc -E conftest.c
configure:7404: $? = 0
configure:7404: result: yes
configure:7404: checking for sys/param.h
configure:7404: result: yes
configure:7420: checking for getcwd
configure:7420: gcc -o conftest -g -O2 conftest.c >&5
configure:7420: $? = 0
configure:7420: result: yes
configure:7420: checking for getegid
configure:7420: gcc -o conftest -g -O2 conftest.c >&5
configure:7420: $? = 0
configure:7420: result: yes
configure:7420: checking for geteuid
configure:7420: gcc -o conftest -g -O2 conftest.c >&5
configure:7420: $? = 0
configure:7420: result: yes
configure:7420: checking for getgid
configure:7420: gcc -o conftest -g -O2 conftest.c >&5
configure:7420: $? = 0
configure:7420: result: yes
configure:7420: checking for getuid
configure:7420: gcc -o conftest -g -O2 conftest.c >&5
configure:7420: $? = 0
configure:7420: result: yes
configure:7420: checking for mempcpy
configure:7420: gcc -o conftest -g -O2 conftest.c >&5
conftest.c:78: warning: conflicting types for built-in function 'mempcpy'
configure:7420: $? = 0
configure:7420: result: yes
configure:7420: checking for munmap
configure:7420: gcc -o conftest -g -O2 conftest.c >&5
configure:7420: $? = 0
configure:7420: result: yes
configure:7420: checking for stpcpy
configure:7420: gcc -o conftest -g -O2 conftest.c >&5
conftest.c:80: warning: conflicting types for built-in function 'stpcpy'
configure:7420: $? = 0
configure:7420: result: yes
configure:7420: checking for strcasecmp
configure:7420: gcc -o conftest -g -O2 conftest.c >&5
conftest.c:81: warning: conflicting types for built-in function 'strcasecmp'
configure:7420: $? = 0
configure:7420: result: yes
configure:7420: checking for strdup
configure:7420: gcc -o conftest -g -O2 conftest.c >&5
conftest.c:82: warning: conflicting types for built-in function 'strdup'
configure:7420: $? = 0
configure:7420: result: yes
configure:7420: checking for strtoul
configure:7420: gcc -o conftest -g -O2 conftest.c >&5
configure:7420: $? = 0
configure:7420: result: yes
configure:7420: checking for tsearch
configure:7420: gcc -o conftest -g -O2 conftest.c >&5
configure:7420: $? = 0
configure:7420: result: yes
configure:7420: checking for argz_count
configure:7420: gcc -o conftest -g -O2 conftest.c >&5
configure:7420: $? = 0
configure:7420: result: yes
configure:7420: checking for argz_stringify
configure:7420: gcc -o conftest -g -O2 conftest.c >&5
configure:7420: $? = 0
configure:7420: result: yes
configure:7420: checking for argz_next
configure:7420: gcc -o conftest -g -O2 conftest.c >&5
configure:7420: $? = 0
configure:7420: result: yes
configure:7420: checking for __fsetlocking
configure:7420: gcc -o conftest -g -O2 conftest.c >&5
configure:7420: $? = 0
configure:7420: result: yes
configure:7432: checking whether feof_unlocked is declared
configure:7452: gcc -c -g -O2 conftest.c >&5
configure:7452: $? = 0
configure:7459: result: yes
configure:7473: checking whether fgets_unlocked is declared
configure:7493: gcc -c -g -O2 conftest.c >&5
configure:7493: $? = 0
configure:7500: result: yes
configure:7544: checking for iconv
configure:7566: gcc -o conftest -g -O2 conftest.c >&5
configure:7566: $? = 0
configure:7598: result: yes
configure:7619: checking for iconv declaration
configure:7648: gcc -c -g -O2 conftest.c >&5
configure:7648: $? = 0
configure:7659: result: install-shextern size_t iconv (iconv_t cd, char * *inbuf, size_t *inbytesleft, char * *outbuf, size_t *outbytesleft);
configure:7670: checking for NL_LOCALE_NAME macro
configure:7687: gcc -o conftest -g -O2 conftest.c >&5
configure:7687: $? = 0
configure:7696: result: yes
configure:7708: checking for bison
configure:7724: found /usr/bin/bison
configure:7735: result: bison
configure:7749: checking version of bison
configure:7758: result: 2.4.1, ok
configure:7766: checking for long long int
configure:7789: gcc -o conftest -g -O2 conftest.c >&5
configure:7789: $? = 0
configure:7797: result: yes
configure:7806: checking for long double
configure:7838: result: yes
configure:7847: checking for wchar_t
configure:7864: gcc -c -g -O2 conftest.c >&5
configure:7864: $? = 0
configure:7871: result: yes
configure:7880: checking for wint_t
configure:7897: gcc -c -g -O2 conftest.c >&5
configure:7897: $? = 0
configure:7904: result: yes
configure:7915: checking for intmax_t
configure:7941: gcc -c -g -O2 conftest.c >&5
configure:7941: $? = 0
configure:7948: result: yes
configure:7958: checking whether printf() supports POSIX/XSI format strings
configure:7999: gcc -o conftest -g -O2 conftest.c >&5
configure:7999: $? = 0
configure:7999: ./conftest
configure:7999: $? = 0
configure:8010: result: yes
configure:8021: checking whether we are using the GNU C Library 2.1 or newer
configure:8048: result: yes
configure:8057: checking for stdint.h
configure:8057: result: yes
configure:8067: checking for SIZE_MAX
configure:8141: result: yes
configure:8156: checking for stdint.h
configure:8156: result: yes
configure:8168: checking for CFPreferencesCopyAppValue
configure:8186: gcc -o conftest -g -O2 conftest.c -Wl,-framework -Wl,CoreFoundation >&5
conftest.c:79:42: error: CoreFoundation/CFPreferences.h: No such file or directory
conftest.c: In function 'main':
conftest.c:83: error: 'NULL' undeclared (first use in this function)
conftest.c:83: error: (Each undeclared identifier is reported only once
conftest.c:83: error: for each function it appears in.)
configure:8186: $? = 1
configure: failed program was:
| /* confdefs.h */
| #define PACKAGE_NAME "KQ"
| #define PACKAGE_TARNAME "kq"
| #define PACKAGE_VERSION "0.99"
| #define PACKAGE_STRING "KQ 0.99"
| #define PACKAGE_BUGREPORT "peterhull90@users.sourceforge.net"
| #define PACKAGE_URL ""
| #define PACKAGE "kq"
| #define VERSION "0.99"
| #define STDC_HEADERS 1
| #define HAVE_SYS_TYPES_H 1
| #define HAVE_SYS_STAT_H 1
| #define HAVE_STDLIB_H 1
| #define HAVE_STRING_H 1
| #define HAVE_MEMORY_H 1
| #define HAVE_STRINGS_H 1
| #define HAVE_INTTYPES_H 1
| #define HAVE_STDINT_H 1
| #define HAVE_UNISTD_H 1
| #define __EXTENSIONS__ 1
| #define _ALL_SOURCE 1
| #define _GNU_SOURCE 1
| #define _POSIX_PTHREAD_SEMANTICS 1
| #define _TANDEM_SOURCE 1
| #define HAVE_VISIBILITY 1
| #define HAVE_STDINT_H_WITH_UINTMAX 1
| #define HAVE_ALLOCA_H 1
| #define HAVE_ALLOCA 1
| #define HAVE_STDLIB_H 1
| #define HAVE_UNISTD_H 1
| #define HAVE_GETPAGESIZE 1
| #define HAVE_MMAP 1
| #define INTDIV0_RAISES_SIGFPE 1
| #define HAVE_INTTYPES_H_WITH_UINTMAX 1
| #define HAVE_UNSIGNED_LONG_LONG_INT 1
| #define HAVE_UNSIGNED_LONG_LONG 1
| #define HAVE_UINTMAX_T 1
| #define HAVE_INTTYPES_H 1
| #define USE_POSIX_THREADS 1
| #define USE_POSIX_THREADS_WEAK 1
| #define HAVE_PTHREAD_RWLOCK 1
| #define HAVE_PTHREAD_MUTEX_RECURSIVE 1
| #define HAVE_BUILTIN_EXPECT 1
| #define HAVE_ARGZ_H 1
| #define HAVE_INTTYPES_H 1
| #define HAVE_LIMITS_H 1
| #define HAVE_UNISTD_H 1
| #define HAVE_SYS_PARAM_H 1
| #define HAVE_GETCWD 1
| #define HAVE_GETEGID 1
| #define HAVE_GETEUID 1
| #define HAVE_GETGID 1
| #define HAVE_GETUID 1
| #define HAVE_MEMPCPY 1
| #define HAVE_MUNMAP 1
| #define HAVE_STPCPY 1
| #define HAVE_STRCASECMP 1
| #define HAVE_STRDUP 1
| #define HAVE_STRTOUL 1
| #define HAVE_TSEARCH 1
| #define HAVE_ARGZ_COUNT 1
| #define HAVE_ARGZ_STRINGIFY 1
| #define HAVE_ARGZ_NEXT 1
| #define HAVE___FSETLOCKING 1
| #define HAVE_DECL_FEOF_UNLOCKED 1
| #define HAVE_DECL_FGETS_UNLOCKED 1
| #define HAVE_ICONV 1
| #define ICONV_CONST
| #define HAVE_NL_LOCALE_NAME 1
| #define HAVE_LONG_LONG_INT 1
| #define HAVE_LONG_DOUBLE 1
| #define HAVE_WCHAR_T 1
| #define HAVE_WINT_T 1
| #define HAVE_INTMAX_T 1
| #define HAVE_POSIX_PRINTF 1
| #define HAVE_STDINT_H 1
| #define HAVE_STDINT_H 1
| /* end confdefs.h. */
| #include <CoreFoundation/CFPreferences.h>
| int
| main ()
| {
| CFPreferencesCopyAppValue(NULL, NULL)
| ;
| return 0;
| }
configure:8195: result: no
configure:8202: checking for CFLocaleCopyCurrent
configure:8220: gcc -o conftest -g -O2 conftest.c -Wl,-framework -Wl,CoreFoundation >&5
conftest.c:79:37: error: CoreFoundation/CFLocale.h: No such file or directory
configure:8220: $? = 1
configure: failed program was:
| /* confdefs.h */
| #define PACKAGE_NAME "KQ"
| #define PACKAGE_TARNAME "kq"
| #define PACKAGE_VERSION "0.99"
| #define PACKAGE_STRING "KQ 0.99"
| #define PACKAGE_BUGREPORT "peterhull90@users.sourceforge.net"
| #define PACKAGE_URL ""
| #define PACKAGE "kq"
| #define VERSION "0.99"
| #define STDC_HEADERS 1
| #define HAVE_SYS_TYPES_H 1
| #define HAVE_SYS_STAT_H 1
| #define HAVE_STDLIB_H 1
| #define HAVE_STRING_H 1
| #define HAVE_MEMORY_H 1
| #define HAVE_STRINGS_H 1
| #define HAVE_INTTYPES_H 1
| #define HAVE_STDINT_H 1
| #define HAVE_UNISTD_H 1
| #define __EXTENSIONS__ 1
| #define _ALL_SOURCE 1
| #define _GNU_SOURCE 1
| #define _POSIX_PTHREAD_SEMANTICS 1
| #define _TANDEM_SOURCE 1
| #define HAVE_VISIBILITY 1
| #define HAVE_STDINT_H_WITH_UINTMAX 1
| #define HAVE_ALLOCA_H 1
| #define HAVE_ALLOCA 1
| #define HAVE_STDLIB_H 1
| #define HAVE_UNISTD_H 1
| #define HAVE_GETPAGESIZE 1
| #define HAVE_MMAP 1
| #define INTDIV0_RAISES_SIGFPE 1
| #define HAVE_INTTYPES_H_WITH_UINTMAX 1
| #define HAVE_UNSIGNED_LONG_LONG_INT 1
| #define HAVE_UNSIGNED_LONG_LONG 1
| #define HAVE_UINTMAX_T 1
| #define HAVE_INTTYPES_H 1
| #define USE_POSIX_THREADS 1
| #define USE_POSIX_THREADS_WEAK 1
| #define HAVE_PTHREAD_RWLOCK 1
| #define HAVE_PTHREAD_MUTEX_RECURSIVE 1
| #define HAVE_BUILTIN_EXPECT 1
| #define HAVE_ARGZ_H 1
| #define HAVE_INTTYPES_H 1
| #define HAVE_LIMITS_H 1
| #define HAVE_UNISTD_H 1
| #define HAVE_SYS_PARAM_H 1
| #define HAVE_GETCWD 1
| #define HAVE_GETEGID 1
| #define HAVE_GETEUID 1
| #define HAVE_GETGID 1
| #define HAVE_GETUID 1
| #define HAVE_MEMPCPY 1
| #define HAVE_MUNMAP 1
| #define HAVE_STPCPY 1
| #define HAVE_STRCASECMP 1
| #define HAVE_STRDUP 1
| #define HAVE_STRTOUL 1
| #define HAVE_TSEARCH 1
| #define HAVE_ARGZ_COUNT 1
| #define HAVE_ARGZ_STRINGIFY 1
| #define HAVE_ARGZ_NEXT 1
| #define HAVE___FSETLOCKING 1
| #define HAVE_DECL_FEOF_UNLOCKED 1
| #define HAVE_DECL_FGETS_UNLOCKED 1
| #define HAVE_ICONV 1
| #define ICONV_CONST
| #define HAVE_NL_LOCALE_NAME 1
| #define HAVE_LONG_LONG_INT 1
| #define HAVE_LONG_DOUBLE 1
| #define HAVE_WCHAR_T 1
| #define HAVE_WINT_T 1
| #define HAVE_INTMAX_T 1
| #define HAVE_POSIX_PRINTF 1
| #define HAVE_STDINT_H 1
| #define HAVE_STDINT_H 1
| /* end confdefs.h. */
| #include <CoreFoundation/CFLocale.h>
| int
| main ()
| {
| CFLocaleCopyCurrent();
| ;
| return 0;
| }
configure:8229: result: no
configure:8247: checking for ptrdiff_t
configure:8247: gcc -c -g -O2 conftest.c >&5
configure:8247: $? = 0
configure:8247: gcc -c -g -O2 conftest.c >&5
conftest.c: In function 'main':
conftest.c:115: error: expected expression before ')' token
configure:8247: $? = 1
configure: failed program was:
| /* confdefs.h */
| #define PACKAGE_NAME "KQ"
| #define PACKAGE_TARNAME "kq"
| #define PACKAGE_VERSION "0.99"
| #define PACKAGE_STRING "KQ 0.99"
| #define PACKAGE_BUGREPORT "peterhull90@users.sourceforge.net"
| #define PACKAGE_URL ""
| #define PACKAGE "kq"
| #define VERSION "0.99"
| #define STDC_HEADERS 1
| #define HAVE_SYS_TYPES_H 1
| #define HAVE_SYS_STAT_H 1
| #define HAVE_STDLIB_H 1
| #define HAVE_STRING_H 1
| #define HAVE_MEMORY_H 1
| #define HAVE_STRINGS_H 1
| #define HAVE_INTTYPES_H 1
| #define HAVE_STDINT_H 1
| #define HAVE_UNISTD_H 1
| #define __EXTENSIONS__ 1
| #define _ALL_SOURCE 1
| #define _GNU_SOURCE 1
| #define _POSIX_PTHREAD_SEMANTICS 1
| #define _TANDEM_SOURCE 1
| #define HAVE_VISIBILITY 1
| #define HAVE_STDINT_H_WITH_UINTMAX 1
| #define HAVE_ALLOCA_H 1
| #define HAVE_ALLOCA 1
| #define HAVE_STDLIB_H 1
| #define HAVE_UNISTD_H 1
| #define HAVE_GETPAGESIZE 1
| #define HAVE_MMAP 1
| #define INTDIV0_RAISES_SIGFPE 1
| #define HAVE_INTTYPES_H_WITH_UINTMAX 1
| #define HAVE_UNSIGNED_LONG_LONG_INT 1
| #define HAVE_UNSIGNED_LONG_LONG 1
| #define HAVE_UINTMAX_T 1
| #define HAVE_INTTYPES_H 1
| #define USE_POSIX_THREADS 1
| #define USE_POSIX_THREADS_WEAK 1
| #define HAVE_PTHREAD_RWLOCK 1
| #define HAVE_PTHREAD_MUTEX_RECURSIVE 1
| #define HAVE_BUILTIN_EXPECT 1
| #define HAVE_ARGZ_H 1
| #define HAVE_INTTYPES_H 1
| #define HAVE_LIMITS_H 1
| #define HAVE_UNISTD_H 1
| #define HAVE_SYS_PARAM_H 1
| #define HAVE_GETCWD 1
| #define HAVE_GETEGID 1
| #define HAVE_GETEUID 1
| #define HAVE_GETGID 1
| #define HAVE_GETUID 1
| #define HAVE_MEMPCPY 1
| #define HAVE_MUNMAP 1
| #define HAVE_STPCPY 1
| #define HAVE_STRCASECMP 1
| #define HAVE_STRDUP 1
| #define HAVE_STRTOUL 1
| #define HAVE_TSEARCH 1
| #define HAVE_ARGZ_COUNT 1
| #define HAVE_ARGZ_STRINGIFY 1
| #define HAVE_ARGZ_NEXT 1
| #define HAVE___FSETLOCKING 1
| #define HAVE_DECL_FEOF_UNLOCKED 1
| #define HAVE_DECL_FGETS_UNLOCKED 1
| #define HAVE_ICONV 1
| #define ICONV_CONST
| #define HAVE_NL_LOCALE_NAME 1
| #define HAVE_LONG_LONG_INT 1
| #define HAVE_LONG_DOUBLE 1
| #define HAVE_WCHAR_T 1
| #define HAVE_WINT_T 1
| #define HAVE_INTMAX_T 1
| #define HAVE_POSIX_PRINTF 1
| #define HAVE_STDINT_H 1
| #define HAVE_STDINT_H 1
| /* end confdefs.h. */
| #include <stdio.h>
| #ifdef HAVE_SYS_TYPES_H
| # include <sys/types.h>
| #endif
| #ifdef HAVE_SYS_STAT_H
| # include <sys/stat.h>
| #endif
| #ifdef STDC_HEADERS
| # include <stdlib.h>
| # include <stddef.h>
| #else
| # ifdef HAVE_STDLIB_H
| # include <stdlib.h>
| # endif
| #endif
| #ifdef HAVE_STRING_H
| # if !defined STDC_HEADERS && defined HAVE_MEMORY_H
| # include <memory.h>
| # endif
| # include <string.h>
| #endif
| #ifdef HAVE_STRINGS_H
| # include <strings.h>
| #endif
| #ifdef HAVE_INTTYPES_H
| # include <inttypes.h>
| #endif
| #ifdef HAVE_STDINT_H
| # include <stdint.h>
| #endif
| #ifdef HAVE_UNISTD_H
| # include <unistd.h>
| #endif
| int
| main ()
| {
| if (sizeof ((ptrdiff_t)))
| return 0;
| ;
| return 0;
| }
configure:8247: result: yes
configure:8260: checking stddef.h usability
configure:8260: gcc -c -g -O2 conftest.c >&5
configure:8260: $? = 0
configure:8260: result: yes
configure:8260: checking stddef.h presence
configure:8260: gcc -E conftest.c
configure:8260: $? = 0
configure:8260: result: yes
configure:8260: checking for stddef.h
configure:8260: result: yes
configure:8260: checking for stdlib.h
configure:8260: result: yes
configure:8260: checking for string.h
configure:8260: result: yes
configure:8274: checking for asprintf
configure:8274: gcc -o conftest -g -O2 conftest.c >&5
configure:8274: $? = 0
configure:8274: result: yes
configure:8274: checking for fwprintf
configure:8274: gcc -o conftest -g -O2 conftest.c >&5
configure:8274: $? = 0
configure:8274: result: yes
configure:8274: checking for putenv
configure:8274: gcc -o conftest -g -O2 conftest.c >&5
configure:8274: $? = 0
configure:8274: result: yes
configure:8274: checking for setenv
configure:8274: gcc -o conftest -g -O2 conftest.c >&5
configure:8274: $? = 0
configure:8274: result: yes
configure:8274: checking for setlocale
configure:8274: gcc -o conftest -g -O2 conftest.c >&5
configure:8274: $? = 0
configure:8274: result: yes
configure:8274: checking for snprintf
configure:8274: gcc -o conftest -g -O2 conftest.c >&5
conftest.c:110: warning: conflicting types for built-in function 'snprintf'
configure:8274: $? = 0
configure:8274: result: yes
configure:8274: checking for wcslen
configure:8274: gcc -o conftest -g -O2 conftest.c >&5
configure:8274: $? = 0
configure:8274: result: yes
configure:8286: checking whether _snprintf is declared
configure:8306: gcc -c -g -O2 conftest.c >&5
conftest.c: In function 'main':
conftest.c:95: error: '_snprintf' undeclared (first use in this function)
conftest.c:95: error: (Each undeclared identifier is reported only once
conftest.c:95: error: for each function it appears in.)
configure:8306: $? = 1
configure: failed program was:
| /* confdefs.h */
| #define PACKAGE_NAME "KQ"
| #define PACKAGE_TARNAME "kq"
| #define PACKAGE_VERSION "0.99"
| #define PACKAGE_STRING "KQ 0.99"
| #define PACKAGE_BUGREPORT "peterhull90@users.sourceforge.net"
| #define PACKAGE_URL ""
| #define PACKAGE "kq"
| #define VERSION "0.99"
| #define STDC_HEADERS 1
| #define HAVE_SYS_TYPES_H 1
| #define HAVE_SYS_STAT_H 1
| #define HAVE_STDLIB_H 1
| #define HAVE_STRING_H 1
| #define HAVE_MEMORY_H 1
| #define HAVE_STRINGS_H 1
| #define HAVE_INTTYPES_H 1
| #define HAVE_STDINT_H 1
| #define HAVE_UNISTD_H 1
| #define __EXTENSIONS__ 1
| #define _ALL_SOURCE 1
| #define _GNU_SOURCE 1
| #define _POSIX_PTHREAD_SEMANTICS 1
| #define _TANDEM_SOURCE 1
| #define HAVE_VISIBILITY 1
| #define HAVE_STDINT_H_WITH_UINTMAX 1
| #define HAVE_ALLOCA_H 1
| #define HAVE_ALLOCA 1
| #define HAVE_STDLIB_H 1
| #define HAVE_UNISTD_H 1
| #define HAVE_GETPAGESIZE 1
| #define HAVE_MMAP 1
| #define INTDIV0_RAISES_SIGFPE 1
| #define HAVE_INTTYPES_H_WITH_UINTMAX 1
| #define HAVE_UNSIGNED_LONG_LONG_INT 1
| #define HAVE_UNSIGNED_LONG_LONG 1
| #define HAVE_UINTMAX_T 1
| #define HAVE_INTTYPES_H 1
| #define USE_POSIX_THREADS 1
| #define USE_POSIX_THREADS_WEAK 1
| #define HAVE_PTHREAD_RWLOCK 1
| #define HAVE_PTHREAD_MUTEX_RECURSIVE 1
| #define HAVE_BUILTIN_EXPECT 1
| #define HAVE_ARGZ_H 1
| #define HAVE_INTTYPES_H 1
| #define HAVE_LIMITS_H 1
| #define HAVE_UNISTD_H 1
| #define HAVE_SYS_PARAM_H 1
| #define HAVE_GETCWD 1
| #define HAVE_GETEGID 1
| #define HAVE_GETEUID 1
| #define HAVE_GETGID 1
| #define HAVE_GETUID 1
| #define HAVE_MEMPCPY 1
| #define HAVE_MUNMAP 1
| #define HAVE_STPCPY 1
| #define HAVE_STRCASECMP 1
| #define HAVE_STRDUP 1
| #define HAVE_STRTOUL 1
| #define HAVE_TSEARCH 1
| #define HAVE_ARGZ_COUNT 1
| #define HAVE_ARGZ_STRINGIFY 1
| #define HAVE_ARGZ_NEXT 1
| #define HAVE___FSETLOCKING 1
| #define HAVE_DECL_FEOF_UNLOCKED 1
| #define HAVE_DECL_FGETS_UNLOCKED 1
| #define HAVE_ICONV 1
| #define ICONV_CONST
| #define HAVE_NL_LOCALE_NAME 1
| #define HAVE_LONG_LONG_INT 1
| #define HAVE_LONG_DOUBLE 1
| #define HAVE_WCHAR_T 1
| #define HAVE_WINT_T 1
| #define HAVE_INTMAX_T 1
| #define HAVE_POSIX_PRINTF 1
| #define HAVE_STDINT_H 1
| #define HAVE_STDINT_H 1
| #define HAVE_STDDEF_H 1
| #define HAVE_STDLIB_H 1
| #define HAVE_STRING_H 1
| #define HAVE_ASPRINTF 1
| #define HAVE_FWPRINTF 1
| #define HAVE_PUTENV 1
| #define HAVE_SETENV 1
| #define HAVE_SETLOCALE 1
| #define HAVE_SNPRINTF 1
| #define HAVE_WCSLEN 1
| /* end confdefs.h. */
| #include <stdio.h>
| int
| main ()
| {
|
| #ifndef _snprintf
| char *p = (char *) _snprintf;
| #endif
|
| ;
| return 0;
| }
configure:8313: result: no
configure:8327: checking whether _snwprintf is declared
configure:8347: gcc -c -g -O2 conftest.c >&5
conftest.c: In function 'main':
conftest.c:96: error: '_snwprintf' undeclared (first use in this function)
conftest.c:96: error: (Each undeclared identifier is reported only once
conftest.c:96: error: for each function it appears in.)
configure:8347: $? = 1
configure: failed program was:
| /* confdefs.h */
| #define PACKAGE_NAME "KQ"
| #define PACKAGE_TARNAME "kq"
| #define PACKAGE_VERSION "0.99"
| #define PACKAGE_STRING "KQ 0.99"
| #define PACKAGE_BUGREPORT "peterhull90@users.sourceforge.net"
| #define PACKAGE_URL ""
| #define PACKAGE "kq"
| #define VERSION "0.99"
| #define STDC_HEADERS 1
| #define HAVE_SYS_TYPES_H 1
| #define HAVE_SYS_STAT_H 1
| #define HAVE_STDLIB_H 1
| #define HAVE_STRING_H 1
| #define HAVE_MEMORY_H 1
| #define HAVE_STRINGS_H 1
| #define HAVE_INTTYPES_H 1
| #define HAVE_STDINT_H 1
| #define HAVE_UNISTD_H 1
| #define __EXTENSIONS__ 1
| #define _ALL_SOURCE 1
| #define _GNU_SOURCE 1
| #define _POSIX_PTHREAD_SEMANTICS 1
| #define _TANDEM_SOURCE 1
| #define HAVE_VISIBILITY 1
| #define HAVE_STDINT_H_WITH_UINTMAX 1
| #define HAVE_ALLOCA_H 1
| #define HAVE_ALLOCA 1
| #define HAVE_STDLIB_H 1
| #define HAVE_UNISTD_H 1
| #define HAVE_GETPAGESIZE 1
| #define HAVE_MMAP 1
| #define INTDIV0_RAISES_SIGFPE 1
| #define HAVE_INTTYPES_H_WITH_UINTMAX 1
| #define HAVE_UNSIGNED_LONG_LONG_INT 1
| #define HAVE_UNSIGNED_LONG_LONG 1
| #define HAVE_UINTMAX_T 1
| #define HAVE_INTTYPES_H 1
| #define USE_POSIX_THREADS 1
| #define USE_POSIX_THREADS_WEAK 1
| #define HAVE_PTHREAD_RWLOCK 1
| #define HAVE_PTHREAD_MUTEX_RECURSIVE 1
| #define HAVE_BUILTIN_EXPECT 1
| #define HAVE_ARGZ_H 1
| #define HAVE_INTTYPES_H 1
| #define HAVE_LIMITS_H 1
| #define HAVE_UNISTD_H 1
| #define HAVE_SYS_PARAM_H 1
| #define HAVE_GETCWD 1
| #define HAVE_GETEGID 1
| #define HAVE_GETEUID 1
| #define HAVE_GETGID 1
| #define HAVE_GETUID 1
| #define HAVE_MEMPCPY 1
| #define HAVE_MUNMAP 1
| #define HAVE_STPCPY 1
| #define HAVE_STRCASECMP 1
| #define HAVE_STRDUP 1
| #define HAVE_STRTOUL 1
| #define HAVE_TSEARCH 1
| #define HAVE_ARGZ_COUNT 1
| #define HAVE_ARGZ_STRINGIFY 1
| #define HAVE_ARGZ_NEXT 1
| #define HAVE___FSETLOCKING 1
| #define HAVE_DECL_FEOF_UNLOCKED 1
| #define HAVE_DECL_FGETS_UNLOCKED 1
| #define HAVE_ICONV 1
| #define ICONV_CONST
| #define HAVE_NL_LOCALE_NAME 1
| #define HAVE_LONG_LONG_INT 1
| #define HAVE_LONG_DOUBLE 1
| #define HAVE_WCHAR_T 1
| #define HAVE_WINT_T 1
| #define HAVE_INTMAX_T 1
| #define HAVE_POSIX_PRINTF 1
| #define HAVE_STDINT_H 1
| #define HAVE_STDINT_H 1
| #define HAVE_STDDEF_H 1
| #define HAVE_STDLIB_H 1
| #define HAVE_STRING_H 1
| #define HAVE_ASPRINTF 1
| #define HAVE_FWPRINTF 1
| #define HAVE_PUTENV 1
| #define HAVE_SETENV 1
| #define HAVE_SETLOCALE 1
| #define HAVE_SNPRINTF 1
| #define HAVE_WCSLEN 1
| #define HAVE_DECL__SNPRINTF 0
| /* end confdefs.h. */
| #include <stdio.h>
| int
| main ()
| {
|
| #ifndef _snwprintf
| char *p = (char *) _snwprintf;
| #endif
|
| ;
| return 0;
| }
configure:8354: result: no
configure:8369: checking whether getc_unlocked is declared
configure:8389: gcc -c -g -O2 conftest.c >&5
configure:8389: $? = 0
configure:8396: result: yes
configure:8435: checking for nl_langinfo and CODESET
configure:8451: gcc -o conftest -g -O2 conftest.c >&5
configure:8451: $? = 0
configure:8460: result: yes
configure:8469: checking for LC_MESSAGES
configure:8485: gcc -o conftest -g -O2 conftest.c >&5
configure:8485: $? = 0
configure:8493: result: yes
configure:8537: checking for CFPreferencesCopyAppValue
configure:8564: result: no
configure:8571: checking for CFLocaleCopyCurrent
configure:8598: result: no
configure:8633: checking whether included gettext is requested
configure:8643: result: no
configure:8666: checking for GNU gettext in libc
configure:8686: gcc -o conftest -g -O2 conftest.c >&5
configure:8686: $? = 0
configure:8695: result: yes
configure:9216: checking whether to use NLS
configure:9218: result: yes
configure:9221: checking where the gettext function comes from
configure:9232: result: libc
configure:9339: checking for allegro-config
configure:9355: found /usr/bin/allegro-config
configure:9366: result: yes
configure:9428: checking for ANSI C header files
configure:9532: result: yes
configure:9543: checking for stdlib.h
configure:9543: result: yes
configure:9543: checking for string.h
configure:9543: result: yes
configure:9543: checking sys/time.h usability
configure:9543: gcc -c -g -O2 conftest.c >&5
configure:9543: $? = 0
configure:9543: result: yes
configure:9543: checking sys/time.h presence
configure:9543: gcc -E conftest.c
configure:9543: $? = 0
configure:9543: result: yes
configure:9543: checking for sys/time.h
configure:9543: result: yes
configure:9543: checking for unistd.h
configure:9543: result: yes
configure:9543: checking sys/select.h usability
configure:9543: gcc -c -g -O2 conftest.c >&5
configure:9543: $? = 0
configure:9543: result: yes
configure:9543: checking sys/select.h presence
configure:9543: gcc -E conftest.c
configure:9543: $? = 0
configure:9543: result: yes
configure:9543: checking for sys/select.h
configure:9543: result: yes
configure:9556: checking lua.h usability
configure:9556: gcc -c -g -O2 conftest.c >&5
configure:9556: $? = 0
configure:9556: result: yes
configure:9556: checking lua.h presence
configure:9556: gcc -E conftest.c
configure:9556: $? = 0
configure:9556: result: yes
configure:9556: checking for lua.h
configure:9556: result: yes
configure:9600: checking for an ANSI C-conforming const
configure:9665: gcc -c -g -O2 conftest.c >&5
configure:9665: $? = 0
configure:9672: result: yes
configure:9680: checking for inline
configure:9704: result: inline
configure:9722: checking whether time.h and sys/time.h may both be included
configure:9742: gcc -c -g -O2 conftest.c >&5
configure:9742: $? = 0
configure:9749: result: yes
configure:9757: checking whether struct tm is in sys/time.h or time.h
configure:9777: gcc -c -g -O2 conftest.c >&5
configure:9777: $? = 0
configure:9784: result: time.h
configure:9792: checking for working volatile
configure:9811: gcc -c -g -O2 conftest.c >&5
configure:9811: $? = 0
configure:9818: result: yes
configure:9848: gcc -c -g -O2 -Wall -Wextra -Wfloat-equal -Wredundant-decls -Wmissing-noreturn -Wendif-labels -Wunused-parameter -Wpointer-arith -Wwrite-strings -Wcast-align -Wcast-qual -Winline -Wformat=2 -Winit-self -Wswitch-enum -Wunused-parameter -Wundef -Wno-error -Wmissing-declarations -Werror-implicit-function-declaration -Wmissing-prototypes -Wstrict-prototypes -Wold-style-definition -Wdeclaration-after-statement conftest.c >&5
conftest.c:108: warning: function declaration isn't a prototype
conftest.c: In function 'main':
conftest.c:107: warning: old-style function definition
configure:9848: $? = 0
configure:9861: checking for atexit
configure:9861: gcc -o conftest -g -O2 conftest.c >&5
configure:9861: $? = 0
configure:9861: result: yes
configure:9861: checking for gettimeofday
configure:9861: gcc -o conftest -g -O2 conftest.c >&5
configure:9861: $? = 0
configure:9861: result: yes
configure:9861: checking for memmove
configure:9861: gcc -o conftest -g -O2 conftest.c >&5
conftest.c:130: warning: conflicting types for built-in function 'memmove'
configure:9861: $? = 0
configure:9861: result: yes
configure:9861: checking for memset
configure:9861: gcc -o conftest -g -O2 conftest.c >&5
conftest.c:131: warning: conflicting types for built-in function 'memset'
configure:9861: $? = 0
configure:9861: result: yes
configure:9861: checking for mkdir
configure:9861: gcc -o conftest -g -O2 conftest.c >&5
configure:9861: $? = 0
configure:9861: result: yes
configure:9861: checking for pow
configure:9861: gcc -o conftest -g -O2 conftest.c >&5
conftest.c:133: warning: conflicting types for built-in function 'pow'
/tmp/ccimYR1V.o: In function `main':
/home/qubodup/src/cvs/kq/conftest.c:144: undefined reference to `pow'
collect2: ld returned 1 exit status
configure:9861: $? = 1
configure: failed program was:
| /* confdefs.h */
| #define PACKAGE_NAME "KQ"
| #define PACKAGE_TARNAME "kq"
| #define PACKAGE_VERSION "0.99"
| #define PACKAGE_STRING "KQ 0.99"
| #define PACKAGE_BUGREPORT "peterhull90@users.sourceforge.net"
| #define PACKAGE_URL ""
| #define PACKAGE "kq"
| #define VERSION "0.99"
| #define STDC_HEADERS 1
| #define HAVE_SYS_TYPES_H 1
| #define HAVE_SYS_STAT_H 1
| #define HAVE_STDLIB_H 1
| #define HAVE_STRING_H 1
| #define HAVE_MEMORY_H 1
| #define HAVE_STRINGS_H 1
| #define HAVE_INTTYPES_H 1
| #define HAVE_STDINT_H 1
| #define HAVE_UNISTD_H 1
| #define __EXTENSIONS__ 1
| #define _ALL_SOURCE 1
| #define _GNU_SOURCE 1
| #define _POSIX_PTHREAD_SEMANTICS 1
| #define _TANDEM_SOURCE 1
| #define HAVE_VISIBILITY 1
| #define HAVE_STDINT_H_WITH_UINTMAX 1
| #define HAVE_ALLOCA_H 1
| #define HAVE_ALLOCA 1
| #define HAVE_STDLIB_H 1
| #define HAVE_UNISTD_H 1
| #define HAVE_GETPAGESIZE 1
| #define HAVE_MMAP 1
| #define INTDIV0_RAISES_SIGFPE 1
| #define HAVE_INTTYPES_H_WITH_UINTMAX 1
| #define HAVE_UNSIGNED_LONG_LONG_INT 1
| #define HAVE_UNSIGNED_LONG_LONG 1
| #define HAVE_UINTMAX_T 1
| #define HAVE_INTTYPES_H 1
| #define USE_POSIX_THREADS 1
| #define USE_POSIX_THREADS_WEAK 1
| #define HAVE_PTHREAD_RWLOCK 1
| #define HAVE_PTHREAD_MUTEX_RECURSIVE 1
| #define HAVE_BUILTIN_EXPECT 1
| #define HAVE_ARGZ_H 1
| #define HAVE_INTTYPES_H 1
| #define HAVE_LIMITS_H 1
| #define HAVE_UNISTD_H 1
| #define HAVE_SYS_PARAM_H 1
| #define HAVE_GETCWD 1
| #define HAVE_GETEGID 1
| #define HAVE_GETEUID 1
| #define HAVE_GETGID 1
| #define HAVE_GETUID 1
| #define HAVE_MEMPCPY 1
| #define HAVE_MUNMAP 1
| #define HAVE_STPCPY 1
| #define HAVE_STRCASECMP 1
| #define HAVE_STRDUP 1
| #define HAVE_STRTOUL 1
| #define HAVE_TSEARCH 1
| #define HAVE_ARGZ_COUNT 1
| #define HAVE_ARGZ_STRINGIFY 1
| #define HAVE_ARGZ_NEXT 1
| #define HAVE___FSETLOCKING 1
| #define HAVE_DECL_FEOF_UNLOCKED 1
| #define HAVE_DECL_FGETS_UNLOCKED 1
| #define HAVE_ICONV 1
| #define ICONV_CONST
| #define HAVE_NL_LOCALE_NAME 1
| #define HAVE_LONG_LONG_INT 1
| #define HAVE_LONG_DOUBLE 1
| #define HAVE_WCHAR_T 1
| #define HAVE_WINT_T 1
| #define HAVE_INTMAX_T 1
| #define HAVE_POSIX_PRINTF 1
| #define HAVE_STDINT_H 1
| #define HAVE_STDINT_H 1
| #define HAVE_STDDEF_H 1
| #define HAVE_STDLIB_H 1
| #define HAVE_STRING_H 1
| #define HAVE_ASPRINTF 1
| #define HAVE_FWPRINTF 1
| #define HAVE_PUTENV 1
| #define HAVE_SETENV 1
| #define HAVE_SETLOCALE 1
| #define HAVE_SNPRINTF 1
| #define HAVE_WCSLEN 1
| #define HAVE_DECL__SNPRINTF 0
| #define HAVE_DECL__SNWPRINTF 0
| #define HAVE_DECL_GETC_UNLOCKED 1
| #define HAVE_LANGINFO_CODESET 1
| #define HAVE_LC_MESSAGES 1
| #define ENABLE_NLS 1
| #define HAVE_GETTEXT 1
| #define HAVE_DCGETTEXT 1
| #define STDC_HEADERS 1
| #define HAVE_STDLIB_H 1
| #define HAVE_STRING_H 1
| #define HAVE_SYS_TIME_H 1
| #define HAVE_UNISTD_H 1
| #define HAVE_SYS_SELECT_H 1
| #define HAVE_LUA_H 1
| #define TIME_WITH_SYS_TIME 1
| #define HAVE_ATEXIT 1
| #define HAVE_GETTIMEOFDAY 1
| #define HAVE_MEMMOVE 1
| #define HAVE_MEMSET 1
| #define HAVE_MKDIR 1
| /* end confdefs.h. */
| /* Define pow to an innocuous variant, in case <limits.h> declares pow.
| For example, HP-UX 11i <limits.h> declares gettimeofday. */
| #define pow innocuous_pow
|
| /* System header to define __stub macros and hopefully few prototypes,
| which can conflict with char pow (); below.
| Prefer <limits.h> to <assert.h> if __STDC__ is defined, since
| <limits.h> exists even on freestanding compilers. */
|
| #ifdef __STDC__
| # include <limits.h>
| #else
| # include <assert.h>
| #endif
|
| #undef pow
|
| /* Override any GCC internal prototype to avoid an error.
| Use char because int might match the return type of a GCC
| builtin and then its argument prototype would still apply. */
| #ifdef __cplusplus
| extern "C"
| #endif
| char pow ();
| /* The GNU C library defines this for functions which it implements
| to always fail with ENOSYS. Some functions are actually named
| something starting with __ and the normal name is an alias. */
| #if defined __stub_pow || defined __stub___pow
| choke me
| #endif
|
| int
| main ()
| {
| return pow ();
| ;
| return 0;
| }
configure:9861: result: no
configure:9861: checking for strchr
configure:9861: gcc -o conftest -g -O2 conftest.c >&5
conftest.c:133: warning: conflicting types for built-in function 'strchr'
configure:9861: $? = 0
configure:9861: result: yes
configure:9861: checking for strstr
configure:9861: gcc -o conftest -g -O2 conftest.c >&5
conftest.c:134: warning: conflicting types for built-in function 'strstr'
configure:9861: $? = 0
configure:9861: result: yes
configure:9871: checking for dumb_exit in -ldumb
configure:9896: gcc -o conftest -g -O2 conftest.c -ldumb >&5
configure:9896: $? = 0
configure:9905: result: yes
configure:9913: checking for al_duh_set_volume in -laldmb
configure:9927: gcc -o conftest -g -O2 conftest.c -laldmb -ldumb -L/usr/lib -Wl,--export-dynamic -lalleg-4.2.2 -lalleg_unsharable >&5
configure:9927: $? = 0
configure:9936: result: yes
configure:9943: checking for library containing lua_gettop
configure:9974: gcc -o conftest -g -O2 conftest.c >&5
/tmp/ccqtC0KC.o: In function `main':
/home/qubodup/src/cvs/kq/conftest.c:123: undefined reference to `lua_gettop'
collect2: ld returned 1 exit status
configure:9974: $? = 1
configure: failed program was:
| /* confdefs.h */
| #define PACKAGE_NAME "KQ"
| #define PACKAGE_TARNAME "kq"
| #define PACKAGE_VERSION "0.99"
| #define PACKAGE_STRING "KQ 0.99"
| #define PACKAGE_BUGREPORT "peterhull90@users.sourceforge.net"
| #define PACKAGE_URL ""
| #define PACKAGE "kq"
| #define VERSION "0.99"
| #define STDC_HEADERS 1
| #define HAVE_SYS_TYPES_H 1
| #define HAVE_SYS_STAT_H 1
| #define HAVE_STDLIB_H 1
| #define HAVE_STRING_H 1
| #define HAVE_MEMORY_H 1
| #define HAVE_STRINGS_H 1
| #define HAVE_INTTYPES_H 1
| #define HAVE_STDINT_H 1
| #define HAVE_UNISTD_H 1
| #define __EXTENSIONS__ 1
| #define _ALL_SOURCE 1
| #define _GNU_SOURCE 1
| #define _POSIX_PTHREAD_SEMANTICS 1
| #define _TANDEM_SOURCE 1
| #define HAVE_VISIBILITY 1
| #define HAVE_STDINT_H_WITH_UINTMAX 1
| #define HAVE_ALLOCA_H 1
| #define HAVE_ALLOCA 1
| #define HAVE_STDLIB_H 1
| #define HAVE_UNISTD_H 1
| #define HAVE_GETPAGESIZE 1
| #define HAVE_MMAP 1
| #define INTDIV0_RAISES_SIGFPE 1
| #define HAVE_INTTYPES_H_WITH_UINTMAX 1
| #define HAVE_UNSIGNED_LONG_LONG_INT 1
| #define HAVE_UNSIGNED_LONG_LONG 1
| #define HAVE_UINTMAX_T 1
| #define HAVE_INTTYPES_H 1
| #define USE_POSIX_THREADS 1
| #define USE_POSIX_THREADS_WEAK 1
| #define HAVE_PTHREAD_RWLOCK 1
| #define HAVE_PTHREAD_MUTEX_RECURSIVE 1
| #define HAVE_BUILTIN_EXPECT 1
| #define HAVE_ARGZ_H 1
| #define HAVE_INTTYPES_H 1
| #define HAVE_LIMITS_H 1
| #define HAVE_UNISTD_H 1
| #define HAVE_SYS_PARAM_H 1
| #define HAVE_GETCWD 1
| #define HAVE_GETEGID 1
| #define HAVE_GETEUID 1
| #define HAVE_GETGID 1
| #define HAVE_GETUID 1
| #define HAVE_MEMPCPY 1
| #define HAVE_MUNMAP 1
| #define HAVE_STPCPY 1
| #define HAVE_STRCASECMP 1
| #define HAVE_STRDUP 1
| #define HAVE_STRTOUL 1
| #define HAVE_TSEARCH 1
| #define HAVE_ARGZ_COUNT 1
| #define HAVE_ARGZ_STRINGIFY 1
| #define HAVE_ARGZ_NEXT 1
| #define HAVE___FSETLOCKING 1
| #define HAVE_DECL_FEOF_UNLOCKED 1
| #define HAVE_DECL_FGETS_UNLOCKED 1
| #define HAVE_ICONV 1
| #define ICONV_CONST
| #define HAVE_NL_LOCALE_NAME 1
| #define HAVE_LONG_LONG_INT 1
| #define HAVE_LONG_DOUBLE 1
| #define HAVE_WCHAR_T 1
| #define HAVE_WINT_T 1
| #define HAVE_INTMAX_T 1
| #define HAVE_POSIX_PRINTF 1
| #define HAVE_STDINT_H 1
| #define HAVE_STDINT_H 1
| #define HAVE_STDDEF_H 1
| #define HAVE_STDLIB_H 1
| #define HAVE_STRING_H 1
| #define HAVE_ASPRINTF 1
| #define HAVE_FWPRINTF 1
| #define HAVE_PUTENV 1
| #define HAVE_SETENV 1
| #define HAVE_SETLOCALE 1
| #define HAVE_SNPRINTF 1
| #define HAVE_WCSLEN 1
| #define HAVE_DECL__SNPRINTF 0
| #define HAVE_DECL__SNWPRINTF 0
| #define HAVE_DECL_GETC_UNLOCKED 1
| #define HAVE_LANGINFO_CODESET 1
| #define HAVE_LC_MESSAGES 1
| #define ENABLE_NLS 1
| #define HAVE_GETTEXT 1
| #define HAVE_DCGETTEXT 1
| #define STDC_HEADERS 1
| #define HAVE_STDLIB_H 1
| #define HAVE_STRING_H 1
| #define HAVE_SYS_TIME_H 1
| #define HAVE_UNISTD_H 1
| #define HAVE_SYS_SELECT_H 1
| #define HAVE_LUA_H 1
| #define TIME_WITH_SYS_TIME 1
| #define HAVE_ATEXIT 1
| #define HAVE_GETTIMEOFDAY 1
| #define HAVE_MEMMOVE 1
| #define HAVE_MEMSET 1
| #define HAVE_MKDIR 1
| #define HAVE_STRCHR 1
| #define HAVE_STRSTR 1
| /* end confdefs.h. */
|
| /* Override any GCC internal prototype to avoid an error.
| Use char because int might match the return type of a GCC
| builtin and then its argument prototype would still apply. */
| #ifdef __cplusplus
| extern "C"
| #endif
| char lua_gettop ();
| int
| main ()
| {
| return lua_gettop ();
| ;
| return 0;
| }
configure:9974: gcc -o conftest -g -O2 conftest.c -llua50 >&5
/usr/bin/ld: cannot find -llua50
collect2: ld returned 1 exit status
configure:9974: $? = 1
configure: failed program was:
| /* confdefs.h */
| #define PACKAGE_NAME "KQ"
| #define PACKAGE_TARNAME "kq"
| #define PACKAGE_VERSION "0.99"
| #define PACKAGE_STRING "KQ 0.99"
| #define PACKAGE_BUGREPORT "peterhull90@users.sourceforge.net"
| #define PACKAGE_URL ""
| #define PACKAGE "kq"
| #define VERSION "0.99"
| #define STDC_HEADERS 1
| #define HAVE_SYS_TYPES_H 1
| #define HAVE_SYS_STAT_H 1
| #define HAVE_STDLIB_H 1
| #define HAVE_STRING_H 1
| #define HAVE_MEMORY_H 1
| #define HAVE_STRINGS_H 1
| #define HAVE_INTTYPES_H 1
| #define HAVE_STDINT_H 1
| #define HAVE_UNISTD_H 1
| #define __EXTENSIONS__ 1
| #define _ALL_SOURCE 1
| #define _GNU_SOURCE 1
| #define _POSIX_PTHREAD_SEMANTICS 1
| #define _TANDEM_SOURCE 1
| #define HAVE_VISIBILITY 1
| #define HAVE_STDINT_H_WITH_UINTMAX 1
| #define HAVE_ALLOCA_H 1
| #define HAVE_ALLOCA 1
| #define HAVE_STDLIB_H 1
| #define HAVE_UNISTD_H 1
| #define HAVE_GETPAGESIZE 1
| #define HAVE_MMAP 1
| #define INTDIV0_RAISES_SIGFPE 1
| #define HAVE_INTTYPES_H_WITH_UINTMAX 1
| #define HAVE_UNSIGNED_LONG_LONG_INT 1
| #define HAVE_UNSIGNED_LONG_LONG 1
| #define HAVE_UINTMAX_T 1
| #define HAVE_INTTYPES_H 1
| #define USE_POSIX_THREADS 1
| #define USE_POSIX_THREADS_WEAK 1
| #define HAVE_PTHREAD_RWLOCK 1
| #define HAVE_PTHREAD_MUTEX_RECURSIVE 1
| #define HAVE_BUILTIN_EXPECT 1
| #define HAVE_ARGZ_H 1
| #define HAVE_INTTYPES_H 1
| #define HAVE_LIMITS_H 1
| #define HAVE_UNISTD_H 1
| #define HAVE_SYS_PARAM_H 1
| #define HAVE_GETCWD 1
| #define HAVE_GETEGID 1
| #define HAVE_GETEUID 1
| #define HAVE_GETGID 1
| #define HAVE_GETUID 1
| #define HAVE_MEMPCPY 1
| #define HAVE_MUNMAP 1
| #define HAVE_STPCPY 1
| #define HAVE_STRCASECMP 1
| #define HAVE_STRDUP 1
| #define HAVE_STRTOUL 1
| #define HAVE_TSEARCH 1
| #define HAVE_ARGZ_COUNT 1
| #define HAVE_ARGZ_STRINGIFY 1
| #define HAVE_ARGZ_NEXT 1
| #define HAVE___FSETLOCKING 1
| #define HAVE_DECL_FEOF_UNLOCKED 1
| #define HAVE_DECL_FGETS_UNLOCKED 1
| #define HAVE_ICONV 1
| #define ICONV_CONST
| #define HAVE_NL_LOCALE_NAME 1
| #define HAVE_LONG_LONG_INT 1
| #define HAVE_LONG_DOUBLE 1
| #define HAVE_WCHAR_T 1
| #define HAVE_WINT_T 1
| #define HAVE_INTMAX_T 1
| #define HAVE_POSIX_PRINTF 1
| #define HAVE_STDINT_H 1
| #define HAVE_STDINT_H 1
| #define HAVE_STDDEF_H 1
| #define HAVE_STDLIB_H 1
| #define HAVE_STRING_H 1
| #define HAVE_ASPRINTF 1
| #define HAVE_FWPRINTF 1
| #define HAVE_PUTENV 1
| #define HAVE_SETENV 1
| #define HAVE_SETLOCALE 1
| #define HAVE_SNPRINTF 1
| #define HAVE_WCSLEN 1
| #define HAVE_DECL__SNPRINTF 0
| #define HAVE_DECL__SNWPRINTF 0
| #define HAVE_DECL_GETC_UNLOCKED 1
| #define HAVE_LANGINFO_CODESET 1
| #define HAVE_LC_MESSAGES 1
| #define ENABLE_NLS 1
| #define HAVE_GETTEXT 1
| #define HAVE_DCGETTEXT 1
| #define STDC_HEADERS 1
| #define HAVE_STDLIB_H 1
| #define HAVE_STRING_H 1
| #define HAVE_SYS_TIME_H 1
| #define HAVE_UNISTD_H 1
| #define HAVE_SYS_SELECT_H 1
| #define HAVE_LUA_H 1
| #define TIME_WITH_SYS_TIME 1
| #define HAVE_ATEXIT 1
| #define HAVE_GETTIMEOFDAY 1
| #define HAVE_MEMMOVE 1
| #define HAVE_MEMSET 1
| #define HAVE_MKDIR 1
| #define HAVE_STRCHR 1
| #define HAVE_STRSTR 1
| /* end confdefs.h. */
|
| /* Override any GCC internal prototype to avoid an error.
| Use char because int might match the return type of a GCC
| builtin and then its argument prototype would still apply. */
| #ifdef __cplusplus
| extern "C"
| #endif
| char lua_gettop ();
| int
| main ()
| {
| return lua_gettop ();
| ;
| return 0;
| }
configure:9974: gcc -o conftest -g -O2 conftest.c -llua5.1 >&5
/usr/bin/ld: cannot find -llua5.1
collect2: ld returned 1 exit status
configure:9974: $? = 1
configure: failed program was:
| /* confdefs.h */
| #define PACKAGE_NAME "KQ"
| #define PACKAGE_TARNAME "kq"
| #define PACKAGE_VERSION "0.99"
| #define PACKAGE_STRING "KQ 0.99"
| #define PACKAGE_BUGREPORT "peterhull90@users.sourceforge.net"
| #define PACKAGE_URL ""
| #define PACKAGE "kq"
| #define VERSION "0.99"
| #define STDC_HEADERS 1
| #define HAVE_SYS_TYPES_H 1
| #define HAVE_SYS_STAT_H 1
| #define HAVE_STDLIB_H 1
| #define HAVE_STRING_H 1
| #define HAVE_MEMORY_H 1
| #define HAVE_STRINGS_H 1
| #define HAVE_INTTYPES_H 1
| #define HAVE_STDINT_H 1
| #define HAVE_UNISTD_H 1
| #define __EXTENSIONS__ 1
| #define _ALL_SOURCE 1
| #define _GNU_SOURCE 1
| #define _POSIX_PTHREAD_SEMANTICS 1
| #define _TANDEM_SOURCE 1
| #define HAVE_VISIBILITY 1
| #define HAVE_STDINT_H_WITH_UINTMAX 1
| #define HAVE_ALLOCA_H 1
| #define HAVE_ALLOCA 1
| #define HAVE_STDLIB_H 1
| #define HAVE_UNISTD_H 1
| #define HAVE_GETPAGESIZE 1
| #define HAVE_MMAP 1
| #define INTDIV0_RAISES_SIGFPE 1
| #define HAVE_INTTYPES_H_WITH_UINTMAX 1
| #define HAVE_UNSIGNED_LONG_LONG_INT 1
| #define HAVE_UNSIGNED_LONG_LONG 1
| #define HAVE_UINTMAX_T 1
| #define HAVE_INTTYPES_H 1
| #define USE_POSIX_THREADS 1
| #define USE_POSIX_THREADS_WEAK 1
| #define HAVE_PTHREAD_RWLOCK 1
| #define HAVE_PTHREAD_MUTEX_RECURSIVE 1
| #define HAVE_BUILTIN_EXPECT 1
| #define HAVE_ARGZ_H 1
| #define HAVE_INTTYPES_H 1
| #define HAVE_LIMITS_H 1
| #define HAVE_UNISTD_H 1
| #define HAVE_SYS_PARAM_H 1
| #define HAVE_GETCWD 1
| #define HAVE_GETEGID 1
| #define HAVE_GETEUID 1
| #define HAVE_GETGID 1
| #define HAVE_GETUID 1
| #define HAVE_MEMPCPY 1
| #define HAVE_MUNMAP 1
| #define HAVE_STPCPY 1
| #define HAVE_STRCASECMP 1
| #define HAVE_STRDUP 1
| #define HAVE_STRTOUL 1
| #define HAVE_TSEARCH 1
| #define HAVE_ARGZ_COUNT 1
| #define HAVE_ARGZ_STRINGIFY 1
| #define HAVE_ARGZ_NEXT 1
| #define HAVE___FSETLOCKING 1
| #define HAVE_DECL_FEOF_UNLOCKED 1
| #define HAVE_DECL_FGETS_UNLOCKED 1
| #define HAVE_ICONV 1
| #define ICONV_CONST
| #define HAVE_NL_LOCALE_NAME 1
| #define HAVE_LONG_LONG_INT 1
| #define HAVE_LONG_DOUBLE 1
| #define HAVE_WCHAR_T 1
| #define HAVE_WINT_T 1
| #define HAVE_INTMAX_T 1
| #define HAVE_POSIX_PRINTF 1
| #define HAVE_STDINT_H 1
| #define HAVE_STDINT_H 1
| #define HAVE_STDDEF_H 1
| #define HAVE_STDLIB_H 1
| #define HAVE_STRING_H 1
| #define HAVE_ASPRINTF 1
| #define HAVE_FWPRINTF 1
| #define HAVE_PUTENV 1
| #define HAVE_SETENV 1
| #define HAVE_SETLOCALE 1
| #define HAVE_SNPRINTF 1
| #define HAVE_WCSLEN 1
| #define HAVE_DECL__SNPRINTF 0
| #define HAVE_DECL__SNWPRINTF 0
| #define HAVE_DECL_GETC_UNLOCKED 1
| #define HAVE_LANGINFO_CODESET 1
| #define HAVE_LC_MESSAGES 1
| #define ENABLE_NLS 1
| #define HAVE_GETTEXT 1
| #define HAVE_DCGETTEXT 1
| #define STDC_HEADERS 1
| #define HAVE_STDLIB_H 1
| #define HAVE_STRING_H 1
| #define HAVE_SYS_TIME_H 1
| #define HAVE_UNISTD_H 1
| #define HAVE_SYS_SELECT_H 1
| #define HAVE_LUA_H 1
| #define TIME_WITH_SYS_TIME 1
| #define HAVE_ATEXIT 1
| #define HAVE_GETTIMEOFDAY 1
| #define HAVE_MEMMOVE 1
| #define HAVE_MEMSET 1
| #define HAVE_MKDIR 1
| #define HAVE_STRCHR 1
| #define HAVE_STRSTR 1
| /* end confdefs.h. */
|
| /* Override any GCC internal prototype to avoid an error.
| Use char because int might match the return type of a GCC
| builtin and then its argument prototype would still apply. */
| #ifdef __cplusplus
| extern "C"
| #endif
| char lua_gettop ();
| int
| main ()
| {
| return lua_gettop ();
| ;
| return 0;
| }
configure:9974: gcc -o conftest -g -O2 conftest.c -llua >&5
/usr/lib/gcc/x86_64-unknown-linux-gnu/4.4.1/../../../../lib/liblua.so: undefined reference to `sqrt'
/usr/lib/gcc/x86_64-unknown-linux-gnu/4.4.1/../../../../lib/liblua.so: undefined reference to `floor'
/usr/lib/gcc/x86_64-unknown-linux-gnu/4.4.1/../../../../lib/liblua.so: undefined reference to `ceil'
/usr/lib/gcc/x86_64-unknown-linux-gnu/4.4.1/../../../../lib/liblua.so: undefined reference to `cosh'
/usr/lib/gcc/x86_64-unknown-linux-gnu/4.4.1/../../../../lib/liblua.so: undefined reference to `tan'
/usr/lib/gcc/x86_64-unknown-linux-gnu/4.4.1/../../../../lib/liblua.so: undefined reference to `tanh'
/usr/lib/gcc/x86_64-unknown-linux-gnu/4.4.1/../../../../lib/liblua.so: undefined reference to `asin'
/usr/lib/gcc/x86_64-unknown-linux-gnu/4.4.1/../../../../lib/liblua.so: undefined reference to `log'
/usr/lib/gcc/x86_64-unknown-linux-gnu/4.4.1/../../../../lib/liblua.so: undefined reference to `atan'
/usr/lib/gcc/x86_64-unknown-linux-gnu/4.4.1/../../../../lib/liblua.so: undefined reference to `sinh'
/usr/lib/gcc/x86_64-unknown-linux-gnu/4.4.1/../../../../lib/liblua.so: undefined reference to `fmod'
/usr/lib/gcc/x86_64-unknown-linux-gnu/4.4.1/../../../../lib/liblua.so: undefined reference to `acos'
/usr/lib/gcc/x86_64-unknown-linux-gnu/4.4.1/../../../../lib/liblua.so: undefined reference to `exp'
/usr/lib/gcc/x86_64-unknown-linux-gnu/4.4.1/../../../../lib/liblua.so: undefined reference to `sin'
/usr/lib/gcc/x86_64-unknown-linux-gnu/4.4.1/../../../../lib/liblua.so: undefined reference to `pow'
/usr/lib/gcc/x86_64-unknown-linux-gnu/4.4.1/../../../../lib/liblua.so: undefined reference to `atan2'
/usr/lib/gcc/x86_64-unknown-linux-gnu/4.4.1/../../../../lib/liblua.so: undefined reference to `cos'
/usr/lib/gcc/x86_64-unknown-linux-gnu/4.4.1/../../../../lib/liblua.so: undefined reference to `log10'
collect2: ld returned 1 exit status
configure:9974: $? = 1
configure: failed program was:
| /* confdefs.h */
| #define PACKAGE_NAME "KQ"
| #define PACKAGE_TARNAME "kq"
| #define PACKAGE_VERSION "0.99"
| #define PACKAGE_STRING "KQ 0.99"
| #define PACKAGE_BUGREPORT "peterhull90@users.sourceforge.net"
| #define PACKAGE_URL ""
| #define PACKAGE "kq"
| #define VERSION "0.99"
| #define STDC_HEADERS 1
| #define HAVE_SYS_TYPES_H 1
| #define HAVE_SYS_STAT_H 1
| #define HAVE_STDLIB_H 1
| #define HAVE_STRING_H 1
| #define HAVE_MEMORY_H 1
| #define HAVE_STRINGS_H 1
| #define HAVE_INTTYPES_H 1
| #define HAVE_STDINT_H 1
| #define HAVE_UNISTD_H 1
| #define __EXTENSIONS__ 1
| #define _ALL_SOURCE 1
| #define _GNU_SOURCE 1
| #define _POSIX_PTHREAD_SEMANTICS 1
| #define _TANDEM_SOURCE 1
| #define HAVE_VISIBILITY 1
| #define HAVE_STDINT_H_WITH_UINTMAX 1
| #define HAVE_ALLOCA_H 1
| #define HAVE_ALLOCA 1
| #define HAVE_STDLIB_H 1
| #define HAVE_UNISTD_H 1
| #define HAVE_GETPAGESIZE 1
| #define HAVE_MMAP 1
| #define INTDIV0_RAISES_SIGFPE 1
| #define HAVE_INTTYPES_H_WITH_UINTMAX 1
| #define HAVE_UNSIGNED_LONG_LONG_INT 1
| #define HAVE_UNSIGNED_LONG_LONG 1
| #define HAVE_UINTMAX_T 1
| #define HAVE_INTTYPES_H 1
| #define USE_POSIX_THREADS 1
| #define USE_POSIX_THREADS_WEAK 1
| #define HAVE_PTHREAD_RWLOCK 1
| #define HAVE_PTHREAD_MUTEX_RECURSIVE 1
| #define HAVE_BUILTIN_EXPECT 1
| #define HAVE_ARGZ_H 1
| #define HAVE_INTTYPES_H 1
| #define HAVE_LIMITS_H 1
| #define HAVE_UNISTD_H 1
| #define HAVE_SYS_PARAM_H 1
| #define HAVE_GETCWD 1
| #define HAVE_GETEGID 1
| #define HAVE_GETEUID 1
| #define HAVE_GETGID 1
| #define HAVE_GETUID 1
| #define HAVE_MEMPCPY 1
| #define HAVE_MUNMAP 1
| #define HAVE_STPCPY 1
| #define HAVE_STRCASECMP 1
| #define HAVE_STRDUP 1
| #define HAVE_STRTOUL 1
| #define HAVE_TSEARCH 1
| #define HAVE_ARGZ_COUNT 1
| #define HAVE_ARGZ_STRINGIFY 1
| #define HAVE_ARGZ_NEXT 1
| #define HAVE___FSETLOCKING 1
| #define HAVE_DECL_FEOF_UNLOCKED 1
| #define HAVE_DECL_FGETS_UNLOCKED 1
| #define HAVE_ICONV 1
| #define ICONV_CONST
| #define HAVE_NL_LOCALE_NAME 1
| #define HAVE_LONG_LONG_INT 1
| #define HAVE_LONG_DOUBLE 1
| #define HAVE_WCHAR_T 1
| #define HAVE_WINT_T 1
| #define HAVE_INTMAX_T 1
| #define HAVE_POSIX_PRINTF 1
| #define HAVE_STDINT_H 1
| #define HAVE_STDINT_H 1
| #define HAVE_STDDEF_H 1
| #define HAVE_STDLIB_H 1
| #define HAVE_STRING_H 1
| #define HAVE_ASPRINTF 1
| #define HAVE_FWPRINTF 1
| #define HAVE_PUTENV 1
| #define HAVE_SETENV 1
| #define HAVE_SETLOCALE 1
| #define HAVE_SNPRINTF 1
| #define HAVE_WCSLEN 1
| #define HAVE_DECL__SNPRINTF 0
| #define HAVE_DECL__SNWPRINTF 0
| #define HAVE_DECL_GETC_UNLOCKED 1
| #define HAVE_LANGINFO_CODESET 1
| #define HAVE_LC_MESSAGES 1
| #define ENABLE_NLS 1
| #define HAVE_GETTEXT 1
| #define HAVE_DCGETTEXT 1
| #define STDC_HEADERS 1
| #define HAVE_STDLIB_H 1
| #define HAVE_STRING_H 1
| #define HAVE_SYS_TIME_H 1
| #define HAVE_UNISTD_H 1
| #define HAVE_SYS_SELECT_H 1
| #define HAVE_LUA_H 1
| #define TIME_WITH_SYS_TIME 1
| #define HAVE_ATEXIT 1
| #define HAVE_GETTIMEOFDAY 1
| #define HAVE_MEMMOVE 1
| #define HAVE_MEMSET 1
| #define HAVE_MKDIR 1
| #define HAVE_STRCHR 1
| #define HAVE_STRSTR 1
| /* end confdefs.h. */
|
| /* Override any GCC internal prototype to avoid an error.
| Use char because int might match the return type of a GCC
| builtin and then its argument prototype would still apply. */
| #ifdef __cplusplus
| extern "C"
| #endif
| char lua_gettop ();
| int
| main ()
| {
| return lua_gettop ();
| ;
| return 0;
| }
configure:9991: result: no
configure:9998: error: Lua not found
## ---------------- ##
## Cache variables. ##
## ---------------- ##
ac_cv_build=x86_64-unknown-linux-gnu
ac_cv_c_compiler_gnu=yes
ac_cv_c_const=yes
ac_cv_c_inline=inline
ac_cv_c_volatile=yes
ac_cv_env_CC_set=
ac_cv_env_CC_value=
ac_cv_env_CFLAGS_set=
ac_cv_env_CFLAGS_value=
ac_cv_env_CPPFLAGS_set=
ac_cv_env_CPPFLAGS_value=
ac_cv_env_CPP_set=
ac_cv_env_CPP_value=
ac_cv_env_GTK_CFLAGS_set=
ac_cv_env_GTK_CFLAGS_value=
ac_cv_env_GTK_LIBS_set=
ac_cv_env_GTK_LIBS_value=
ac_cv_env_LDFLAGS_set=
ac_cv_env_LDFLAGS_value=
ac_cv_env_LIBS_set=
ac_cv_env_LIBS_value=
ac_cv_env_PKG_CONFIG_set=
ac_cv_env_PKG_CONFIG_value=
ac_cv_env_build_alias_set=
ac_cv_env_build_alias_value=
ac_cv_env_host_alias_set=
ac_cv_env_host_alias_value=
ac_cv_env_target_alias_set=
ac_cv_env_target_alias_value=
ac_cv_func___fsetlocking=yes
ac_cv_func_alloca_works=yes
ac_cv_func_argz_count=yes
ac_cv_func_argz_next=yes
ac_cv_func_argz_stringify=yes
ac_cv_func_asprintf=yes
ac_cv_func_atexit=yes
ac_cv_func_fwprintf=yes
ac_cv_func_getcwd=yes
ac_cv_func_getegid=yes
ac_cv_func_geteuid=yes
ac_cv_func_getgid=yes
ac_cv_func_getpagesize=yes
ac_cv_func_gettimeofday=yes
ac_cv_func_getuid=yes
ac_cv_func_memmove=yes
ac_cv_func_mempcpy=yes
ac_cv_func_memset=yes
ac_cv_func_mkdir=yes
ac_cv_func_mmap_fixed_mapped=yes
ac_cv_func_munmap=yes
ac_cv_func_pow=no
ac_cv_func_putenv=yes
ac_cv_func_setenv=yes
ac_cv_func_setlocale=yes
ac_cv_func_snprintf=yes
ac_cv_func_stpcpy=yes
ac_cv_func_strcasecmp=yes
ac_cv_func_strchr=yes
ac_cv_func_strdup=yes
ac_cv_func_strstr=yes
ac_cv_func_strtoul=yes
ac_cv_func_tsearch=yes
ac_cv_func_wcslen=yes
ac_cv_gnu_library_2=yes
ac_cv_gnu_library_2_1=yes
ac_cv_have_decl__snprintf=no
ac_cv_have_decl__snwprintf=no
ac_cv_have_decl_feof_unlocked=yes
ac_cv_have_decl_fgets_unlocked=yes
ac_cv_have_decl_getc_unlocked=yes
ac_cv_header_argz_h=yes
ac_cv_header_inttypes_h=yes
ac_cv_header_limits_h=yes
ac_cv_header_lua_h=yes
ac_cv_header_memory_h=yes
ac_cv_header_minix_config_h=no
ac_cv_header_pthread_h=yes
ac_cv_header_stdc=yes
ac_cv_header_stddef_h=yes
ac_cv_header_stdint_h=yes
ac_cv_header_stdlib_h=yes
ac_cv_header_string_h=yes
ac_cv_header_strings_h=yes
ac_cv_header_sys_param_h=yes
ac_cv_header_sys_select_h=yes
ac_cv_header_sys_stat_h=yes
ac_cv_header_sys_time_h=yes
ac_cv_header_sys_types_h=yes
ac_cv_header_time=yes
ac_cv_header_unistd_h=yes
ac_cv_host=x86_64-unknown-linux-gnu
ac_cv_lib_dumb_dumb_exit=yes
ac_cv_lib_pthread_pthread_kill=yes
ac_cv_objext=o
ac_cv_path_EGREP='/bin/grep -E'
ac_cv_path_GMSGFMT=/usr/bin/msgfmt
ac_cv_path_GREP=/bin/grep
ac_cv_path_MSGFMT=/usr/bin/msgfmt
ac_cv_path_MSGMERGE=/usr/bin/msgmerge
ac_cv_path_XGETTEXT=/usr/bin/xgettext
ac_cv_path_install='/bin/install -c'
ac_cv_path_mkdir=/bin/mkdir
ac_cv_prog_AWK=gawk
ac_cv_prog_CPP='gcc -E'
ac_cv_prog_HAVE_ALLEGRO=yes
ac_cv_prog_INTLBISON=bison
ac_cv_prog_OBJC=gcc
ac_cv_prog_ac_ct_CC=gcc
ac_cv_prog_ac_ct_RANLIB=ranlib
ac_cv_prog_cc_c89=
ac_cv_prog_cc_g=yes
ac_cv_prog_cc_gcc_c_o=yes
ac_cv_prog_make_make_set=yes
ac_cv_safe_to_define___extensions__=yes
ac_cv_search_lua_gettop=no
ac_cv_struct_tm=time.h
ac_cv_type_long_long_int=yes
ac_cv_type_pthread_rwlock_t=yes
ac_cv_type_ptrdiff_t=yes
ac_cv_type_size_t=yes
ac_cv_type_unsigned_long_long=yes
ac_cv_type_unsigned_long_long_int=yes
ac_cv_working_alloca_h=yes
acl_cv_hardcode_direct=no
acl_cv_hardcode_libdir_flag_spec='${wl}-rpath ${wl}$libdir'
acl_cv_hardcode_libdir_separator=
acl_cv_hardcode_minus_L=no
acl_cv_libext=a
acl_cv_path_LD=/usr/bin/ld
acl_cv_prog_gnu_ld=yes
acl_cv_rpath=done
acl_cv_shlibext=so
acl_cv_wl=-Wl,
am_cv_CC_dependencies_compiler_type=gcc3
am_cv_OBJC_dependencies_compiler_type=gcc3
am_cv_func_iconv=yes
am_cv_langinfo_codeset=yes
am_cv_lib_iconv=no
am_cv_proto_iconv='extern size_t iconv (iconv_t cd, char * *inbuf, size_t *inbytesleft, char * *outbuf, size_t *outbytesleft);'
am_cv_proto_iconv_arg1=
ax_cv_lib_aldmb=yes
gl_cv_cc_visibility=yes
gl_cv_header_inttypes_h=yes
gl_cv_header_stdint_h=yes
gl_cv_size_max=yes
gt_cv_c_intmax_t=yes
gt_cv_c_long_double=yes
gt_cv_c_wchar_t=yes
gt_cv_c_wint_t=yes
gt_cv_func_CFLocaleCopyCurrent=no
gt_cv_func_CFPreferencesCopyAppValue=no
gt_cv_func_gnugettext1_libc=yes
gt_cv_func_printf_posix=yes
gt_cv_int_divbyzero_sigfpe=yes
gt_cv_inttypes_pri_broken=no
gt_cv_nl_locale_name=yes
gt_cv_val_LC_MESSAGES=yes
nls_cv_force_use_gnu_gettext=no
nls_cv_header_intl=
nls_cv_header_libgt=
nls_cv_use_gnu_gettext=no
## ----------------- ##
## Output variables. ##
## ----------------- ##
ACLOCAL='${SHELL} /home/qubodup/src/cvs/kq/missing --run aclocal-1.11'
ALLEGRO_LIBS='-laldmb -ldumb -L/usr/lib -Wl,--export-dynamic -lalleg-4.2.2 -lalleg_unsharable'
ALLOCA=''
AMDEPBACKSLASH='\'
AMDEP_FALSE='#'
AMDEP_TRUE=''
AMTAR='${SHELL} /home/qubodup/src/cvs/kq/missing --run tar'
AUTOCONF='${SHELL} /home/qubodup/src/cvs/kq/missing --run autoconf'
AUTOHEADER='${SHELL} /home/qubodup/src/cvs/kq/missing --run autoheader'
AUTOMAKE='${SHELL} /home/qubodup/src/cvs/kq/missing --run automake-1.11'
AWK='gawk'
BUILD_INCLUDED_LIBINTL='no'
BUNDLE_FALSE=''
BUNDLE_TRUE=''
CATOBJEXT='.gmo'
CC='gcc'
CCDEPMODE='depmode=gcc3'
CFLAGS='-g -O2'
CFLAG_VISIBILITY='-fvisibility=hidden'
CPP='gcc -E'
CPPFLAGS=''
CYGPATH_W='echo'
DATADIRNAME='share'
DEFS=''
DEPDIR='.deps'
ECHO_C=''
ECHO_N='-n'
ECHO_T=''
EGREP='/bin/grep -E'
EXEEXT=''
GENCAT='gencat'
GLIBC21='yes'
GLIBC2='yes'
GMSGFMT='/usr/bin/msgfmt'
GMSGFMT_015='/usr/bin/msgfmt'
GREP='/bin/grep'
GTK_CFLAGS=''
GTK_LIBS=''
HAVE_ALLEGRO='yes'
HAVE_ASPRINTF='1'
HAVE_POSIX_PRINTF='1'
HAVE_SNPRINTF='1'
HAVE_VISIBILITY='1'
HAVE_WPRINTF='0'
INSTALL_DATA='${INSTALL} -m 644'
INSTALL_PROGRAM='${INSTALL}'
INSTALL_SCRIPT='${INSTALL}'
INSTALL_STRIP_PROGRAM='$(install_sh) -c -s'
INSTOBJEXT='.mo'
INTLBISON='bison'
INTLLIBS=''
INTLOBJS=''
INTL_LIBTOOL_SUFFIX_PREFIX=''
INTL_MACOSX_LIBS=''
LDFLAGS=''
LIBICONV=''
LIBINTL=''
LIBMULTITHREAD='-lpthread'
LIBOBJS=''
LIBPTH=''
LIBS=''
LIBTHREAD=''
LTLIBICONV=''
LTLIBINTL=''
LTLIBMULTITHREAD='-lpthread'
LTLIBOBJS=''
LTLIBPTH=''
LTLIBTHREAD=''
MAKEINFO='${SHELL} /home/qubodup/src/cvs/kq/missing --run makeinfo'
MAPDRAW2=''
MKDIR_P='/bin/mkdir -p'
MSGFMT='/usr/bin/msgfmt'
MSGFMT_015='/usr/bin/msgfmt'
MSGMERGE='/usr/bin/msgmerge'
OBJC='gcc'
OBJCDEPMODE='depmode=gcc3'
OBJCFLAGS='-g -O2'
OBJEXT='o'
PACKAGE='kq'
PACKAGE_BUGREPORT='peterhull90@users.sourceforge.net'
PACKAGE_NAME='KQ'
PACKAGE_STRING='KQ 0.99'
PACKAGE_TARNAME='kq'
PACKAGE_URL=''
PACKAGE_VERSION='0.99'
PATH_SEPARATOR=':'
PKG_CONFIG=''
POSUB='po'
PRI_MACROS_BROKEN='0'
RANLIB='ranlib'
SET_MAKE=''
SHELL='/bin/sh'
STRIP=''
USE_INCLUDED_LIBINTL='no'
USE_NLS='yes'
VERSION='0.99'
WARNING_CFLAGS='-Wall -Wextra -Wfloat-equal -Wredundant-decls -Wmissing-noreturn -Wendif-labels -Wunused-parameter -Wpointer-arith -Wwrite-strings -Wcast-align -Wcast-qual -Winline -Wformat=2 -Winit-self -Wswitch-enum -Wunused-parameter -Wundef -Wno-error -Wmissing-declarations -Werror-implicit-function-declaration -Wmissing-prototypes -Wstrict-prototypes -Wold-style-definition -Wdeclaration-after-statement'
WOE32DLL='no'
XGETTEXT='/usr/bin/xgettext'
XGETTEXT_015='/usr/bin/xgettext'
ac_ct_CC='gcc'
am__EXEEXT_FALSE=''
am__EXEEXT_TRUE=''
am__fastdepCC_FALSE='#'
am__fastdepCC_TRUE=''
am__fastdepOBJC_FALSE='#'
am__fastdepOBJC_TRUE=''
am__include='include'
am__isrc=''
am__leading_dot='.'
am__quote=''
am__tar='${AMTAR} chof - "$$tardir"'
am__untar='${AMTAR} xf -'
bindir='${exec_prefix}/bin'
build='x86_64-unknown-linux-gnu'
build_alias=''
build_cpu='x86_64'
build_os='linux-gnu'
build_vendor='unknown'
datadir='${datarootdir}'
datarootdir='${prefix}/share'
docdir='${datarootdir}/doc/${PACKAGE_TARNAME}'
dvidir='${docdir}'
exec_prefix='NONE'
host='x86_64-unknown-linux-gnu'
host_alias=''
host_cpu='x86_64'
host_os='linux-gnu'
host_vendor='unknown'
htmldir='${docdir}'
includedir='${prefix}/include'
infodir='${datarootdir}/info'
install_sh='${SHELL} /home/qubodup/src/cvs/kq/install-sh'
kq_extra_files=''
kq_target_dir=''
kq_use_2xsai=''
kq_use_profile=''
libdir='${exec_prefix}/lib'
libexecdir='${exec_prefix}/libexec'
localedir='${datarootdir}/locale'
localstatedir='${prefix}/var'
mandir='${datarootdir}/man'
mkdir_p='mkdir -p -- .'
oldincludedir='/usr/include'
pdfdir='${docdir}'
prefix='NONE'
program_transform_name='s,x,x,'
psdir='${docdir}'
sbindir='${exec_prefix}/sbin'
sharedstatedir='${prefix}/com'
sysconfdir='${prefix}/etc'
target_alias=''
## ----------- ##
## confdefs.h. ##
## ----------- ##
/* confdefs.h */
#define PACKAGE_NAME "KQ"
#define PACKAGE_TARNAME "kq"
#define PACKAGE_VERSION "0.99"
#define PACKAGE_STRING "KQ 0.99"
#define PACKAGE_BUGREPORT "peterhull90@users.sourceforge.net"
#define PACKAGE_URL ""
#define PACKAGE "kq"
#define VERSION "0.99"
#define STDC_HEADERS 1
#define HAVE_SYS_TYPES_H 1
#define HAVE_SYS_STAT_H 1
#define HAVE_STDLIB_H 1
#define HAVE_STRING_H 1
#define HAVE_MEMORY_H 1
#define HAVE_STRINGS_H 1
#define HAVE_INTTYPES_H 1
#define HAVE_STDINT_H 1
#define HAVE_UNISTD_H 1
#define __EXTENSIONS__ 1
#define _ALL_SOURCE 1
#define _GNU_SOURCE 1
#define _POSIX_PTHREAD_SEMANTICS 1
#define _TANDEM_SOURCE 1
#define HAVE_VISIBILITY 1
#define HAVE_STDINT_H_WITH_UINTMAX 1
#define HAVE_ALLOCA_H 1
#define HAVE_ALLOCA 1
#define HAVE_STDLIB_H 1
#define HAVE_UNISTD_H 1
#define HAVE_GETPAGESIZE 1
#define HAVE_MMAP 1
#define INTDIV0_RAISES_SIGFPE 1
#define HAVE_INTTYPES_H_WITH_UINTMAX 1
#define HAVE_UNSIGNED_LONG_LONG_INT 1
#define HAVE_UNSIGNED_LONG_LONG 1
#define HAVE_UINTMAX_T 1
#define HAVE_INTTYPES_H 1
#define USE_POSIX_THREADS 1
#define USE_POSIX_THREADS_WEAK 1
#define HAVE_PTHREAD_RWLOCK 1
#define HAVE_PTHREAD_MUTEX_RECURSIVE 1
#define HAVE_BUILTIN_EXPECT 1
#define HAVE_ARGZ_H 1
#define HAVE_INTTYPES_H 1
#define HAVE_LIMITS_H 1
#define HAVE_UNISTD_H 1
#define HAVE_SYS_PARAM_H 1
#define HAVE_GETCWD 1
#define HAVE_GETEGID 1
#define HAVE_GETEUID 1
#define HAVE_GETGID 1
#define HAVE_GETUID 1
#define HAVE_MEMPCPY 1
#define HAVE_MUNMAP 1
#define HAVE_STPCPY 1
#define HAVE_STRCASECMP 1
#define HAVE_STRDUP 1
#define HAVE_STRTOUL 1
#define HAVE_TSEARCH 1
#define HAVE_ARGZ_COUNT 1
#define HAVE_ARGZ_STRINGIFY 1
#define HAVE_ARGZ_NEXT 1
#define HAVE___FSETLOCKING 1
#define HAVE_DECL_FEOF_UNLOCKED 1
#define HAVE_DECL_FGETS_UNLOCKED 1
#define HAVE_ICONV 1
#define ICONV_CONST
#define HAVE_NL_LOCALE_NAME 1
#define HAVE_LONG_LONG_INT 1
#define HAVE_LONG_DOUBLE 1
#define HAVE_WCHAR_T 1
#define HAVE_WINT_T 1
#define HAVE_INTMAX_T 1
#define HAVE_POSIX_PRINTF 1
#define HAVE_STDINT_H 1
#define HAVE_STDINT_H 1
#define HAVE_STDDEF_H 1
#define HAVE_STDLIB_H 1
#define HAVE_STRING_H 1
#define HAVE_ASPRINTF 1
#define HAVE_FWPRINTF 1
#define HAVE_PUTENV 1
#define HAVE_SETENV 1
#define HAVE_SETLOCALE 1
#define HAVE_SNPRINTF 1
#define HAVE_WCSLEN 1
#define HAVE_DECL__SNPRINTF 0
#define HAVE_DECL__SNWPRINTF 0
#define HAVE_DECL_GETC_UNLOCKED 1
#define HAVE_LANGINFO_CODESET 1
#define HAVE_LC_MESSAGES 1
#define ENABLE_NLS 1
#define HAVE_GETTEXT 1
#define HAVE_DCGETTEXT 1
#define STDC_HEADERS 1
#define HAVE_STDLIB_H 1
#define HAVE_STRING_H 1
#define HAVE_SYS_TIME_H 1
#define HAVE_UNISTD_H 1
#define HAVE_SYS_SELECT_H 1
#define HAVE_LUA_H 1
#define TIME_WITH_SYS_TIME 1
#define HAVE_ATEXIT 1
#define HAVE_GETTIMEOFDAY 1
#define HAVE_MEMMOVE 1
#define HAVE_MEMSET 1
#define HAVE_MKDIR 1
#define HAVE_STRCHR 1
#define HAVE_STRSTR 1
configure: exit 1