Summary:
Wrote 4 collections
Wrote 4 images
Wrote 0 fonts
Wrote 371 bytes (0Kb) of original source data
Wrote 0 bytes (0Kb) of original source font map
Conservative compression summary:
Wrote total 11255 bytes (11Kb) from 2749 (3Kb) input data
Output file is 409.4% the size of the input data
Saved -8506 bytes (-7Kb)
Raw compression summary:
Wrote total 11255 bytes (11Kb) from 16384 (16Kb) raw input data
Output file is 68.7% the size of the raw input data
Saved 5129 bytes (5Kb)
make[4]: Leaving directory `/var/tmp/portage/e_modules-9999/work/e_modules/calendar/src/images'
make[4]: Entering directory `/var/tmp/portage/e_modules-9999/work/e_modules/calendar/src'
if /bin/sh ../libtool --mode=compile i386-pc-linux-gnu-gcc -DHAVE_CONFIG_H -I. -I. -I.. -I. -I.. -I/usr/include -I/usr/include/enlightenment -DUSE_E_CONFIG_H -march=athlon-xp -O2 -mtune=i686 -pipe -MT add_event_dialog.lo -MD -MP -MF ".deps/add_event_dialog.Tpo" -c -o add_event_dialog.lo add_event_dialog.c; \
then mv -f ".deps/add_event_dialog.Tpo" ".deps/add_event_dialog.Plo"; else rm -f ".deps/add_event_dialog.Tpo"; exit 1; fi
mkdir .libs
i386-pc-linux-gnu-gcc -DHAVE_CONFIG_H -I. -I. -I.. -I. -I.. -I/usr/include -I/usr/include/enlightenment -DUSE_E_CONFIG_H -march=athlon-xp -O2 -mtune=i686 -pipe -MT add_event_dialog.lo -MD -MP -MF .deps/add_event_dialog.Tpo -c add_event_dialog.c -fPIC -DPIC -o .libs/add_event_dialog.o
In file included from add_event_dialog.c:2:
e_mod_main.h:220: error: parse error before "E_Gadman_Client"
e_mod_main.h:220: warning: no semicolon at end of struct or union
e_mod_main.h:259: error: parse error before '}' token
In file included from e_mod_main.h:332,
from add_event_dialog.c:2:
cal_face_func.h:16: error: parse error before "E_Gadman_Client"
add_event_dialog.c: In function `_add_event_basic_create_widgets':
add_event_dialog.c:130: warning: passing arg 2 of `e_widget_entry_add' from incompatible pointer type
make[4]: *** [add_event_dialog.lo] Error 1
make[4]: Leaving directory `/var/tmp/portage/e_modules-9999/work/e_modules/calendar/src'
make[3]: *** [all-recursive] Error 1
make[3]: Leaving directory `/var/tmp/portage/e_modules-9999/work/e_modules/calendar/src'
make[2]: *** [all-recursive] Error 1
make[2]: Leaving directory `/var/tmp/portage/e_modules-9999/work/e_modules/calendar'
make[1]: *** [all] Error 2
make[1]: Leaving directory `/var/tmp/portage/e_modules-9999/work/e_modules/calendar'
make: *** [all] Error 1
* This is a LIVE CVS ebuild.
* That means there are NO promises it will work.
* If it fails to build, FIX THE CODE YOURSELF
* before reporting any issues.
!!! ERROR: x11-plugins/e_modules-9999 failed.
Call stack:
ebuild.sh, line 1543: Called dyn_compile
ebuild.sh, line 938: Called src_compile
ebuild.sh, line 1252: Called enlightenment_src_compile
enlightenment.eclass, line 153: Called enlightenment_die 'emake failed'
enlightenment.eclass, line 100: Called die
!!! emake failed
!!! SEND BUG REPORTS TO vapier@gentoo.org NOT THE E TEAM
!!! If you need support, post the topmost build error, and the call stack if relevant.