All pastes #155249 Raw Edit

Unnamed

public text v1 · immutable
#155249 ·published 2006-08-30 22:38 UTC
rendered paste body
This file contains any messages produced by compilers while
running configure, to aid debugging if configure makes a mistake.

It was created by MPFR configure 2.2.0, which was
generated by GNU Autoconf 2.59.  Invocation command line was

  $ ./configure --prefix=/usr --host=i686-pc-linux-gnu --mandir=/usr/share/man --infodir=/usr/share/info --datadir=/usr/share --sysconfdir=/etc --localstatedir=/var/lib --enable-shared --enable-static --libdir=/usr/lib64 --build=i686-pc-linux-gnu

## --------- ##
## Platform. ##
## --------- ##

hostname = localhost
uname -m = i686
uname -r = 2.6.17-gentoo-r7
uname -s = Linux
uname -v = #1 SMP Wed Aug 30 21:22:09 CEST 2006

/usr/bin/uname -p = AMD Athlon(tm) 64 Processor 3000+
/bin/uname -X     = unknown

/bin/arch              = i686
/usr/bin/arch -k       = unknown
/usr/convex/getsysinfo = unknown
hostinfo               = unknown
/bin/machine           = unknown
/usr/bin/oslevel       = unknown
/bin/universe          = unknown

PATH: /usr/local/sbin
PATH: /sbin
PATH: /usr/sbin
PATH: /usr/lib/portage/bin
PATH: /usr/local/bin
PATH: /bin
PATH: /usr/bin
PATH: /opt/bin
PATH: /usr/i686-pc-linux-gnu/gcc-bin/3.4.6
PATH: /opt/ati/bin
PATH: /opt/ati/sbin
PATH: /usr/kde/3.5/sbin
PATH: /usr/kde/3.5/bin
PATH: /usr/qt/3/bin
PATH: /usr/kde/3.4/sbin
PATH: /usr/kde/3.4/bin


## ----------- ##
## Core tests. ##
## ----------- ##

configure:1600: checking for a BSD-compatible install
configure:1655: result: /bin/install -c
configure:1666: checking whether build environment is sane
configure:1709: result: yes
configure:1774: checking for gawk
configure:1790: found /bin/gawk
configure:1800: result: gawk
configure:1810: checking whether make sets $(MAKE)
configure:1830: result: yes
configure:1996: checking build system type
configure:2014: result: i686-pc-linux-gnu
configure:2022: checking host system type
configure:2036: result: i686-pc-linux-gnu
configure:2167: checking for i686-pc-linux-gnu-gcc
configure:2183: found /usr/bin/i686-pc-linux-gnu-gcc
configure:2193: result: i686-pc-linux-gnu-gcc
configure:2475: checking for C compiler version
configure:2478: i686-pc-linux-gnu-gcc --version </dev/null >&5
i686-pc-linux-gnu-gcc (GCC) 3.4.6 (Gentoo 3.4.6-r1, ssp-3.4.5-1.0, pie-8.7.9)
Copyright (C) 2006 Free Software Foundation, Inc.
This is free software; see the source for copying conditions.  There is NO
warranty; not even for MERCHANTABILITY or FITNESS FOR A PARTICULAR PURPOSE.

configure:2481: $? = 0
configure:2483: i686-pc-linux-gnu-gcc -v </dev/null >&5
Reading specs from /usr/lib/gcc/i686-pc-linux-gnu/3.4.6/specs
Configured with: /var/tmp/portage/gcc-3.4.6-r1/work/gcc-3.4.6/configure --prefix=/usr --bindir=/usr/i686-pc-linux-gnu/gcc-bin/3.4.6 --includedir=/usr/lib/gcc/i686-pc-linux-gnu/3.4.6/include --datadir=/usr/share/gcc-data/i686-pc-linux-gnu/3.4.6 --mandir=/usr/share/gcc-data/i686-pc-linux-gnu/3.4.6/man --infodir=/usr/share/gcc-data/i686-pc-linux-gnu/3.4.6/info --with-gxx-include-dir=/usr/lib/gcc/i686-pc-linux-gnu/3.4.6/include/g++-v3 --host=i686-pc-linux-gnu --build=i686-pc-linux-gnu --disable-altivec --enable-nls --without-included-gettext --with-system-zlib --disable-checking --disable-werror --disable-libunwind-exceptions --disable-multilib --disable-libgcj --enable-languages=c,c++,f77 --enable-shared --enable-threads=posix --enable-__cxa_atexit --enable-clocale=gnu
Thread model: posix
gcc version 3.4.6 (Gentoo 3.4.6-r1, ssp-3.4.5-1.0, pie-8.7.9)
configure:2486: $? = 0
configure:2488: i686-pc-linux-gnu-gcc -V </dev/null >&5
i686-pc-linux-gnu-gcc: `-V' option must have argument
configure:2491: $? = 1
configure:2514: checking for C compiler default output file name
configure:2517: i686-pc-linux-gnu-gcc -march=athlon64 -O2 -pipe   conftest.c  >&5
configure:2520: $? = 0
configure:2566: result: a.out
configure:2571: checking whether the C compiler works
configure:2577: ./a.out
configure:2580: $? = 0
configure:2597: result: yes
configure:2604: checking whether we are cross compiling
configure:2606: result: no
configure:2609: checking for suffix of executables
configure:2611: i686-pc-linux-gnu-gcc -o conftest -march=athlon64 -O2 -pipe   conftest.c  >&5
configure:2614: $? = 0
configure:2639: result: 
configure:2645: checking for suffix of object files
configure:2666: i686-pc-linux-gnu-gcc -c -march=athlon64 -O2 -pipe  conftest.c >&5
configure:2669: $? = 0
configure:2691: result: o
configure:2695: checking whether we are using the GNU C compiler
configure:2719: i686-pc-linux-gnu-gcc -c -march=athlon64 -O2 -pipe  conftest.c >&5
configure:2725: $? = 0
configure:2728: test -z 			 || test ! -s conftest.err
configure:2731: $? = 0
configure:2734: test -s conftest.o
configure:2737: $? = 0
configure:2750: result: yes
configure:2756: checking whether i686-pc-linux-gnu-gcc accepts -g
configure:2777: i686-pc-linux-gnu-gcc -c -g  conftest.c >&5
configure:2783: $? = 0
configure:2786: test -z 			 || test ! -s conftest.err
configure:2789: $? = 0
configure:2792: test -s conftest.o
configure:2795: $? = 0
configure:2806: result: yes
configure:2823: checking for i686-pc-linux-gnu-gcc option to accept ANSI C
configure:2893: i686-pc-linux-gnu-gcc  -c -march=athlon64 -O2 -pipe  conftest.c >&5
configure:2899: $? = 0
configure:2902: test -z 			 || test ! -s conftest.err
configure:2905: $? = 0
configure:2908: test -s conftest.o
configure:2911: $? = 0
configure:2929: result: none needed
configure:2947: i686-pc-linux-gnu-gcc -c -march=athlon64 -O2 -pipe  conftest.c >&5
conftest.c:2: error: syntax error before "me"
configure:2953: $? = 1
configure: failed program was:
| #ifndef __cplusplus
|   choke me
| #endif
configure:3094: checking for style of include used by make
configure:3122: result: GNU
configure:3150: checking dependency style of i686-pc-linux-gnu-gcc
configure:3240: result: gcc3
configure:3378: checking for ICC
configure:3401: i686-pc-linux-gnu-gcc -c -march=athlon64 -O2 -pipe  conftest.c >&5
conftest.c:11:3: #error "ICC Not Found"
conftest.c:15: error: syntax error before "int"
configure:3407: $? = 1
configure: failed program was:
| /* confdefs.h.  */
| 
| #define PACKAGE_NAME "MPFR"
| #define PACKAGE_TARNAME "mpfr"
| #define PACKAGE_VERSION "2.2.0"
| #define PACKAGE_STRING "MPFR 2.2.0"
| #define PACKAGE_BUGREPORT ""
| /* end confdefs.h.  */
| 
| #if !defined(__ICC)
| # error "ICC Not Found"
| error
| #endif
| 
| int
| main ()
| {
| 
|   ;
|   return 0;
| }
configure:3431: result: no
configure:3443: checking for function prototypes
configure:3446: result: yes
configure:3468: checking how to run the C preprocessor
configure:3503: i686-pc-linux-gnu-gcc -E  conftest.c
configure:3509: $? = 0
configure:3541: i686-pc-linux-gnu-gcc -E  conftest.c
conftest.c:11:28: ac_nonexistent.h: No such file or directory
configure:3547: $? = 1
configure: failed program was:
| /* confdefs.h.  */
| 
| #define PACKAGE_NAME "MPFR"
| #define PACKAGE_TARNAME "mpfr"
| #define PACKAGE_VERSION "2.2.0"
| #define PACKAGE_STRING "MPFR 2.2.0"
| #define PACKAGE_BUGREPORT ""
| #define PROTOTYPES 1
| #define __PROTOTYPES 1
| /* end confdefs.h.  */
| #include <ac_nonexistent.h>
configure:3586: result: i686-pc-linux-gnu-gcc -E
configure:3610: i686-pc-linux-gnu-gcc -E  conftest.c
configure:3616: $? = 0
configure:3648: i686-pc-linux-gnu-gcc -E  conftest.c
conftest.c:11:28: ac_nonexistent.h: No such file or directory
configure:3654: $? = 1
configure: failed program was:
| /* confdefs.h.  */
| 
| #define PACKAGE_NAME "MPFR"
| #define PACKAGE_TARNAME "mpfr"
| #define PACKAGE_VERSION "2.2.0"
| #define PACKAGE_STRING "MPFR 2.2.0"
| #define PACKAGE_BUGREPORT ""
| #define PROTOTYPES 1
| #define __PROTOTYPES 1
| /* end confdefs.h.  */
| #include <ac_nonexistent.h>
configure:3698: checking for egrep
configure:3708: result: grep -E
configure:3713: checking for ANSI C header files
configure:3738: i686-pc-linux-gnu-gcc -c -march=athlon64 -O2 -pipe  conftest.c >&5
configure:3744: $? = 0
configure:3747: test -z 			 || test ! -s conftest.err
configure:3750: $? = 0
configure:3753: test -s conftest.o
configure:3756: $? = 0
configure:3845: i686-pc-linux-gnu-gcc -o conftest -march=athlon64 -O2 -pipe   conftest.c  >&5
configure:3848: $? = 0
configure:3850: ./conftest
configure:3853: $? = 0
configure:3868: result: yes
configure:3892: checking for sys/types.h
configure:3908: i686-pc-linux-gnu-gcc -c -march=athlon64 -O2 -pipe  conftest.c >&5
configure:3914: $? = 0
configure:3917: test -z 			 || test ! -s conftest.err
configure:3920: $? = 0
configure:3923: test -s conftest.o
configure:3926: $? = 0
configure:3937: result: yes
configure:3892: checking for sys/stat.h
configure:3908: i686-pc-linux-gnu-gcc -c -march=athlon64 -O2 -pipe  conftest.c >&5
configure:3914: $? = 0
configure:3917: test -z 			 || test ! -s conftest.err
configure:3920: $? = 0
configure:3923: test -s conftest.o
configure:3926: $? = 0
configure:3937: result: yes
configure:3892: checking for stdlib.h
configure:3908: i686-pc-linux-gnu-gcc -c -march=athlon64 -O2 -pipe  conftest.c >&5
configure:3914: $? = 0
configure:3917: test -z 			 || test ! -s conftest.err
configure:3920: $? = 0
configure:3923: test -s conftest.o
configure:3926: $? = 0
configure:3937: result: yes
configure:3892: checking for string.h
configure:3908: i686-pc-linux-gnu-gcc -c -march=athlon64 -O2 -pipe  conftest.c >&5
configure:3914: $? = 0
configure:3917: test -z 			 || test ! -s conftest.err
configure:3920: $? = 0
configure:3923: test -s conftest.o
configure:3926: $? = 0
configure:3937: result: yes
configure:3892: checking for memory.h
configure:3908: i686-pc-linux-gnu-gcc -c -march=athlon64 -O2 -pipe  conftest.c >&5
configure:3914: $? = 0
configure:3917: test -z 			 || test ! -s conftest.err
configure:3920: $? = 0
configure:3923: test -s conftest.o
configure:3926: $? = 0
configure:3937: result: yes
configure:3892: checking for strings.h
configure:3908: i686-pc-linux-gnu-gcc -c -march=athlon64 -O2 -pipe  conftest.c >&5
configure:3914: $? = 0
configure:3917: test -z 			 || test ! -s conftest.err
configure:3920: $? = 0
configure:3923: test -s conftest.o
configure:3926: $? = 0
configure:3937: result: yes
configure:3892: checking for inttypes.h
configure:3908: i686-pc-linux-gnu-gcc -c -march=athlon64 -O2 -pipe  conftest.c >&5
configure:3914: $? = 0
configure:3917: test -z 			 || test ! -s conftest.err
configure:3920: $? = 0
configure:3923: test -s conftest.o
configure:3926: $? = 0
configure:3937: result: yes
configure:3892: checking for stdint.h
configure:3908: i686-pc-linux-gnu-gcc -c -march=athlon64 -O2 -pipe  conftest.c >&5
configure:3914: $? = 0
configure:3917: test -z 			 || test ! -s conftest.err
configure:3920: $? = 0
configure:3923: test -s conftest.o
configure:3926: $? = 0
configure:3937: result: yes
configure:3892: checking for unistd.h
configure:3908: i686-pc-linux-gnu-gcc -c -march=athlon64 -O2 -pipe  conftest.c >&5
configure:3914: $? = 0
configure:3917: test -z 			 || test ! -s conftest.err
configure:3920: $? = 0
configure:3923: test -s conftest.o
configure:3926: $? = 0
configure:3937: result: yes
configure:3962: checking for string.h
configure:3967: result: yes
configure:4123: checking for an ANSI C-conforming const
configure:4190: i686-pc-linux-gnu-gcc -c -march=athlon64 -O2 -pipe  conftest.c >&5
configure:4196: $? = 0
configure:4199: test -z 			 || test ! -s conftest.err
configure:4202: $? = 0
configure:4205: test -s conftest.o
configure:4208: $? = 0
configure:4219: result: yes
configure:4229: checking for working volatile
configure:4252: i686-pc-linux-gnu-gcc -c -march=athlon64 -O2 -pipe  conftest.c >&5
configure:4258: $? = 0
configure:4261: test -z 			 || test ! -s conftest.err
configure:4264: $? = 0
configure:4267: test -s conftest.o
configure:4270: $? = 0
configure:4281: result: yes
configure:4622: checking for main in -lm
configure:4646: i686-pc-linux-gnu-gcc -o conftest -march=athlon64 -O2 -pipe   conftest.c -lm   >&5
configure:4652: $? = 0
configure:4655: test -z 			 || test ! -s conftest.err
configure:4658: $? = 0
configure:4661: test -s conftest
configure:4664: $? = 0
configure:4677: result: yes
configure:4686: checking whether time.h and sys/time.h may both be included
configure:4711: i686-pc-linux-gnu-gcc -c -march=athlon64 -O2 -pipe  conftest.c >&5
configure:4717: $? = 0
configure:4720: test -z 			 || test ! -s conftest.err
configure:4723: $? = 0
configure:4726: test -s conftest.o
configure:4729: $? = 0
configure:4740: result: yes
configure:4766: checking limits.h usability
configure:4778: i686-pc-linux-gnu-gcc -c -march=athlon64 -O2 -pipe  conftest.c >&5
configure:4784: $? = 0
configure:4787: test -z 			 || test ! -s conftest.err
configure:4790: $? = 0
configure:4793: test -s conftest.o
configure:4796: $? = 0
configure:4806: result: yes
configure:4810: checking limits.h presence
configure:4820: i686-pc-linux-gnu-gcc -E  conftest.c
configure:4826: $? = 0
configure:4846: result: yes
configure:4881: checking for limits.h
configure:4888: result: yes
configure:4911: checking float.h usability
configure:4923: i686-pc-linux-gnu-gcc -c -march=athlon64 -O2 -pipe  conftest.c >&5
configure:4929: $? = 0
configure:4932: test -z 			 || test ! -s conftest.err
configure:4935: $? = 0
configure:4938: test -s conftest.o
configure:4941: $? = 0
configure:4951: result: yes
configure:4955: checking float.h presence
configure:4965: i686-pc-linux-gnu-gcc -E  conftest.c
configure:4971: $? = 0
configure:4991: result: yes
configure:5026: checking for float.h
configure:5033: result: yes
configure:5057: checking stdarg.h usability
configure:5069: i686-pc-linux-gnu-gcc -c -march=athlon64 -O2 -pipe  conftest.c >&5
configure:5075: $? = 0
configure:5078: test -z 			 || test ! -s conftest.err
configure:5081: $? = 0
configure:5084: test -s conftest.o
configure:5087: $? = 0
configure:5097: result: yes
configure:5101: checking stdarg.h presence
configure:5111: i686-pc-linux-gnu-gcc -E  conftest.c
configure:5117: $? = 0
configure:5137: result: yes
configure:5172: checking for stdarg.h
configure:5179: result: yes
configure:5354: checking sys/time.h usability
configure:5366: i686-pc-linux-gnu-gcc -c -march=athlon64 -O2 -pipe  conftest.c >&5
configure:5372: $? = 0
configure:5375: test -z 			 || test ! -s conftest.err
configure:5378: $? = 0
configure:5381: test -s conftest.o
configure:5384: $? = 0
configure:5394: result: yes
configure:5398: checking sys/time.h presence
configure:5408: i686-pc-linux-gnu-gcc -E  conftest.c
configure:5414: $? = 0
configure:5434: result: yes
configure:5469: checking for sys/time.h
configure:5476: result: yes
configure:5354: checking sys/fpu.h usability
configure:5366: i686-pc-linux-gnu-gcc -c -march=athlon64 -O2 -pipe  conftest.c >&5
conftest.c:59:21: sys/fpu.h: No such file or directory
configure:5372: $? = 1
configure: failed program was:
| /* confdefs.h.  */
| 
| #define PACKAGE_NAME "MPFR"
| #define PACKAGE_TARNAME "mpfr"
| #define PACKAGE_VERSION "2.2.0"
| #define PACKAGE_STRING "MPFR 2.2.0"
| #define PACKAGE_BUGREPORT ""
| #define PROTOTYPES 1
| #define __PROTOTYPES 1
| #define STDC_HEADERS 1
| #define HAVE_SYS_TYPES_H 1
| #define HAVE_SYS_STAT_H 1
| #define HAVE_STDLIB_H 1
| #define HAVE_STRING_H 1
| #define HAVE_MEMORY_H 1
| #define HAVE_STRINGS_H 1
| #define HAVE_INTTYPES_H 1
| #define HAVE_STDINT_H 1
| #define HAVE_UNISTD_H 1
| #define HAVE_STRING_H 1
| #define TIME_WITH_SYS_TIME 1
| #define HAVE_STDARG 1
| #define HAVE_SYS_TIME_H 1
| /* end confdefs.h.  */
| #include <stdio.h>
| #if HAVE_SYS_TYPES_H
| # include <sys/types.h>
| #endif
| #if HAVE_SYS_STAT_H
| # include <sys/stat.h>
| #endif
| #if STDC_HEADERS
| # include <stdlib.h>
| # include <stddef.h>
| #else
| # if HAVE_STDLIB_H
| #  include <stdlib.h>
| # endif
| #endif
| #if HAVE_STRING_H
| # if !STDC_HEADERS && HAVE_MEMORY_H
| #  include <memory.h>
| # endif
| # include <string.h>
| #endif
| #if HAVE_STRINGS_H
| # include <strings.h>
| #endif
| #if HAVE_INTTYPES_H
| # include <inttypes.h>
| #else
| # if HAVE_STDINT_H
| #  include <stdint.h>
| # endif
| #endif
| #if HAVE_UNISTD_H
| # include <unistd.h>
| #endif
| #include <sys/fpu.h>
configure:5394: result: no
configure:5398: checking sys/fpu.h presence
configure:5408: i686-pc-linux-gnu-gcc -E  conftest.c
conftest.c:25:21: sys/fpu.h: No such file or directory
configure:5414: $? = 1
configure: failed program was:
| /* confdefs.h.  */
| 
| #define PACKAGE_NAME "MPFR"
| #define PACKAGE_TARNAME "mpfr"
| #define PACKAGE_VERSION "2.2.0"
| #define PACKAGE_STRING "MPFR 2.2.0"
| #define PACKAGE_BUGREPORT ""
| #define PROTOTYPES 1
| #define __PROTOTYPES 1
| #define STDC_HEADERS 1
| #define HAVE_SYS_TYPES_H 1
| #define HAVE_SYS_STAT_H 1
| #define HAVE_STDLIB_H 1
| #define HAVE_STRING_H 1
| #define HAVE_MEMORY_H 1
| #define HAVE_STRINGS_H 1
| #define HAVE_INTTYPES_H 1
| #define HAVE_STDINT_H 1
| #define HAVE_UNISTD_H 1
| #define HAVE_STRING_H 1
| #define TIME_WITH_SYS_TIME 1
| #define HAVE_STDARG 1
| #define HAVE_SYS_TIME_H 1
| /* end confdefs.h.  */
| #include <sys/fpu.h>
configure:5434: result: no
configure:5469: checking for sys/fpu.h
configure:5476: result: no
configure:5497: checking for memset
configure:5554: i686-pc-linux-gnu-gcc -o conftest -march=athlon64 -O2 -pipe   conftest.c  >&5
conftest.c:49: warning: conflicting types for built-in function 'memset'
configure:5560: $? = 0
configure:5563: test -z 			 || test ! -s conftest.err
configure:5566: $? = 0
configure:5569: test -s conftest
configure:5572: $? = 0
configure:5584: result: yes
configure:5497: checking for setlocale
configure:5554: i686-pc-linux-gnu-gcc -o conftest -march=athlon64 -O2 -pipe   conftest.c  >&5
configure:5560: $? = 0
configure:5563: test -z 			 || test ! -s conftest.err
configure:5566: $? = 0
configure:5569: test -s conftest
configure:5572: $? = 0
configure:5584: result: yes
configure:5497: checking for strtol
configure:5554: i686-pc-linux-gnu-gcc -o conftest -march=athlon64 -O2 -pipe   conftest.c  >&5
configure:5560: $? = 0
configure:5563: test -z 			 || test ! -s conftest.err
configure:5566: $? = 0
configure:5569: test -s conftest
configure:5572: $? = 0
configure:5584: result: yes
configure:5497: checking for gettimeofday
configure:5554: i686-pc-linux-gnu-gcc -o conftest -march=athlon64 -O2 -pipe   conftest.c  >&5
configure:5560: $? = 0
configure:5563: test -z 			 || test ! -s conftest.err
configure:5566: $? = 0
configure:5569: test -s conftest
configure:5572: $? = 0
configure:5584: result: yes
configure:5665: checking for union fpc_csr
configure:5694: i686-pc-linux-gnu-gcc -c -march=athlon64 -O2 -pipe  conftest.c >&5
conftest.c: In function `main':
conftest.c:40: error: invalid application of `sizeof' to incomplete type `fpc_csr' 
configure:5700: $? = 1
configure: failed program was:
| /* confdefs.h.  */
| 
| #define PACKAGE_NAME "MPFR"
| #define PACKAGE_TARNAME "mpfr"
| #define PACKAGE_VERSION "2.2.0"
| #define PACKAGE_STRING "MPFR 2.2.0"
| #define PACKAGE_BUGREPORT ""
| #define PROTOTYPES 1
| #define __PROTOTYPES 1
| #define STDC_HEADERS 1
| #define HAVE_SYS_TYPES_H 1
| #define HAVE_SYS_STAT_H 1
| #define HAVE_STDLIB_H 1
| #define HAVE_STRING_H 1
| #define HAVE_MEMORY_H 1
| #define HAVE_STRINGS_H 1
| #define HAVE_INTTYPES_H 1
| #define HAVE_STDINT_H 1
| #define HAVE_UNISTD_H 1
| #define HAVE_STRING_H 1
| #define TIME_WITH_SYS_TIME 1
| #define HAVE_STDARG 1
| #define HAVE_SYS_TIME_H 1
| #define HAVE_MEMSET 1
| #define HAVE_SETLOCALE 1
| #define HAVE_STRTOL 1
| #define HAVE_GETTIMEOFDAY 1
| /* end confdefs.h.  */
| 
| #if HAVE_SYS_FPU_H
| #  include <sys/fpu.h>
| #endif
| 
| 
| int
| main ()
| {
| if ((union fpc_csr *) 0)
|   return 0;
| if (sizeof (union fpc_csr))
|   return 0;
|   ;
|   return 0;
| }
configure:5723: result: no
configure:5734: checking for fesetround
configure:5758: i686-pc-linux-gnu-gcc -o conftest -march=athlon64 -O2 -pipe   conftest.c  -lm >&5
configure:5764: $? = 0
configure:5767: test -z 			 || test ! -s conftest.err
configure:5770: $? = 0
configure:5773: test -s conftest
configure:5776: $? = 0
configure:5790: result: yes
configure:5801: checking for gcc float-conversion bug
configure:5845: i686-pc-linux-gnu-gcc -o conftest -march=athlon64 -O2 -pipe   conftest.c  -lm >&5
configure:5848: $? = 0
configure:5850: ./conftest
configure:5853: $? = 1
configure: program exited with status 1
configure: failed program was:
| /* confdefs.h.  */
| 
| #define PACKAGE_NAME "MPFR"
| #define PACKAGE_TARNAME "mpfr"
| #define PACKAGE_VERSION "2.2.0"
| #define PACKAGE_STRING "MPFR 2.2.0"
| #define PACKAGE_BUGREPORT ""
| #define PROTOTYPES 1
| #define __PROTOTYPES 1
| #define STDC_HEADERS 1
| #define HAVE_SYS_TYPES_H 1
| #define HAVE_SYS_STAT_H 1
| #define HAVE_STDLIB_H 1
| #define HAVE_STRING_H 1
| #define HAVE_MEMORY_H 1
| #define HAVE_STRINGS_H 1
| #define HAVE_INTTYPES_H 1
| #define HAVE_STDINT_H 1
| #define HAVE_UNISTD_H 1
| #define HAVE_STRING_H 1
| #define TIME_WITH_SYS_TIME 1
| #define HAVE_STDARG 1
| #define HAVE_SYS_TIME_H 1
| #define HAVE_MEMSET 1
| #define HAVE_SETLOCALE 1
| #define HAVE_STRTOL 1
| #define HAVE_GETTIMEOFDAY 1
| #define MPFR_HAVE_FESETROUND 1
| /* end confdefs.h.  */
| 
| #include <float.h>
| #ifdef MPFR_HAVE_FESETROUND
| #include <fenv.h>
| #endif
| static double get_max (void);
| int main() {
|   double x = 0.5;
|   int i;
|   for (i = 1; i <= 11; i++)
|     x *= x;
|   if (x != 0)
|     return 1;
| #ifdef MPFR_HAVE_FESETROUND
|   /* Useful test for the G4 PowerPC */
|   fesetround(FE_TOWARDZERO);
|   x = get_max ();
|   x *= 2.0;
|   if (x != get_max ())
|     return 1;
| #endif
|   return 0;
| }
| static double get_max (void) { return DBL_MAX; }
| 
configure:5869: result: yes, use -ffloat-store
configure:5876: checking for denormalized numbers
configure:5902: i686-pc-linux-gnu-gcc -o conftest -march=athlon64 -O2 -pipe -ffloat-store   conftest.c  >&5
configure:5905: $? = 0
configure:5907: ./conftest
1.112537e-308
configure:5910: $? = 0
configure:5925: result: yes
configure:5935: checking if NAN == NAN
configure:5964: i686-pc-linux-gnu-gcc -o conftest -march=athlon64 -O2 -pipe -ffloat-store   conftest.c  >&5
configure:5967: $? = 0
configure:5969: ./conftest
configure:5972: $? = 1
configure: program exited with status 1
configure: failed program was:
| /* confdefs.h.  */
| 
| #define PACKAGE_NAME "MPFR"
| #define PACKAGE_TARNAME "mpfr"
| #define PACKAGE_VERSION "2.2.0"
| #define PACKAGE_STRING "MPFR 2.2.0"
| #define PACKAGE_BUGREPORT ""
| #define PROTOTYPES 1
| #define __PROTOTYPES 1
| #define STDC_HEADERS 1
| #define HAVE_SYS_TYPES_H 1
| #define HAVE_SYS_STAT_H 1
| #define HAVE_STDLIB_H 1
| #define HAVE_STRING_H 1
| #define HAVE_MEMORY_H 1
| #define HAVE_STRINGS_H 1
| #define HAVE_INTTYPES_H 1
| #define HAVE_STDINT_H 1
| #define HAVE_UNISTD_H 1
| #define HAVE_STRING_H 1
| #define TIME_WITH_SYS_TIME 1
| #define HAVE_STDARG 1
| #define HAVE_SYS_TIME_H 1
| #define HAVE_MEMSET 1
| #define HAVE_SETLOCALE 1
| #define HAVE_STRTOL 1
| #define HAVE_GETTIMEOFDAY 1
| #define MPFR_HAVE_FESETROUND 1
| #define HAVE_DENORMS 1
| /* end confdefs.h.  */
| 
| #include <stdio.h>
| #include <math.h>
| #ifndef NAN
| # define NAN (0.0/0.0)
| #endif
| int main() {
|   double d;
|   d = NAN;
|   return d != d;
| }
| 
configure:5987: result: no
configure:5997: checking if charset has consecutive values
configure:6032: i686-pc-linux-gnu-gcc -o conftest -march=athlon64 -O2 -pipe -ffloat-store   conftest.c  >&5
configure:6035: $? = 0
configure:6037: ./conftest
configure:6040: $? = 0
configure:6042: result: yes
configure:6065: checking for math/round
configure:6090: i686-pc-linux-gnu-gcc -o conftest -march=athlon64 -O2 -pipe -ffloat-store   conftest.c  -lm >&5
conftest.c: In function `main':
conftest.c:40: error: `round' undeclared (first use in this function)
conftest.c:40: error: (Each undeclared identifier is reported only once
conftest.c:40: error: for each function it appears in.)
configure:6096: $? = 1
configure: failed program was:
| /* confdefs.h.  */
| 
| #define PACKAGE_NAME "MPFR"
| #define PACKAGE_TARNAME "mpfr"
| #define PACKAGE_VERSION "2.2.0"
| #define PACKAGE_STRING "MPFR 2.2.0"
| #define PACKAGE_BUGREPORT ""
| #define PROTOTYPES 1
| #define __PROTOTYPES 1
| #define STDC_HEADERS 1
| #define HAVE_SYS_TYPES_H 1
| #define HAVE_SYS_STAT_H 1
| #define HAVE_STDLIB_H 1
| #define HAVE_STRING_H 1
| #define HAVE_MEMORY_H 1
| #define HAVE_STRINGS_H 1
| #define HAVE_INTTYPES_H 1
| #define HAVE_STDINT_H 1
| #define HAVE_UNISTD_H 1
| #define HAVE_STRING_H 1
| #define TIME_WITH_SYS_TIME 1
| #define HAVE_STDARG 1
| #define HAVE_SYS_TIME_H 1
| #define HAVE_MEMSET 1
| #define HAVE_SETLOCALE 1
| #define HAVE_STRTOL 1
| #define HAVE_GETTIMEOFDAY 1
| #define MPFR_HAVE_FESETROUND 1
| #define HAVE_DENORMS 1
| /* end confdefs.h.  */
| 
| #include <math.h>
| int f (double (*func)(double)) { return 0;}
| 
| int
| main ()
| {
| 
|  double a = 17.42;
|  a = f (round);
|  return 0;
| 
|   ;
|   return 0;
| }
configure:6123: result: no
configure:6129: checking for math/trunc
configure:6154: i686-pc-linux-gnu-gcc -o conftest -march=athlon64 -O2 -pipe -ffloat-store   conftest.c  -lm >&5
conftest.c: In function `main':
conftest.c:40: error: `trunc' undeclared (first use in this function)
conftest.c:40: error: (Each undeclared identifier is reported only once
conftest.c:40: error: for each function it appears in.)
configure:6160: $? = 1
configure: failed program was:
| /* confdefs.h.  */
| 
| #define PACKAGE_NAME "MPFR"
| #define PACKAGE_TARNAME "mpfr"
| #define PACKAGE_VERSION "2.2.0"
| #define PACKAGE_STRING "MPFR 2.2.0"
| #define PACKAGE_BUGREPORT ""
| #define PROTOTYPES 1
| #define __PROTOTYPES 1
| #define STDC_HEADERS 1
| #define HAVE_SYS_TYPES_H 1
| #define HAVE_SYS_STAT_H 1
| #define HAVE_STDLIB_H 1
| #define HAVE_STRING_H 1
| #define HAVE_MEMORY_H 1
| #define HAVE_STRINGS_H 1
| #define HAVE_INTTYPES_H 1
| #define HAVE_STDINT_H 1
| #define HAVE_UNISTD_H 1
| #define HAVE_STRING_H 1
| #define TIME_WITH_SYS_TIME 1
| #define HAVE_STDARG 1
| #define HAVE_SYS_TIME_H 1
| #define HAVE_MEMSET 1
| #define HAVE_SETLOCALE 1
| #define HAVE_STRTOL 1
| #define HAVE_GETTIMEOFDAY 1
| #define MPFR_HAVE_FESETROUND 1
| #define HAVE_DENORMS 1
| /* end confdefs.h.  */
| 
| #include <math.h>
| int f (double (*func)(double)) { return 0;}
| 
| int
| main ()
| {
| 
|  double a = 17.42;
|  a = f(trunc);
|  return 0;
| 
|   ;
|   return 0;
| }
configure:6187: result: no
configure:6193: checking for math/floor
configure:6218: i686-pc-linux-gnu-gcc -o conftest -march=athlon64 -O2 -pipe -ffloat-store   conftest.c  -lm >&5
configure:6224: $? = 0
configure:6227: test -z 			 || test ! -s conftest.err
configure:6230: $? = 0
configure:6233: test -s conftest
configure:6236: $? = 0
configure:6239: result: yes
configure:6257: checking for math/ceil
configure:6282: i686-pc-linux-gnu-gcc -o conftest -march=athlon64 -O2 -pipe -ffloat-store   conftest.c  -lm >&5
configure:6288: $? = 0
configure:6291: test -z 			 || test ! -s conftest.err
configure:6294: $? = 0
configure:6297: test -s conftest
configure:6300: $? = 0
configure:6303: result: yes
configure:6321: checking for math/rint
configure:6346: i686-pc-linux-gnu-gcc -o conftest -march=athlon64 -O2 -pipe -ffloat-store   conftest.c  -lm >&5
conftest.c: In function `main':
conftest.c:42: error: `nearbyint' undeclared (first use in this function)
conftest.c:42: error: (Each undeclared identifier is reported only once
conftest.c:42: error: for each function it appears in.)
configure:6352: $? = 1
configure: failed program was:
| /* confdefs.h.  */
| 
| #define PACKAGE_NAME "MPFR"
| #define PACKAGE_TARNAME "mpfr"
| #define PACKAGE_VERSION "2.2.0"
| #define PACKAGE_STRING "MPFR 2.2.0"
| #define PACKAGE_BUGREPORT ""
| #define PROTOTYPES 1
| #define __PROTOTYPES 1
| #define STDC_HEADERS 1
| #define HAVE_SYS_TYPES_H 1
| #define HAVE_SYS_STAT_H 1
| #define HAVE_STDLIB_H 1
| #define HAVE_STRING_H 1
| #define HAVE_MEMORY_H 1
| #define HAVE_STRINGS_H 1
| #define HAVE_INTTYPES_H 1
| #define HAVE_STDINT_H 1
| #define HAVE_UNISTD_H 1
| #define HAVE_STRING_H 1
| #define TIME_WITH_SYS_TIME 1
| #define HAVE_STDARG 1
| #define HAVE_SYS_TIME_H 1
| #define HAVE_MEMSET 1
| #define HAVE_SETLOCALE 1
| #define HAVE_STRTOL 1
| #define HAVE_GETTIMEOFDAY 1
| #define MPFR_HAVE_FESETROUND 1
| #define HAVE_DENORMS 1
| #define HAVE_FLOOR 1
| #define HAVE_CEIL 1
| /* end confdefs.h.  */
| 
| #include <math.h>
| int f (double (*func)(double)) { return 0;}
| 
| int
| main ()
| {
| 
|  double a = 17.42;
|  a = f(nearbyint);
|  return 0;
| 
|   ;
|   return 0;
| }
configure:6379: result: no
configure:6390: checking for long double
configure:6414: i686-pc-linux-gnu-gcc -c -march=athlon64 -O2 -pipe -ffloat-store  conftest.c >&5
configure:6420: $? = 0
configure:6423: test -z 			 || test ! -s conftest.err
configure:6426: $? = 0
configure:6429: test -s conftest.o
configure:6432: $? = 0
configure:6443: result: yes
configure:6454: checking format of `long double' floating point
configure:6481: i686-pc-linux-gnu-gcc -march=athlon64 -O2 -pipe -ffloat-store  -c conftest.c >&5 2>&1
configure:6484: $? = 0
configure:6643: result: IEEE extended, little endian
configure:7801: checking for a sed that does not truncate output
configure:7855: result: /bin/sed
configure:7869: checking for ld used by i686-pc-linux-gnu-gcc
configure:7936: result: /usr/i686-pc-linux-gnu/bin/ld
configure:7945: checking if the linker (/usr/i686-pc-linux-gnu/bin/ld) is GNU ld
configure:7960: result: yes
configure:7965: checking for /usr/i686-pc-linux-gnu/bin/ld option to reload object files
configure:7972: result: -r
configure:7981: checking for BSD-compatible nm
configure:8023: result: /usr/bin/i686-pc-linux-gnu-nm -B
configure:8027: checking whether ln -s works
configure:8031: result: yes
configure:8038: checking how to recognise dependent libraries
configure:8212: result: pass_all
configure:8674: checking dlfcn.h usability
configure:8686: i686-pc-linux-gnu-gcc -c -march=athlon64 -O2 -pipe -ffloat-store  conftest.c >&5
configure:8692: $? = 0
configure:8695: test -z 			 || test ! -s conftest.err
configure:8698: $? = 0
configure:8701: test -s conftest.o
configure:8704: $? = 0
configure:8714: result: yes
configure:8718: checking dlfcn.h presence
configure:8728: i686-pc-linux-gnu-gcc -E  conftest.c
configure:8734: $? = 0
configure:8754: result: yes
configure:8789: checking for dlfcn.h
configure:8796: result: yes
configure:8815: checking the maximum length of command line arguments
configure:8880: result: 32768
configure:8891: checking command to parse /usr/bin/i686-pc-linux-gnu-nm -B output from i686-pc-linux-gnu-gcc object
configure:8980: i686-pc-linux-gnu-gcc -c -march=athlon64 -O2 -pipe -ffloat-store  conftest.c >&5
configure:8983: $? = 0
configure:8987: /usr/bin/i686-pc-linux-gnu-nm -B conftest.o \| sed -n -e 's/^.*[ 	]\([ABCDGIRSTW][ABCDGIRSTW]*\)[ 	][ 	]*\(\)\([_A-Za-z][_A-Za-z0-9]*\)$/\1 \2\3 \3/p' \> conftest.nm
configure:8990: $? = 0
configure:9042: i686-pc-linux-gnu-gcc -o conftest -march=athlon64 -O2 -pipe -ffloat-store   conftest.c conftstm.o >&5
configure:9045: $? = 0
configure:9083: result: ok
configure:9087: checking for objdir
configure:9102: result: .libs
configure:9154: checking for i686-pc-linux-gnu-ar
configure:9170: found /usr/bin/i686-pc-linux-gnu-ar
configure:9180: result: i686-pc-linux-gnu-ar
configure:9234: checking for i686-pc-linux-gnu-ranlib
configure:9250: found /usr/bin/i686-pc-linux-gnu-ranlib
configure:9260: result: i686-pc-linux-gnu-ranlib
configure:9314: checking for i686-pc-linux-gnu-strip
configure:9330: found /usr/bin/i686-pc-linux-gnu-strip
configure:9340: result: i686-pc-linux-gnu-strip
configure:9641: checking if i686-pc-linux-gnu-gcc static flag  works
configure:9664: result: yes
configure:9682: checking if i686-pc-linux-gnu-gcc supports -fno-rtti -fno-exceptions
configure:9700: i686-pc-linux-gnu-gcc -c -march=athlon64 -O2 -pipe -ffloat-store  -fno-rtti -fno-exceptions conftest.c >&5
cc1: warning: command line option "-fno-rtti" is valid for C++/ObjC++ but not for C
configure:9704: $? = 0
configure:9715: result: no
configure:9730: checking for i686-pc-linux-gnu-gcc option to produce PIC
configure:9907: result: -fPIC
configure:9915: checking if i686-pc-linux-gnu-gcc PIC flag -fPIC works
configure:9933: i686-pc-linux-gnu-gcc -c -march=athlon64 -O2 -pipe -ffloat-store  -fPIC -DPIC conftest.c >&5
configure:9937: $? = 0
configure:9948: result: yes
configure:9972: checking if i686-pc-linux-gnu-gcc supports -c -o file.o
configure:9993: i686-pc-linux-gnu-gcc -c -march=athlon64 -O2 -pipe -ffloat-store  -o out/conftest2.o conftest.c >&5
configure:9997: $? = 0
configure:10017: result: yes
configure:10043: checking whether the i686-pc-linux-gnu-gcc linker (/usr/i686-pc-linux-gnu/bin/ld) supports shared libraries
configure:10890: result: yes
configure:10916: checking whether -lc should be explicitly linked in
configure:10921: i686-pc-linux-gnu-gcc -c -march=athlon64 -O2 -pipe -ffloat-store  conftest.c >&5
configure:10924: $? = 0
configure:10938: i686-pc-linux-gnu-gcc -shared conftest.o  -v -Wl,-soname -Wl,conftest -o conftest 2\>\&1 \| grep  -lc  \>/dev/null 2\>\&1
configure:10941: $? = 0
configure:10953: result: no
configure:10961: checking dynamic linker characteristics
configure:11513: result: GNU/Linux ld.so
configure:11517: checking how to hardcode library paths into programs
configure:11542: result: immediate
configure:11556: checking whether stripping libraries is possible
configure:11561: result: yes
configure:12384: checking if libtool supports shared libraries
configure:12386: result: yes
configure:12389: checking whether to build shared libraries
configure:12447: result: yes
configure:12450: checking whether to build static libraries
configure:12454: result: yes
configure:12546: creating libtool
configure:22511: checking for gmp.h
configure:22524: i686-pc-linux-gnu-gcc -c -march=athlon64 -O2 -pipe -ffloat-store  conftest.c >&5
configure:22530: $? = 0
configure:22533: test -z 			 || test ! -s conftest.err
configure:22536: $? = 0
configure:22539: test -s conftest.o
configure:22542: $? = 0
configure:22544: result: yes
configure:22560: checking for recent GMP
configure:22577: i686-pc-linux-gnu-gcc -c -march=athlon64 -O2 -pipe -ffloat-store  conftest.c >&5
configure:22583: $? = 0
configure:22586: test -z 			 || test ! -s conftest.err
configure:22589: $? = 0
configure:22592: test -s conftest.o
configure:22595: $? = 0
configure:22597: result: yes
configure:22613: checking for gmp internal files
configure:22628: i686-pc-linux-gnu-gcc -c -march=athlon64 -O2 -pipe -ffloat-store  conftest.c >&5
conftest.c:38:22: gmp-impl.h: No such file or directory
conftest.c:39:22: longlong.h: No such file or directory
configure:22634: $? = 1
configure: failed program was:
| /* confdefs.h.  */
| 
| #define PACKAGE_NAME "MPFR"
| #define PACKAGE_TARNAME "mpfr"
| #define PACKAGE_VERSION "2.2.0"
| #define PACKAGE_STRING "MPFR 2.2.0"
| #define PACKAGE_BUGREPORT ""
| #define PROTOTYPES 1
| #define __PROTOTYPES 1
| #define STDC_HEADERS 1
| #define HAVE_SYS_TYPES_H 1
| #define HAVE_SYS_STAT_H 1
| #define HAVE_STDLIB_H 1
| #define HAVE_STRING_H 1
| #define HAVE_MEMORY_H 1
| #define HAVE_STRINGS_H 1
| #define HAVE_INTTYPES_H 1
| #define HAVE_STDINT_H 1
| #define HAVE_UNISTD_H 1
| #define HAVE_STRING_H 1
| #define TIME_WITH_SYS_TIME 1
| #define HAVE_STDARG 1
| #define HAVE_SYS_TIME_H 1
| #define HAVE_MEMSET 1
| #define HAVE_SETLOCALE 1
| #define HAVE_STRTOL 1
| #define HAVE_GETTIMEOFDAY 1
| #define MPFR_HAVE_FESETROUND 1
| #define HAVE_DENORMS 1
| #define HAVE_FLOOR 1
| #define HAVE_CEIL 1
| #define HAVE_LONG_DOUBLE 1
| #define HAVE_LDOUBLE_IEEE_EXT_LITTLE 1
| #define HAVE_DLFCN_H 1
| /* end confdefs.h.  */
| 
| #include "gmp.h"
| #include "gmp-impl.h"
| #include "longlong.h"
| 
configure:22663: result: no
configure:22667: checking for working alloca.h
configure:22688: i686-pc-linux-gnu-gcc -o conftest -march=athlon64 -O2 -pipe -ffloat-store   conftest.c  >&5
configure:22694: $? = 0
configure:22697: test -z 			 || test ! -s conftest.err
configure:22700: $? = 0
configure:22703: test -s conftest
configure:22706: $? = 0
configure:22718: result: yes
configure:22728: checking for alloca
configure:22769: i686-pc-linux-gnu-gcc -o conftest -march=athlon64 -O2 -pipe -ffloat-store   conftest.c  >&5
configure:22775: $? = 0
configure:22778: test -z 			 || test ! -s conftest.err
configure:22781: $? = 0
configure:22784: test -s conftest
configure:22787: $? = 0
configure:22799: result: yes
configure:23091: checking for __gmpz_init in -lgmp
configure:23121: i686-pc-linux-gnu-gcc -o conftest -march=athlon64 -O2 -pipe -ffloat-store   conftest.c -lgmp   >&5
/usr/lib/gcc/i686-pc-linux-gnu/3.4.6/../../../../i686-pc-linux-gnu/bin/ld: cannot find -lgmp
collect2: ld returned 1 exit status
configure:23127: $? = 1
configure: failed program was:
| /* confdefs.h.  */
| 
| #define PACKAGE_NAME "MPFR"
| #define PACKAGE_TARNAME "mpfr"
| #define PACKAGE_VERSION "2.2.0"
| #define PACKAGE_STRING "MPFR 2.2.0"
| #define PACKAGE_BUGREPORT ""
| #define PROTOTYPES 1
| #define __PROTOTYPES 1
| #define STDC_HEADERS 1
| #define HAVE_SYS_TYPES_H 1
| #define HAVE_SYS_STAT_H 1
| #define HAVE_STDLIB_H 1
| #define HAVE_STRING_H 1
| #define HAVE_MEMORY_H 1
| #define HAVE_STRINGS_H 1
| #define HAVE_INTTYPES_H 1
| #define HAVE_STDINT_H 1
| #define HAVE_UNISTD_H 1
| #define HAVE_STRING_H 1
| #define TIME_WITH_SYS_TIME 1
| #define HAVE_STDARG 1
| #define HAVE_SYS_TIME_H 1
| #define HAVE_MEMSET 1
| #define HAVE_SETLOCALE 1
| #define HAVE_STRTOL 1
| #define HAVE_GETTIMEOFDAY 1
| #define MPFR_HAVE_FESETROUND 1
| #define HAVE_DENORMS 1
| #define HAVE_FLOOR 1
| #define HAVE_CEIL 1
| #define HAVE_LONG_DOUBLE 1
| #define HAVE_LDOUBLE_IEEE_EXT_LITTLE 1
| #define HAVE_DLFCN_H 1
| #define HAVE_ALLOCA_H 1
| #define HAVE_ALLOCA 1
| /* end confdefs.h.  */
| 
| /* Override any gcc2 internal prototype to avoid an error.  */
| #ifdef __cplusplus
| extern "C"
| #endif
| /* We use char because int might match the return type of a gcc2
|    builtin and then its argument prototype would still apply.  */
| char __gmpz_init ();
| int
| main ()
| {
| __gmpz_init ();
|   ;
|   return 0;
| }
configure:23152: result: no
configure:23157: error: libgmp not found

## ---------------- ##
## Cache variables. ##
## ---------------- ##

ac_cv_build=i686-pc-linux-gnu
ac_cv_build_alias=i686-pc-linux-gnu
ac_cv_c_compiler_gnu=yes
ac_cv_c_const=yes
ac_cv_c_volatile=yes
ac_cv_env_CC_set=
ac_cv_env_CC_value=
ac_cv_env_CFLAGS_set=set
ac_cv_env_CFLAGS_value='-march=athlon64 -O2 -pipe'
ac_cv_env_CPPFLAGS_set=
ac_cv_env_CPPFLAGS_value=
ac_cv_env_CPP_set=
ac_cv_env_CPP_value=
ac_cv_env_CXXCPP_set=
ac_cv_env_CXXCPP_value=
ac_cv_env_CXXFLAGS_set=set
ac_cv_env_CXXFLAGS_value='-march=athlon64 -O2 -pipe'
ac_cv_env_CXX_set=
ac_cv_env_CXX_value=
ac_cv_env_F77_set=
ac_cv_env_F77_value=
ac_cv_env_FFLAGS_set=
ac_cv_env_FFLAGS_value=
ac_cv_env_LDFLAGS_set=
ac_cv_env_LDFLAGS_value=
ac_cv_env_build_alias_set=set
ac_cv_env_build_alias_value=i686-pc-linux-gnu
ac_cv_env_host_alias_set=set
ac_cv_env_host_alias_value=i686-pc-linux-gnu
ac_cv_env_target_alias_set=
ac_cv_env_target_alias_value=
ac_cv_exeext=
ac_cv_func_alloca_works=yes
ac_cv_func_gettimeofday=yes
ac_cv_func_memset=yes
ac_cv_func_setlocale=yes
ac_cv_func_strtol=yes
ac_cv_header_dlfcn_h=yes
ac_cv_header_float_h=yes
ac_cv_header_inttypes_h=yes
ac_cv_header_limits_h=yes
ac_cv_header_memory_h=yes
ac_cv_header_stdarg_h=yes
ac_cv_header_stdc=yes
ac_cv_header_stdint_h=yes
ac_cv_header_stdlib_h=yes
ac_cv_header_string_h=yes
ac_cv_header_strings_h=yes
ac_cv_header_sys_fpu_h=no
ac_cv_header_sys_stat_h=yes
ac_cv_header_sys_time_h=yes
ac_cv_header_sys_types_h=yes
ac_cv_header_time=yes
ac_cv_header_unistd_h=yes
ac_cv_host=i686-pc-linux-gnu
ac_cv_host_alias=i686-pc-linux-gnu
ac_cv_lib_gmp___gmpz_init=no
ac_cv_lib_m_main=yes
ac_cv_objext=o
ac_cv_path_install='/bin/install -c'
ac_cv_prog_AR=i686-pc-linux-gnu-ar
ac_cv_prog_AWK=gawk
ac_cv_prog_CC=i686-pc-linux-gnu-gcc
ac_cv_prog_CPP='i686-pc-linux-gnu-gcc -E'
ac_cv_prog_RANLIB=i686-pc-linux-gnu-ranlib
ac_cv_prog_STRIP=i686-pc-linux-gnu-strip
ac_cv_prog_cc_g=yes
ac_cv_prog_cc_stdc=
ac_cv_prog_egrep='grep -E'
ac_cv_prog_make_make_set=yes
ac_cv_type_long_double=yes
ac_cv_type_union_fpc_csr=no
ac_cv_working_alloca_h=yes
am_cv_CC_dependencies_compiler_type=gcc3
lt_cv_deplibs_check_method=pass_all
lt_cv_file_magic_cmd='$MAGIC_CMD'
lt_cv_file_magic_test_file=
lt_cv_ld_reload_flag=-r
lt_cv_objdir=.libs
lt_cv_path_LD=/usr/i686-pc-linux-gnu/bin/ld
lt_cv_path_NM='/usr/bin/i686-pc-linux-gnu-nm -B'
lt_cv_path_SED=/bin/sed
lt_cv_prog_compiler_c_o=yes
lt_cv_prog_compiler_rtti_exceptions=no
lt_cv_prog_gnu_ld=yes
lt_cv_sys_global_symbol_pipe='sed -n -e '\''s/^.*[ 	]\([ABCDGIRSTW][ABCDGIRSTW]*\)[ 	][ 	]*\(\)\([_A-Za-z][_A-Za-z0-9]*\)$/\1 \2\3 \3/p'\'''
lt_cv_sys_global_symbol_to_c_name_address='sed -n -e '\''s/^: \([^ ]*\) $/  {\"\1\", (lt_ptr) 0},/p'\'' -e '\''s/^[BCDEGRST] \([^ ]*\) \([^ ]*\)$/  {"\2", (lt_ptr) \&\2},/p'\'''
lt_cv_sys_global_symbol_to_cdecl='sed -n -e '\''s/^. .* \(.*\)$/extern int \1;/p'\'''
lt_cv_sys_max_cmd_len=32768
lt_lt_cv_prog_compiler_c_o='"yes"'
lt_lt_cv_sys_global_symbol_pipe='"sed -n -e '\''s/^.*[ 	]\\([ABCDGIRSTW][ABCDGIRSTW]*\\)[ 	][ 	]*\\(\\)\\([_A-Za-z][_A-Za-z0-9]*\\)\$/\\1 \\2\\3 \\3/p'\''"'
lt_lt_cv_sys_global_symbol_to_c_name_address='"sed -n -e '\''s/^: \\([^ ]*\\) \$/  {\\\"\\1\\\", (lt_ptr) 0},/p'\'' -e '\''s/^[BCDEGRST] \\([^ ]*\\) \\([^ ]*\\)\$/  {\"\\2\", (lt_ptr) \\&\\2},/p'\''"'
lt_lt_cv_sys_global_symbol_to_cdecl='"sed -n -e '\''s/^. .* \\(.*\\)\$/extern int \\1;/p'\''"'
mpfr_cv_c_long_double_format='IEEE extended, little endian'
mpfr_cv_gcc_floatconv_bug='yes, use -ffloat-store'
mpfr_cv_have_denorms=yes
mpfr_cv_have_fesetround=yes
mpfr_cv_nanisnan=no

## ----------------- ##
## Output variables. ##
## ----------------- ##

ACLOCAL='${SHELL} /var/tmp/portage/mpfr-2.2.0_p10/work/mpfr-2.2.0/missing --run aclocal-1.9'
ALLOCA=''
AMDEPBACKSLASH='\'
AMDEP_FALSE='#'
AMDEP_TRUE=''
AMTAR='${SHELL} /var/tmp/portage/mpfr-2.2.0_p10/work/mpfr-2.2.0/missing --run tar'
ANSI2KNR=''
AR='i686-pc-linux-gnu-ar'
AS='as'
AUTOCONF='${SHELL} /var/tmp/portage/mpfr-2.2.0_p10/work/mpfr-2.2.0/missing --run autoconf'
AUTOHEADER='${SHELL} /var/tmp/portage/mpfr-2.2.0_p10/work/mpfr-2.2.0/missing --run autoheader'
AUTOMAKE='${SHELL} /var/tmp/portage/mpfr-2.2.0_p10/work/mpfr-2.2.0/missing --run automake-1.9'
AWK='gawk'
CC='i686-pc-linux-gnu-gcc'
CCDEPMODE='depmode=gcc3'
CFLAGS='-march=athlon64 -O2 -pipe -ffloat-store'
CPP='i686-pc-linux-gnu-gcc -E'
CPPFLAGS=''
CXX=''
CXXCPP=''
CXXDEPMODE=''
CXXFLAGS='-march=athlon64 -O2 -pipe'
CYGPATH_W='echo'
DEFS=''
DEPDIR='.deps'
DLLTOOL='dlltool'
ECHO='echo'
ECHO_C=''
ECHO_N='-n'
ECHO_T=''
EGREP='grep -E'
EXEEXT=''
F77=''
FFLAGS=''
INSTALL_DATA='${INSTALL} -m 644'
INSTALL_PROGRAM='${INSTALL}'
INSTALL_SCRIPT='${INSTALL}'
INSTALL_STRIP_PROGRAM='${SHELL} $(install_sh) -c -s'
LDFLAGS=''
LIBOBJS=''
LIBS=''
LIBTOOL='$(SHELL) $(top_builddir)/libtool'
LN_S='ln -s'
LTLIBOBJS=''
MAKEINFO='${SHELL} /var/tmp/portage/mpfr-2.2.0_p10/work/mpfr-2.2.0/missing --run makeinfo'
MPFR_LIBM='-lm'
OBJDUMP='objdump'
OBJEXT='o'
PACKAGE='mpfr'
PACKAGE_BUGREPORT=''
PACKAGE_NAME='MPFR'
PACKAGE_STRING='MPFR 2.2.0'
PACKAGE_TARNAME='mpfr'
PACKAGE_VERSION='2.2.0'
PATH_SEPARATOR=':'
RANLIB='i686-pc-linux-gnu-ranlib'
SET_MAKE=''
SHELL='/bin/sh'
STRIP='i686-pc-linux-gnu-strip'
U=''
VERSION='2.2.0'
ac_ct_AR=''
ac_ct_AS=''
ac_ct_CC=''
ac_ct_CXX=''
ac_ct_DLLTOOL=''
ac_ct_F77=''
ac_ct_OBJDUMP=''
ac_ct_RANLIB=''
ac_ct_STRIP=''
am__fastdepCC_FALSE='#'
am__fastdepCC_TRUE=''
am__fastdepCXX_FALSE='#'
am__fastdepCXX_TRUE=''
am__include='include'
am__leading_dot='.'
am__quote=''
am__tar='${AMTAR} chof - "$$tardir"'
am__untar='${AMTAR} xf -'
bindir='${exec_prefix}/bin'
build='i686-pc-linux-gnu'
build_alias='i686-pc-linux-gnu'
build_cpu='i686'
build_os='linux-gnu'
build_vendor='pc'
datadir='/usr/share'
exec_prefix='NONE'
host='i686-pc-linux-gnu'
host_alias='i686-pc-linux-gnu'
host_cpu='i686'
host_os='linux-gnu'
host_vendor='pc'
includedir='${prefix}/include'
infodir='/usr/share/info'
install_sh='/var/tmp/portage/mpfr-2.2.0_p10/work/mpfr-2.2.0/install-sh'
libdir='/usr/lib64'
libexecdir='${exec_prefix}/libexec'
localstatedir='/var/lib'
mandir='/usr/share/man'
mkdir_p='mkdir -p --'
oldincludedir='/usr/include'
prefix='/usr'
program_transform_name='s,x,x,'
sbindir='${exec_prefix}/sbin'
sharedstatedir='${prefix}/com'
sysconfdir='/etc'
target_alias=''

## ----------- ##
## confdefs.h. ##
## ----------- ##

#define HAVE_ALLOCA 1
#define HAVE_ALLOCA_H 1
#define HAVE_CEIL 1
#define HAVE_DENORMS 1
#define HAVE_DLFCN_H 1
#define HAVE_FLOOR 1
#define HAVE_GETTIMEOFDAY 1
#define HAVE_INTTYPES_H 1
#define HAVE_LDOUBLE_IEEE_EXT_LITTLE 1
#define HAVE_LONG_DOUBLE 1
#define HAVE_MEMORY_H 1
#define HAVE_MEMSET 1
#define HAVE_SETLOCALE 1
#define HAVE_STDARG 1
#define HAVE_STDINT_H 1
#define HAVE_STDLIB_H 1
#define HAVE_STRINGS_H 1
#define HAVE_STRING_H 1
#define HAVE_STRING_H 1
#define HAVE_STRTOL 1
#define HAVE_SYS_STAT_H 1
#define HAVE_SYS_TIME_H 1
#define HAVE_SYS_TYPES_H 1
#define HAVE_UNISTD_H 1
#define MPFR_HAVE_FESETROUND 1
#define PACKAGE_BUGREPORT ""
#define PACKAGE_NAME "MPFR"
#define PACKAGE_STRING "MPFR 2.2.0"
#define PACKAGE_TARNAME "mpfr"
#define PACKAGE_VERSION "2.2.0"
#define PROTOTYPES 1
#define STDC_HEADERS 1
#define TIME_WITH_SYS_TIME 1
#define __PROTOTYPES 1

configure: exit 1