All pastes #155141 Raw Edit

Anonymous

public text v1 · immutable
#155141 ·published 2006-08-30 21:21 UTC
rendered paste body
 gcc -DHAVE_CONFIG_H -I. -I. -I../../.. -I../../.. -I../../../widgets -I../../../addressbook/ -I../../../addressbook/gui/merging -I../../../widgets/table -I../../../shell -DEVOLUTION_GLADEDIR=\"/usr/share/evolution/2.6/glade\" -DEVOLUTION_IMAGESDIR=\"/usr/share/evolution/2.6/images\" -DG_LOG_DOMAIN=\"contact-editor\" -DORBIT2=1 -pthread -I/usr/local/include/evolution-data-server-1.8 -I/usr/include/gconf/2 -I/usr/include/orbit-2.0 -I/usr/include/glib-2.0 -I/usr/lib/glib-2.0/include -I/usr/include/libbonoboui-2.0 -I/usr/include/libxml2 -I/usr/include/libbonobo-2.0 -I/usr/include/libgnomecanvas-2.0 -I/usr/include/libgnome-2.0 -I/usr/include/bonobo-activation-2.0 -I/usr/include/libart-2.0 -I/usr/include/pango-1.0 -I/usr/include/freetype2 -I/usr/include/gtk-2.0 -I/usr/lib/gtk-2.0/include -I/usr/include/atk-1.0 -I/usr/include/cairo -I/usr/include/gnome-vfs-2.0 -I/usr/lib/gnome-vfs-2.0/include -I/usr/include/libglade-2.0 -I/usr/include/libgnomeui-2.0 -I/usr/include/gnome-keyring-1 -I/usr/include/libgnomeprintui-2.2 -I/usr/include/libgnomeprint-2.2 -I/usr/include/libgtkhtml-3.8 -march=athlon-xp -O2 -pipe -Wall -Wmissing-prototypes -Wno-sign-compare -MT e-contact-editor.lo -MD -MP -MF .deps/e-contact-editor.Tpo -c e-contact-editor.c  -fPIC -DPIC -o .libs/e-contact-editor.o
e-contact-editor.c: In function `fill_in_simple_field':
e-contact-editor.c:2189: error: structure has no member named `length'
e-contact-editor.c:2189: error: incompatible type for argument 2 of `e_image_chooser_set_image_data'
e-contact-editor.c: In function `extract_simple_field':
e-contact-editor.c:2256: error: structure has no member named `length'
e-contact-editor.c:2256: warning: passing arg 2 of `e_image_chooser_get_image_data' from incompatible pointer type
e-contact-editor.c:2260: error: structure has no member named `length'
e-contact-editor.c:2260: error: incompatible type for argument 2 of `gdk_pixbuf_loader_write'
e-contact-editor.c:2284: error: incompatible type for argument 1 of `g_free'
e-contact-editor.c:2285: error: structure has no member named `length'
e-contact-editor.c:2285: warning: passing arg 2 of `gdk_pixbuf_save_to_buffer' from incompatible pointer type
e-contact-editor.c:2298: error: incompatible type for argument 1 of `g_free'
make[6]: *** [e-contact-editor.lo] Error 1
make[6]: Leaving directory `/var/tmp/portage/evolution-2.6.2-r1/work/evolution-2.6.2/addressbook/gui/contact-editor'
make[5]: *** [all] Error 2
make[5]: Leaving directory `/var/tmp/portage/evolution-2.6.2-r1/work/evolution-2.6.2/addressbook/gui/contact-editor'
make[4]: *** [all-recursive] Error 1
make[4]: Leaving directory `/var/tmp/portage/evolution-2.6.2-r1/work/evolution-2.6.2/addressbook/gui'
make[3]: *** [all-recursive] Error 1
make[3]: Leaving directory `/var/tmp/portage/evolution-2.6.2-r1/work/evolution-2.6.2/addressbook'
make[2]: *** [all] Error 2
make[2]: Leaving directory `/var/tmp/portage/evolution-2.6.2-r1/work/evolution-2.6.2/addressbook'
make[1]: *** [all-recursive] Error 1
make[1]: Leaving directory `/var/tmp/portage/evolution-2.6.2-r1/work/evolution-2.6.2'
make: *** [all] Error 2