/tmp/openalchemist-0.2-src $ make
g++ -c -o bin/main.o src/main.cpp -Iincludes -Wall -g `pkg-config --cflags clanCore-0.8 clanDisplay-0.8 clanApp-0.8 clanGL-0.8 clanSDL-0.8`
includes/piece.h:84: error: extra qualification 'Piece::' on member 'draw'
includes/piece.h:89: error: extra qualification 'Piece::' on member 'draw_mini'
includes/KeyboardKey.h:41: error: extra qualification 'KeyboardKey::' on member 'KeyboardKey'
includes/game.h:222: error: extra qualification 'Game::' on member 'Game'
includes/game.h:224: error: extra qualification 'Game::' on member 'Game'
includes/game.h:227: error: extra qualification 'Game::' on member 'choose_skin'
includes/game.h:228: error: extra qualification 'Game::' on member 'load_gfx'
includes/game.h:229: error: extra qualification 'Game::' on member 'unload_gfx'
includes/game.h:230: error: extra qualification 'Game::' on member 'toggle_screen'
includes/game.h:231: error: extra qualification 'Game::' on member 'main_loop'
includes/game.h:234: error: extra qualification 'Game::' on member 'draw_game'
includes/game.h:235: error: extra qualification 'Game::' on member 'draw_playing'
includes/game.h:236: error: extra qualification 'Game::' on member 'draw_falling'
includes/game.h:237: error: extra qualification 'Game::' on member 'draw_destroying'
includes/game.h:238: error: extra qualification 'Game::' on member 'draw_to_playing'
includes/game.h:239: error: extra qualification 'Game::' on member 'draw_game_over'
includes/game.h:240: error: extra qualification 'Game::' on member 'draw_new_hightscore'
includes/game.h:241: error: extra qualification 'Game::' on member 'draw_pause'
includes/game.h:243: error: extra qualification 'Game::' on member 'draw_progress_bar'
includes/game.h:244: error: extra qualification 'Game::' on member 'draw_skins_selector'
includes/game.h:246: error: extra qualification 'Game::' on member 'calc_score'
includes/game.h:248: error: extra qualification 'Game::' on member 'load_preferences'
includes/game.h:249: error: extra qualification 'Game::' on member 'save_preferences'
includes/game.h:250: error: extra qualification 'Game::' on member 'read_scores'
includes/game.h:251: error: extra qualification 'Game::' on member 'save_scores'
includes/game.h:252: error: extra qualification 'Game::' on member 'key_events'
includes/game.h:253: error: extra qualification 'Game::' on member 'key_events_playing'
includes/game.h:254: error: extra qualification 'Game::' on member 'key_events_pause'
includes/game.h:255: error: extra qualification 'Game::' on member 'key_events_skins_selector'
includes/game.h:256: error: extra qualification 'Game::' on member 'undo_last'
includes/game.h:257: error: extra qualification 'Game::' on member 'new_game'
includes/game.h:258: error: extra qualification 'Game::' on member 'fall'
includes/game.h:259: error: extra qualification 'Game::' on member 'detect_to_destroy'
includes/game.h:260: error: extra qualification 'Game::' on member 'detect_to_fall'
includes/game.h:262: error: extra qualification 'Game::' on member 'stop'
make: *** [bin/main.o] Erreur 1