/usr/bin/make -C ../../security/coreconf MAKE="/usr/bin/make -j1" -j1 CC="gcc" MOZILLA_INCLUDES="-I/usr/src/mozilla/dist/include/nspr -I/usr/src/mozilla/dist/include/dbm" SOURCE_MD_DIR=/usr/src/mozilla/dist DIST=/usr/src/mozilla/dist MOZILLA_CLIENT=1 NO_MDUPDATE=1 BUILD_OPT=1 NS_USE_GCC=1 NS_USE_NATIVE=
make[3]: Entering directory `/usr/src/mozilla/security/coreconf'
syntax error at -e line 3, near "while"
syntax error at -e line 7, near "}"
Execution of -e aborted due to compilation errors.
cd nsinstall; /usr/bin/make -j1 export
make[4]: Entering directory `/usr/src/mozilla/security/coreconf/nsinstall'
syntax error at -e line 3, near "while"
syntax error at -e line 7, near "}"
Execution of -e aborted due to compilation errors.
make[4]: Nothing to be done for `export'.
make[4]: Leaving directory `/usr/src/mozilla/security/coreconf/nsinstall'
cd nsinstall; /usr/bin/make -j1 libs
make[4]: Entering directory `/usr/src/mozilla/security/coreconf/nsinstall'
syntax error at -e line 3, near "while"
syntax error at -e line 7, near "}"
Execution of -e aborted due to compilation errors.
gcc -o Linux2.6_x86_glibc_PTH_OPT.OBJ/nsinstall.o -c -O2 -fPIC -DLINUX1_2 -Di386 -D_XOPEN_SOURCE -DLINUX2_1 -ansi -Wall -pipe -DLINUX -Dlinux -D_POSIX_SOURCE -D_BSD_SOURCE -DHAVE_STRERROR -DXP_UNIX -UDEBUG -DNDEBUG -D_REENTRANT -I/usr/src/mozilla/dist/include -I../../../dist/public/coreconf -I../../../dist/private/coreconf -I../../../dist/include -I/usr/src/mozilla/dist/include/nspr -I/usr/src/mozilla/dist/include/dbm nsinstall.c
gcc -o Linux2.6_x86_glibc_PTH_OPT.OBJ/pathsub.o -c -O2 -fPIC -DLINUX1_2 -Di386 -D_XOPEN_SOURCE -DLINUX2_1 -ansi -Wall -pipe -DLINUX -Dlinux -D_POSIX_SOURCE -D_BSD_SOURCE -DHAVE_STRERROR -DXP_UNIX -UDEBUG -DNDEBUG -D_REENTRANT -I/usr/src/mozilla/dist/include -I../../../dist/public/coreconf -I../../../dist/private/coreconf -I../../../dist/include -I/usr/src/mozilla/dist/include/nspr -I/usr/src/mozilla/dist/include/dbm pathsub.c
gcc -o Linux2.6_x86_glibc_PTH_OPT.OBJ/nsinstall -O2 -fPIC -DLINUX1_2 -Di386 -D_XOPEN_SOURCE -DLINUX2_1 -ansi -Wall -pipe -DLINUX -Dlinux -D_POSIX_SOURCE -D_BSD_SOURCE -DHAVE_STRERROR -DXP_UNIX -UDEBUG -DNDEBUG -D_REENTRANT -I/usr/src/mozilla/dist/include -I../../../dist/public/coreconf -I../../../dist/private/coreconf -I../../../dist/include -I/usr/src/mozilla/dist/include/nspr -I/usr/src/mozilla/dist/include/dbm Linux2.6_x86_glibc_PTH_OPT.OBJ/nsinstall.o Linux2.6_x86_glibc_PTH_OPT.OBJ/pathsub.o -z combreloc -lpthread -ldl -lc
rm -f nfspwd; cp nfspwd.pl nfspwd; chmod +x nfspwd
true -m 775 Linux2.6_x86_glibc_PTH_OPT.OBJ/nsinstall /usr/src/mozilla/dist/bin
make[4]: Leaving directory `/usr/src/mozilla/security/coreconf/nsinstall'
make[3]: Leaving directory `/usr/src/mozilla/security/coreconf'
cd ../../dist/lib; cp -f libmozdbm_s.a libdbm.a; ranlib libdbm.a
/usr/bin/make -C ../../security/nss/lib MAKE="/usr/bin/make -j1" -j1 CC="gcc" MOZILLA_INCLUDES="-I/usr/src/mozilla/dist/include/nspr -I/usr/src/mozilla/dist/include/dbm" SOURCE_MD_DIR=/usr/src/mozilla/dist DIST=/usr/src/mozilla/dist MOZILLA_CLIENT=1 NO_MDUPDATE=1 BUILD_OPT=1 NS_USE_GCC=1 NS_USE_NATIVE=
make[3]: Entering directory `/usr/src/mozilla/security/nss/lib'
syntax error at -e line 3, near "while"
syntax error at -e line 7, near "}"
Execution of -e aborted due to compilation errors.
cd util; /usr/bin/make -j1 export
make[4]: Entering directory `/usr/src/mozilla/security/nss/lib/util'
syntax error at -e line 3, near "while"
syntax error at -e line 7, near "}"
Execution of -e aborted due to compilation errors.
Creating ../../../../dist/public/nss
../../../coreconf/nsinstall/Linux2.6_x86_glibc_PTH_OPT.OBJ/nsinstall -R -m 444 base64.h ciferfam.h nssb64.h nssb64t.h nsslocks.h nssilock.h nssilckt.h nssrwlk.h nssrwlkt.h portreg.h secasn1.h secasn1t.h seccomon.h secder.h secdert.h secdig.h secdigt.h secitem.h secoid.h secoidt.h secport.h secerr.h watcomfx.h ../../../../dist/public/nss
Creating ../../../../dist/private/nss
../../../coreconf/nsinstall/Linux2.6_x86_glibc_PTH_OPT.OBJ/nsinstall -R -m 444 pqgutil.h ../../../../dist/private/nss
make[4]: Leaving directory `/usr/src/mozilla/security/nss/lib/util'
cd freebl; /usr/bin/make -j1 export
make[4]: Entering directory `/usr/src/mozilla/security/nss/lib/freebl'
syntax error at -e line 3, near "while"
syntax error at -e line 7, near "}"
Execution of -e aborted due to compilation errors.
../../../coreconf/nsinstall/Linux2.6_x86_glibc_PTH_OPT.OBJ/nsinstall -R -m 444 blapit.h shsign.h ecl/ecl-exp.h ../../../../dist/public/nss
../../../coreconf/nsinstall/Linux2.6_x86_glibc_PTH_OPT.OBJ/nsinstall -R -m 444 blapi.h secmpi.h secrng.h ec.h ecl/ecl.h ecl/ecl-curve.h ../../../../dist/private/nss
make[4]: Leaving directory `/usr/src/mozilla/security/nss/lib/freebl'
cd softoken; /usr/bin/make -j1 export
make[4]: Entering directory `/usr/src/mozilla/security/nss/lib/softoken'
syntax error at -e line 3, near "while"
syntax error at -e line 7, near "}"
Execution of -e aborted due to compilation errors.
../../../coreconf/nsinstall/Linux2.6_x86_glibc_PTH_OPT.OBJ/nsinstall -R -m 444 pkcs11.h pkcs11f.h pkcs11p.h pkcs11t.h pkcs11n.h pkcs11u.h ../../../../dist/public/nss
../../../coreconf/nsinstall/Linux2.6_x86_glibc_PTH_OPT.OBJ/nsinstall -R -m 444 pk11pars.h ../../../../dist/private/nss
make[4]: Leaving directory `/usr/src/mozilla/security/nss/lib/softoken'
cd base; /usr/bin/make -j1 export
make[4]: Entering directory `/usr/src/mozilla/security/nss/lib/base'
syntax error at -e line 3, near "while"
syntax error at -e line 7, near "}"
Execution of -e aborted due to compilation errors.
../../../coreconf/nsinstall/Linux2.6_x86_glibc_PTH_OPT.OBJ/nsinstall -R -m 444 nssbaset.h nssbase.h ../../../../dist/public/nss
../../../coreconf/nsinstall/Linux2.6_x86_glibc_PTH_OPT.OBJ/nsinstall -R -m 444 baset.h base.h ../../../../dist/private/nss
make[4]: Leaving directory `/usr/src/mozilla/security/nss/lib/base'
cd asn1; /usr/bin/make -j1 export
make[4]: Entering directory `/usr/src/mozilla/security/nss/lib/asn1'
syntax error at -e line 3, near "while"
syntax error at -e line 7, near "}"
Execution of -e aborted due to compilation errors.
../../../coreconf/nsinstall/Linux2.6_x86_glibc_PTH_OPT.OBJ/nsinstall -R -m 444 asn1t.h asn1m.h asn1.h nssasn1t.h ../../../../dist/private/nss
make[4]: Leaving directory `/usr/src/mozilla/security/nss/lib/asn1'
cd dev; /usr/bin/make -j1 export
make[4]: Entering directory `/usr/src/mozilla/security/nss/lib/dev'
syntax error at -e line 3, near "while"
syntax error at -e line 7, near "}"
Execution of -e aborted due to compilation errors.
../../../coreconf/nsinstall/Linux2.6_x86_glibc_PTH_OPT.OBJ/nsinstall -R -m 444 ckhelper.h devt.h dev.h nssdevt.h nssdev.h devm.h devtm.h ../../../../dist/private/nss
make[4]: Leaving directory `/usr/src/mozilla/security/nss/lib/dev'
cd pki; /usr/bin/make -j1 export
make[4]: Entering directory `/usr/src/mozilla/security/nss/lib/pki'
syntax error at -e line 3, near "while"
syntax error at -e line 7, near "}"
Execution of -e aborted due to compilation errors.
../../../coreconf/nsinstall/Linux2.6_x86_glibc_PTH_OPT.OBJ/nsinstall -R -m 444 pki.h pkit.h nsspkit.h nsspki.h pkistore.h pki3hack.h pkitm.h pkim.h ../../../../dist/private/nss
make[4]: Leaving directory `/usr/src/mozilla/security/nss/lib/pki'
cd pki1; /usr/bin/make -j1 export
make[4]: Entering directory `/usr/src/mozilla/security/nss/lib/pki1'
syntax error at -e line 3, near "while"
syntax error at -e line 7, near "}"
Execution of -e aborted due to compilation errors.
../../../coreconf/nsinstall/Linux2.6_x86_glibc_PTH_OPT.OBJ/nsinstall -R -m 444 oiddata.h pki1.h pki1t.h nsspki1.h nsspki1t.h ../../../../dist/private/nss
make[4]: Leaving directory `/usr/src/mozilla/security/nss/lib/pki1'
cd certdb; /usr/bin/make -j1 export
make[4]: Entering directory `/usr/src/mozilla/security/nss/lib/certdb'
syntax error at -e line 3, near "while"
syntax error at -e line 7, near "}"
Execution of -e aborted due to compilation errors.
../../../coreconf/nsinstall/Linux2.6_x86_glibc_PTH_OPT.OBJ/nsinstall -R -m 444 cert.h certt.h certdb.h ../../../../dist/public/nss
../../../coreconf/nsinstall/Linux2.6_x86_glibc_PTH_OPT.OBJ/nsinstall -R -m 444 genname.h xconst.h certxutl.h certi.h ../../../../dist/private/nss
make[4]: Leaving directory `/usr/src/mozilla/security/nss/lib/certdb'
cd certhigh; /usr/bin/make -j1 export
make[4]: Entering directory `/usr/src/mozilla/security/nss/lib/certhigh'
syntax error at -e line 3, near "while"
syntax error at -e line 7, near "}"
Execution of -e aborted due to compilation errors.
../../../coreconf/nsinstall/Linux2.6_x86_glibc_PTH_OPT.OBJ/nsinstall -R -m 444 ocsp.h ocspt.h ../../../../dist/public/nss
../../../coreconf/nsinstall/Linux2.6_x86_glibc_PTH_OPT.OBJ/nsinstall -R -m 444 ocspti.h ../../../../dist/private/nss
make[4]: Leaving directory `/usr/src/mozilla/security/nss/lib/certhigh'
cd pk11wrap; /usr/bin/make -j1 export
make[4]: Entering directory `/usr/src/mozilla/security/nss/lib/pk11wrap'
syntax error at -e line 3, near "while"
syntax error at -e line 7, near "}"
Execution of -e aborted due to compilation errors.
../../../coreconf/nsinstall/Linux2.6_x86_glibc_PTH_OPT.OBJ/nsinstall -R -m 444 secmod.h secmodt.h secpkcs5.h pk11func.h pk11pub.h pk11priv.h pk11sdr.h pk11pqg.h ../../../../dist/public/nss
../../../coreconf/nsinstall/Linux2.6_x86_glibc_PTH_OPT.OBJ/nsinstall -R -m 444 secmodi.h pk11init.h dev3hack.h ../../../../dist/private/nss
make[4]: Leaving directory `/usr/src/mozilla/security/nss/lib/pk11wrap'
cd cryptohi; /usr/bin/make -j1 export
make[4]: Entering directory `/usr/src/mozilla/security/nss/lib/cryptohi'
syntax error at -e line 3, near "while"
syntax error at -e line 7, near "}"
Execution of -e aborted due to compilation errors.
../../../coreconf/nsinstall/Linux2.6_x86_glibc_PTH_OPT.OBJ/nsinstall -R -m 444 cryptohi.h cryptoht.h hasht.h key.h keyhi.h keyt.h keythi.h sechash.h ../../../../dist/public/nss
There are no private exports.
make[4]: Leaving directory `/usr/src/mozilla/security/nss/lib/cryptohi'
cd nss; /usr/bin/make -j1 export
syntax error at -e line 3, near "while"
syntax error at -e line 7, near "}"
Execution of -e aborted due to compilation errors.
syntax error at -e line 3, near "while"
syntax error at -e line 7, near "}"
Execution of -e aborted due to compilation errors.
syntax error at -e line 3, near "while"
syntax error at -e line 7, near "}"
Execution of -e aborted due to compilation errors.
syntax error at -e line 3, near "while"
syntax error at -e line 7, near "}"
Execution of -e aborted due to compilation errors.
syntax error at -e line 3, near "while"
syntax error at -e line 7, near "}"
Execution of -e aborted due to compilation errors.
syntax error at -e line 3, near "while"
syntax error at -e line 7, near "}"
Execution of -e aborted due to compilation errors.
syntax error at -e line 3, near "while"
syntax error at -e line 7, near "}"
Execution of -e aborted due to compilation errors.
syntax error at -e line 3, near "while"
syntax error at -e line 7, near "}"
Execution of -e aborted due to compilation errors.
make[4]: Entering directory `/usr/src/mozilla/security/nss/lib/nss'
syntax error at -e line 3, near "while"
syntax error at -e line 7, near "}"
Execution of -e aborted due to compilation errors.
../../../coreconf/nsinstall/Linux2.6_x86_glibc_PTH_OPT.OBJ/nsinstall -R -m 444 nss.h ../../../../dist/public/nss
../../../coreconf/nsinstall/Linux2.6_x86_glibc_PTH_OPT.OBJ/nsinstall -R -m 444 nssrenam.h ../../../../dist/private/nss
make[4]: Leaving directory `/usr/src/mozilla/security/nss/lib/nss'
cd ssl; /usr/bin/make -j1 export
make[4]: Entering directory `/usr/src/mozilla/security/nss/lib/ssl'
syntax error at -e line 3, near "while"
syntax error at -e line 7, near "}"
Execution of -e aborted due to compilation errors.
../../../coreconf/nsinstall/Linux2.6_x86_glibc_PTH_OPT.OBJ/nsinstall -R -m 444 ssl.h sslt.h sslerr.h sslproto.h preenc.h ../../../../dist/public/nss
../../../coreconf/nsinstall/Linux2.6_x86_glibc_PTH_OPT.OBJ/nsinstall -R -m 444 ssl3prot.h sslimpl.h ../../../../dist/private/nss
make[4]: Leaving directory `/usr/src/mozilla/security/nss/lib/ssl'
cd pkcs12; /usr/bin/make -j1 export
make[4]: Entering directory `/usr/src/mozilla/security/nss/lib/pkcs12'
syntax error at -e line 3, near "while"
syntax error at -e line 7, near "}"
Execution of -e aborted due to compilation errors.
../../../coreconf/nsinstall/Linux2.6_x86_glibc_PTH_OPT.OBJ/nsinstall -R -m 444 pkcs12t.h pkcs12.h p12plcy.h p12.h p12t.h ../../../../dist/public/nss
make[4]: Leaving directory `/usr/src/mozilla/security/nss/lib/pkcs12'
cd pkcs7; /usr/bin/make -j1 export
make[4]: Entering directory `/usr/src/mozilla/security/nss/lib/pkcs7'
syntax error at -e line 3, near "while"
syntax error at -e line 7, near "}"
Execution of -e aborted due to compilation errors.
../../../coreconf/nsinstall/Linux2.6_x86_glibc_PTH_OPT.OBJ/nsinstall -R -m 444 secmime.h secpkcs7.h pkcs7t.h ../../../../dist/public/nss
make[4]: Leaving directory `/usr/src/mozilla/security/nss/lib/pkcs7'
cd smime; /usr/bin/make -j1 export
syntax error at -e line 3, near "while"
syntax error at -e line 7, near "}"
Execution of -e aborted due to compilation errors.
syntax error at -e line 3, near "while"
syntax error at -e line 7, near "}"
Execution of -e aborted due to compilation errors.
make[4]: Entering directory `/usr/src/mozilla/security/nss/lib/smime'
syntax error at -e line 3, near "while"
syntax error at -e line 7, near "}"
Execution of -e aborted due to compilation errors.
../../../coreconf/nsinstall/Linux2.6_x86_glibc_PTH_OPT.OBJ/nsinstall -R -m 444 cms.h cmst.h smime.h cmsreclist.h ../../../../dist/public/nss
make[4]: Leaving directory `/usr/src/mozilla/security/nss/lib/smime'
cd crmf; /usr/bin/make -j1 export
make[4]: Entering directory `/usr/src/mozilla/security/nss/lib/crmf'
syntax error at -e line 3, near "while"
syntax error at -e line 7, near "}"
Execution of -e aborted due to compilation errors.
../../../coreconf/nsinstall/Linux2.6_x86_glibc_PTH_OPT.OBJ/nsinstall -R -m 444 crmf.h crmft.h cmmf.h cmmft.h ../../../../dist/public/nss
../../../coreconf/nsinstall/Linux2.6_x86_glibc_PTH_OPT.OBJ/nsinstall -R -m 444 crmfi.h crmfit.h cmmfi.h cmmfit.h ../../../../dist/private/nss
make[4]: Leaving directory `/usr/src/mozilla/security/nss/lib/crmf'
cd jar; /usr/bin/make -j1 export
make[4]: Entering directory `/usr/src/mozilla/security/nss/lib/jar'
syntax error at -e line 3, near "while"
syntax error at -e line 7, near "}"
Execution of -e aborted due to compilation errors.
../../../coreconf/nsinstall/Linux2.6_x86_glibc_PTH_OPT.OBJ/nsinstall -R -m 444 jar.h jar-ds.h jarfile.h ../../../../dist/public/nss
make[4]: Leaving directory `/usr/src/mozilla/security/nss/lib/jar'
cd ckfw; /usr/bin/make -j1 export
make[4]: Entering directory `/usr/src/mozilla/security/nss/lib/ckfw'
syntax error at -e line 3, near "while"
syntax error at -e line 7, near "}"
Execution of -e aborted due to compilation errors.
cd builtins; /usr/bin/make -j1 export
make[5]: Entering directory `/usr/src/mozilla/security/nss/lib/ckfw/builtins'
syntax error at -e line 3, near "while"
syntax error at -e line 7, near "}"
Execution of -e aborted due to compilation errors.
../../../../coreconf/nsinstall/Linux2.6_x86_glibc_PTH_OPT.OBJ/nsinstall -R -m 444 nssckbi.h ../../../../../dist/public/nss
make[5]: Leaving directory `/usr/src/mozilla/security/nss/lib/ckfw/builtins'
../../../coreconf/nsinstall/Linux2.6_x86_glibc_PTH_OPT.OBJ/nsinstall -R -m 444 nssck.api nssckepv.h nssckft.h nssckfw.h nssckfwc.h nssckfwt.h nssckg.h nssckmdt.h nssckt.h ../../../../dist/public/nss
cd builtins; /usr/bin/make -j1 private_export
make[5]: Entering directory `/usr/src/mozilla/security/nss/lib/ckfw/builtins'
syntax error at -e line 3, near "while"
syntax error at -e line 7, near "}"
Execution of -e aborted due to compilation errors.
There are no private exports.
make[5]: Leaving directory `/usr/src/mozilla/security/nss/lib/ckfw/builtins'
../../../coreconf/nsinstall/Linux2.6_x86_glibc_PTH_OPT.OBJ/nsinstall -R -m 444 ck.h ckfw.h ckfwm.h ckfwtm.h ckmd.h ckt.h ../../../../dist/private/nss
make[4]: Leaving directory `/usr/src/mozilla/security/nss/lib/ckfw'
cd fortcrypt; /usr/bin/make -j1 export
make[4]: Entering directory `/usr/src/mozilla/security/nss/lib/fortcrypt'
syntax error at -e line 3, near "while"
syntax error at -e line 7, near "}"
Execution of -e aborted due to compilation errors.
cd swfort; /usr/bin/make -j1 export
make[5]: Entering directory `/usr/src/mozilla/security/nss/lib/fortcrypt/swfort'
syntax error at -e line 3, near "while"
syntax error at -e line 7, near "}"
Execution of -e aborted due to compilation errors.
cd pkcs11; /usr/bin/make -j1 export
make[6]: Entering directory `/usr/src/mozilla/security/nss/lib/fortcrypt/swfort/pkcs11'
syntax error at -e line 3, near "while"
syntax error at -e line 7, near "}"
Execution of -e aborted due to compilation errors.
make[6]: Nothing to be done for `export'.
make[6]: Leaving directory `/usr/src/mozilla/security/nss/lib/fortcrypt/swfort/pkcs11'
../../../../coreconf/nsinstall/Linux2.6_x86_glibc_PTH_OPT.OBJ/nsinstall -R -m 444 swfort.h swfortt.h ../../../../../dist/public/nss
rm -f Linux2.6_x86_glibc_PTH_OPT.OBJ/nslib.c
cat nsmap.h swflib.c > Linux2.6_x86_glibc_PTH_OPT.OBJ/nslib.c
cd pkcs11; /usr/bin/make -j1 private_export
make[6]: Entering directory `/usr/src/mozilla/security/nss/lib/fortcrypt/swfort/pkcs11'
syntax error at -e line 3, near "while"
syntax error at -e line 7, near "}"
Execution of -e aborted due to compilation errors.
There are no private exports.
make[6]: Leaving directory `/usr/src/mozilla/security/nss/lib/fortcrypt/swfort/pkcs11'
../../../../coreconf/nsinstall/Linux2.6_x86_glibc_PTH_OPT.OBJ/nsinstall -R -m 444 swforti.h swfortti.h ../../../../../dist/private/nss
make[5]: Leaving directory `/usr/src/mozilla/security/nss/lib/fortcrypt/swfort'
cd swfort; /usr/bin/make -j1 private_export
make[5]: Entering directory `/usr/src/mozilla/security/nss/lib/fortcrypt/swfort'
syntax error at -e line 3, near "while"
syntax error at -e line 7, near "}"
Execution of -e aborted due to compilation errors.
cd pkcs11; /usr/bin/make -j1 private_export
make[6]: Entering directory `/usr/src/mozilla/security/nss/lib/fortcrypt/swfort/pkcs11'
syntax error at -e line 3, near "while"
syntax error at -e line 7, near "}"
Execution of -e aborted due to compilation errors.
There are no private exports.
make[6]: Leaving directory `/usr/src/mozilla/security/nss/lib/fortcrypt/swfort/pkcs11'
../../../../coreconf/nsinstall/Linux2.6_x86_glibc_PTH_OPT.OBJ/nsinstall -R -m 444 swforti.h swfortti.h ../../../../../dist/private/nss
make[5]: Leaving directory `/usr/src/mozilla/security/nss/lib/fortcrypt/swfort'
../../../coreconf/nsinstall/Linux2.6_x86_glibc_PTH_OPT.OBJ/nsinstall -R -m 444 maci.h cryptint.h ../../../../dist/private/nss
make[4]: Leaving directory `/usr/src/mozilla/security/nss/lib/fortcrypt'
cd util; /usr/bin/make -j1 libs
make[4]: Entering directory `/usr/src/mozilla/security/nss/lib/util'
syntax error at -e line 3, near "while"
syntax error at -e line 7, near "}"
Execution of -e aborted due to compilation errors.
gcc -o Linux2.6_x86_glibc_PTH_OPT.OBJ/quickder.o -c -O2 -fPIC -DLINUX1_2 -Di386 -D_XOPEN_SOURCE -DLINUX2_1 -ansi -Wall -pipe -DLINUX -Dlinux -D_POSIX_SOURCE -D_BSD_SOURCE -DHAVE_STRERROR -DXP_UNIX -UDEBUG -DNDEBUG -D_REENTRANT -I/usr/src/mozilla/dist/include -I../../../../dist/public/nss -I../../../../dist/private/nss -I../../../../dist/include -I/usr/src/mozilla/dist/include/nspr -I/usr/src/mozilla/dist/include/dbm -I../../../../dist/public/dbm quickder.c
In file included from quickder.c:43:
secasn1.h:48:21: error: plarena.h: No such file or directory
In file included from secasn1.h:50,
from quickder.c:43:
seccomon.h:50:21: error: prtypes.h: No such file or directory
In file included from seccomon.h:61,
from secasn1.h:50,
from quickder.c:43:
secport.h:106:39: error: prlog.h: No such file or directory
secport.h:108:19: error: plstr.h: No such file or directory
In file included from quickder.c:44:
secitem.h:47:20: error: plhash.h: No such file or directory
make[4]: *** [Linux2.6_x86_glibc_PTH_OPT.OBJ/quickder.o] Error 1
make[4]: Leaving directory `/usr/src/mozilla/security/nss/lib/util'
make[3]: *** [libs] Error 2
make[3]: Leaving directory `/usr/src/mozilla/security/nss/lib'
make[2]: *** [libs] Error 2
make[2]: Leaving directory `/usr/src/mozilla/security/manager'
make[1]: *** [tier_50] Error 2
make[1]: Leaving directory `/usr/src/mozilla'
make: *** [default] Error 2
! Problem Detected !
Creating compile log /var/log/sorcery/compile/xulrunner-1.8.0.4.bz2
Creating installwatch debug log /var/log/sorcery/compile/xulrunner-1.8.0.4.iwdbglog.bz2
Spells that encountered problems:
---------------------------------
xulrunner