CPAN.pm: Going to build D/DO/DOUGM/Xmms-Perl-0.12.tar.gz
Checking if your kit is complete...
Looks good
Note (probably harmless): No library found for -lgtk
Note (probably harmless): No library found for -lgdk
Writing Makefile for Xmms::Config
Note (probably harmless): No library found for -lgtk
Note (probably harmless): No library found for -lgdk
Writing Makefile for Xmms::Remote
Note (probably harmless): No library found for -lgtk
Note (probably harmless): No library found for -lgdk
Writing Makefile for Xmms::SongChange
Writing Makefile for Xmms-Perl
cp lib/Xmms/ExtUtils.pm blib/lib/Xmms/ExtUtils.pm
cp lib/Bundle/Xmms.pm blib/lib/Bundle/Xmms.pm
cp lib/Xmms.pm blib/lib/Xmms.pm
make[1]: Entering directory `/home/kyle/.cpan/build/Xmms-Perl-0.12/Config'
cp Config.pm ../blib/lib/Xmms/Config.pm
/usr/bin/perl /usr/share/perl/5.8.7/ExtUtils/xsubpp -typemap /usr/share/perl/5.8/ExtUtils/typemap Config.xs > Config.xsc && mv Config.xsc Config.c
cc -c -I/usr/include/glib-1.2 -I/usr/lib/glib/include -D_REENTRANT -D_GNU_SOURCE -DTHREADS_HAVE_PIDS -DDEBIAN -fno-strict-aliasing -pipe -I/usr/local/include -D_LARGEFILE_SOURCE -D_FILE_OFFSET_BITS=64 -O2 -DVERSION=\"0.01\" -DXS_VERSION=\"0.01\" -fPIC "-I/usr/lib/perl/5.8/CORE" Config.c
Config.xs:5:29: error: xmms/configfile.h: No such file or directory
Config.xs:7: error: syntax error before * token
Config.xs:7: warning: data definition has no type or storage class
Config.c: In function XS_Xmms__Config_new:
Config.c:70: error: gchar undeclared (first use in this function)
Config.c:70: error: (Each undeclared identifier is reported only once
Config.c:70: error: for each function it appears in.)
Config.c:70: error: filename undeclared (first use in this function)
Config.c:71: error: syntax error before RETVAL
Config.c:76: error: syntax error before ) token
Config.xs:44: error: RETVAL undeclared (first use in this function)
Config.c: In function XS_Xmms__Config_DESTROY:
Config.c:101: error: syntax error before cfg
Config.c:105: error: cfg undeclared (first use in this function)
Config.c:105: error: called object Xmms__Config is not a function
Config.c: In function XS_Xmms__Config_write_file:
Config.c:122: error: syntax error before cfg
Config.c:123: error: gchar undeclared (first use in this function)
Config.c:123: error: filename undeclared (first use in this function)
Config.c:123: error: syntax error before ) token
Config.c:124: error: gboolean undeclared (first use in this function)
Config.c:124: error: syntax error before RETVAL
Config.c:129: error: cfg undeclared (first use in this function)
Config.c:129: error: called object Xmms__Config is not a function
Config.c:134: error: RETVAL undeclared (first use in this function)
Config.c: In function XS_Xmms__Config_remove_key:
Config.c:147: error: syntax error before cfg
Config.c:148: error: gchar undeclared (first use in this function)
Config.c:148: error: section undeclared (first use in this function)
Config.c:148: error: syntax error before ) token
Config.c:149: error: key undeclared (first use in this function)
Config.c:149: error: syntax error before ) token
Config.c:153: error: cfg undeclared (first use in this function)
Config.c:153: error: called object Xmms__Config is not a function
Config.c: In function XS_Xmms__Config_read:
Config.c:170: error: syntax error before cfg
Config.c:171: error: gchar undeclared (first use in this function)
Config.c:171: error: section undeclared (first use in this function)
Config.c:171: error: syntax error before ) token
Config.c:172: error: key undeclared (first use in this function)
Config.c:172: error: syntax error before ) token
Config.xs:77: error: value undeclared (first use in this function)
Config.c:181: error: cfg undeclared (first use in this function)
Config.c:181: error: called object Xmms__Config is not a function
Config.c: In function XS_Xmms__Config_write:
Config.c:207: error: syntax error before cfg
Config.c:208: error: gchar undeclared (first use in this function)
Config.c:208: error: section undeclared (first use in this function)
Config.c:208: error: syntax error before ) token
Config.c:209: error: key undeclared (first use in this function)
Config.c:209: error: syntax error before ) token
Config.c:210: error: value undeclared (first use in this function)
Config.c:210: error: syntax error before ) token
Config.c:214: error: cfg undeclared (first use in this function)
Config.c:214: error: called object Xmms__Config is not a function
make[1]: *** [Config.o] Error 1
make[1]: Leaving directory `/home/kyle/.cpan/build/Xmms-Perl-0.12/Config'
make: *** [subdirs] Error 2
/usr/bin/make -- NOT OK
Running make test
Can't test without successful make
Running make install
make had returned bad status, install seems impossible
Bundle summary: The following items in bundle Bundle::Xmms had installation
problems:
Xmms