All pastes #15345 Raw Edit

Unnamed

public text v1 · immutable
#15345 ·published 2005-06-21 16:14 UTC
rendered paste body
/usr/src/rocketraid/entry.c:984: error: dereferencing pointer to incomplete type
/usr/src/rocketraid/entry.c:994: error: `DID_OK' undeclared (first use in this function)
/usr/src/rocketraid/entry.c:998: error: `DID_BAD_TARGET' undeclared (first use in this function)
/usr/src/rocketraid/entry.c:1002: error: `DID_BUS_BUSY' undeclared (first use in this function)
/usr/src/rocketraid/entry.c:1006: error: `DID_NO_CONNECT' undeclared (first use in this function)
/usr/src/rocketraid/entry.c:1010: error: `DID_RESET' undeclared (first use in this function)
/usr/src/rocketraid/entry.c:1014: error: `DRIVER_INVALID' undeclared (first use in this function)
/usr/src/rocketraid/entry.c:1014: error: `SUGGEST_ABORT' undeclared (first use in this function)
/usr/src/rocketraid/entry.c:1014: error: `DID_ABORT' undeclared (first use in this function)
/usr/src/rocketraid/entry.c: In function `SetInquiryData':
/usr/src/rocketraid/entry.c:1043: error: `TYPE_DISK' undeclared (first use in this function)
/usr/src/rocketraid/entry.c: In function `hpt_worker_thread':
/usr/src/rocketraid/entry.c:1167: error: dereferencing pointer to incomplete type
/usr/src/rocketraid/entry.c:1167: error: `TRUE' undeclared (first use in this function)
/usr/src/rocketraid/entry.c:1183: error: dereferencing pointer to incomplete type
/usr/src/rocketraid/entry.c: At top level:
/usr/src/rocketraid/entry.c:1257: error: parse error before "driver_template"
/usr/src/rocketraid/entry.c:1257: warning: type defaults to `int' in declaration of `driver_template'
/usr/src/rocketraid/entry.c:1258: error: field name not in record or union initializer
/usr/src/rocketraid/entry.c:1258: error: (near initialization for `driver_template')
/usr/src/rocketraid/entry.c:1258: warning: initialization makes integer from pointer without a cast
/usr/src/rocketraid/entry.c:1259: error: field name not in record or union initializer
/usr/src/rocketraid/entry.c:1259: error: (near initialization for `driver_template')
/usr/src/rocketraid/entry.c:1259: warning: excess elements in scalar initializer
/usr/src/rocketraid/entry.c:1259: warning: (near initialization for `driver_template')
/usr/src/rocketraid/entry.c:1260: error: field name not in record or union initializer
/usr/src/rocketraid/entry.c:1260: error: (near initialization for `driver_template')
/usr/src/rocketraid/entry.c:1260: warning: excess elements in scalar initializer
/usr/src/rocketraid/entry.c:1260: warning: (near initialization for `driver_template')
/usr/src/rocketraid/entry.c:1261: error: field name not in record or union initializer
/usr/src/rocketraid/entry.c:1261: error: (near initialization for `driver_template')
/usr/src/rocketraid/entry.c:1261: error: `hpt3xx_QueueCommand' undeclared here (not in a function)
/usr/src/rocketraid/entry.c:1261: warning: excess elements in scalar initializer
/usr/src/rocketraid/entry.c:1261: warning: (near initialization for `driver_template')
/usr/src/rocketraid/entry.c:1262: error: field name not in record or union initializer
/usr/src/rocketraid/entry.c:1262: error: (near initialization for `driver_template')
/usr/src/rocketraid/entry.c:1262: warning: excess elements in scalar initializer
/usr/src/rocketraid/entry.c:1262: warning: (near initialization for `driver_template')
/usr/src/rocketraid/entry.c:1263: error: field name not in record or union initializer
/usr/src/rocketraid/entry.c:1263: error: (near initialization for `driver_template')
/usr/src/rocketraid/entry.c:1263: warning: excess elements in scalar initializer
/usr/src/rocketraid/entry.c:1263: warning: (near initialization for `driver_template')
/usr/src/rocketraid/entry.c:1264: error: field name not in record or union initializer
/usr/src/rocketraid/entry.c:1264: error: (near initialization for `driver_template')
/usr/src/rocketraid/entry.c:1264: warning: excess elements in scalar initializer
/usr/src/rocketraid/entry.c:1264: warning: (near initialization for `driver_template')
/usr/src/rocketraid/entry.c:1265: error: field name not in record or union initializer
/usr/src/rocketraid/entry.c:1265: error: (near initialization for `driver_template')
/usr/src/rocketraid/entry.c:1265: warning: excess elements in scalar initializer
/usr/src/rocketraid/entry.c:1265: warning: (near initialization for `driver_template')
/usr/src/rocketraid/entry.c:1266: error: field name not in record or union initializer
/usr/src/rocketraid/entry.c:1266: error: (near initialization for `driver_template')
/usr/src/rocketraid/entry.c:1266: warning: excess elements in scalar initializer
/usr/src/rocketraid/entry.c:1266: warning: (near initialization for `driver_template')
/usr/src/rocketraid/entry.c:1268: error: field name not in record or union initializer
/usr/src/rocketraid/entry.c:1268: error: (near initialization for `driver_template')
/usr/src/rocketraid/entry.c:1268: warning: excess elements in scalar initializer
/usr/src/rocketraid/entry.c:1268: warning: (near initialization for `driver_template')
/usr/src/rocketraid/entry.c:1269: error: field name not in record or union initializer
/usr/src/rocketraid/entry.c:1269: error: (near initialization for `driver_template')
/usr/src/rocketraid/entry.c:1269: warning: excess elements in scalar initializer
/usr/src/rocketraid/entry.c:1269: warning: (near initialization for `driver_template')
/usr/src/rocketraid/entry.c:1270: error: field name not in record or union initializer
/usr/src/rocketraid/entry.c:1270: error: (near initialization for `driver_template')
/usr/src/rocketraid/entry.c:1270: warning: excess elements in scalar initializer
/usr/src/rocketraid/entry.c:1270: warning: (near initialization for `driver_template')
/usr/src/rocketraid/entry.c:1287: error: field name not in record or union initializer
/usr/src/rocketraid/entry.c:1287: error: (near initialization for `driver_template')
/usr/src/rocketraid/entry.c:1287: warning: excess elements in scalar initializer
/usr/src/rocketraid/entry.c:1287: warning: (near initialization for `driver_template')
/usr/src/rocketraid/entry.c:1288: error: field name not in record or union initializer
/usr/src/rocketraid/entry.c:1288: error: (near initialization for `driver_template')
/usr/src/rocketraid/entry.c:1288: warning: excess elements in scalar initializer
/usr/src/rocketraid/entry.c:1288: warning: (near initialization for `driver_template')
/usr/src/rocketraid/entry.c:1289: error: field name not in record or union initializer
/usr/src/rocketraid/entry.c:1289: error: (near initialization for `driver_template')
/usr/src/rocketraid/entry.c:1289: warning: excess elements in scalar initializer
/usr/src/rocketraid/entry.c:1289: warning: (near initialization for `driver_template')
/usr/src/rocketraid/entry.c:1290: error: field name not in record or union initializer
/usr/src/rocketraid/entry.c:1290: error: (near initialization for `driver_template')
/usr/src/rocketraid/entry.c:1290: warning: excess elements in scalar initializer
/usr/src/rocketraid/entry.c:1290: warning: (near initialization for `driver_template')
/usr/src/rocketraid/entry.c:1292: error: field name not in record or union initializer
/usr/src/rocketraid/entry.c:1292: error: (near initialization for `driver_template')
/usr/src/rocketraid/entry.c:1293: warning: excess elements in scalar initializer
/usr/src/rocketraid/entry.c:1293: warning: (near initialization for `driver_template')
/usr/src/rocketraid/entry.c:1293: warning: data definition has no type or storage class
In file included from /usr/src/rocketraid/hpt.c:126:
/usr/src/rocketraid/entry.c:1353:25: scsi_module.c: No such file or directory
In file included from /usr/src/rocketraid/hpt.c:127:
/usr/src/rocketraid/hptproc.c: In function `hpt_set_info':
/usr/src/rocketraid/hptproc.c:230: warning: `verify_area' is deprecated (declared at include/asm/uaccess.h:105)
/usr/src/rocketraid/hptproc.c:236: warning: `verify_area' is deprecated (declared at include/asm/uaccess.h:105)
/usr/src/rocketraid/hptproc.c:242: warning: `verify_area' is deprecated (declared at include/asm/uaccess.h:105)
/usr/src/rocketraid/hptproc.c: In function `get_sd_name':
/usr/src/rocketraid/hptproc.c:474: error: dereferencing pointer to incomplete type
In file included from /usr/src/rocketraid/hpt.c:128:
/usr/src/rocketraid/ioctl.c: In function `hpt_rescan_all':
/usr/src/rocketraid/ioctl.c:508: error: dereferencing pointer to incomplete type
/usr/src/rocketraid/ioctl.c:514: error: dereferencing pointer to incomplete type
/usr/src/rocketraid/ioctl.c: In function `hpt_rebuild_data_block':
/usr/src/rocketraid/ioctl.c:814: error: dereferencing pointer to incomplete type
/usr/src/rocketraid/ioctl.c:825: error: `TRUE' undeclared (first use in this function)
In file included from /usr/src/rocketraid/hpt.c:130:
/usr/src/rocketraid/channel.c: In function `fChannelSendCommand':
/usr/src/rocketraid/channel.c:170: error: `TRUE' undeclared (first use in this function)
/usr/src/rocketraid/channel.c: In function `fPioInterrupt':
/usr/src/rocketraid/channel.c:493: error: `TRUE' undeclared (first use in this function)
/usr/src/rocketraid/channel.c:495: error: `FALSE' undeclared (first use in this function)
/usr/src/rocketraid/channel.c: In function `fChannelInterrupt':
/usr/src/rocketraid/channel.c:520: error: `TRUE' undeclared (first use in this function)
/usr/src/rocketraid/channel.c:525: error: `FALSE' undeclared (first use in this function)
/usr/src/rocketraid/channel.c: In function `fChipInterrupt':
/usr/src/rocketraid/channel.c:671: error: `TRUE' undeclared (first use in this function)
In file included from /usr/src/rocketraid/hpt.c:131:
/usr/src/rocketraid/device.c: In function `IdeHardReset':
/usr/src/rocketraid/device.c:76: error: `TRUE' undeclared (first use in this function)
/usr/src/rocketraid/device.c: In function `fDeReadWrite':
/usr/src/rocketraid/device.c:294: error: `FALSE' undeclared (first use in this function)
/usr/src/rocketraid/device.c:314: error: `TRUE' undeclared (first use in this function)
/usr/src/rocketraid/device.c: In function `fRescanAllDevice':
/usr/src/rocketraid/device.c:371: error: `FALSE' undeclared (first use in this function)
In file included from /usr/src/rocketraid/hpt.c:132:
/usr/src/rocketraid/hpt3xx.c: In function `fHpt3xxFinishIntr':
/usr/src/rocketraid/hpt3xx.c:112: error: `FALSE' undeclared (first use in this function)
/usr/src/rocketraid/hpt3xx.c:118: error: `TRUE' undeclared (first use in this function)
In file included from /usr/src/rocketraid/hpt.c:133:
/usr/src/rocketraid/idevice.c: In function `fDeIssueIdentify':
/usr/src/rocketraid/idevice.c:46: error: `TRUE' undeclared (first use in this function)
/usr/src/rocketraid/idevice.c:51: error: `FALSE' undeclared (first use in this function)
/usr/src/rocketraid/idevice.c: In function `fDeScanDevice':
/usr/src/rocketraid/idevice.c:128: error: `FALSE' undeclared (first use in this function)
include/linux/module.h: At top level:
/usr/src/rocketraid/hpt.c:73: error: storage size of `major' isn't known
make[2]: *** [/usr/src/rocketraid/hpt.o] Error 1
make[1]: *** [_module_/usr/src/rocketraid] Error 2
make: *** [default] Error 2