All pastes #1529929 Raw Edit

clueless

public text v1 · immutable
#1529929 ·published 2009-08-14 21:42 UTC
rendered paste body
/usr/bin/cmake -H/home/lvillani/usr/share/devel/D/genesis -B/home/lvillani/usr/share/devel/D/genesis/build --check-build-system CMakeFiles/Makefile.cmake 0/usr/bin/cmake -E cmake_progress_start /home/lvillani/usr/share/devel/D/genesis/build/CMakeFiles /home/lvillani/usr/share/devel/D/genesis/build/CMakeFiles/progress.makemake -f CMakeFiles/Makefile2 allmake[1]: Entering directory `/home/lvillani/usr/share/devel/D/genesis/build'make -f 3rdparty/lua-5.1.4/CMakeFiles/lua.dir/build.make 3rdparty/lua-5.1.4/CMakeFiles/lua.dir/dependmake[2]: Entering directory `/home/lvillani/usr/share/devel/D/genesis/build'cd /home/lvillani/usr/share/devel/D/genesis/build && /usr/bin/cmake -E cmake_depends "Unix Makefiles" /home/lvillani/usr/share/devel/D/genesis /home/lvillani/usr/share/devel/D/genesis/3rdparty/lua-5.1.4 /home/lvillani/usr/share/devel/D/genesis/build /home/lvillani/usr/share/devel/D/genesis/build/3rdparty/lua-5.1.4 /home/lvillani/usr/share/devel/D/genesis/build/3rdparty/lua-5.1.4/CMakeFiles/lua.dir/DependInfo.cmake --color=make[2]: Leaving directory `/home/lvillani/usr/share/devel/D/genesis/build'make -f 3rdparty/lua-5.1.4/CMakeFiles/lua.dir/build.make 3rdparty/lua-5.1.4/CMakeFiles/lua.dir/buildmake[2]: Entering directory `/home/lvillani/usr/share/devel/D/genesis/build'make[2]: Nothing to be done for `3rdparty/lua-5.1.4/CMakeFiles/lua.dir/build'.make[2]: Leaving directory `/home/lvillani/usr/share/devel/D/genesis/build'/usr/bin/cmake -E cmake_progress_report /home/lvillani/usr/share/devel/D/genesis/build/CMakeFiles  1 2 3 4 5 6 7 8 9 10 11 12 13 14 15 16 17 18 19 20 21 22 23 24 25 26 27 28 29 30[ 34%] Built target luamake -f 3rdparty/luad/CMakeFiles/luad.dir/build.make 3rdparty/luad/CMakeFiles/luad.dir/dependmake[2]: Entering directory `/home/lvillani/usr/share/devel/D/genesis/build'cd /home/lvillani/usr/share/devel/D/genesis/build && /usr/bin/cmake -E cmake_depends "Unix Makefiles" /home/lvillani/usr/share/devel/D/genesis /home/lvillani/usr/share/devel/D/genesis/3rdparty/luad /home/lvillani/usr/share/devel/D/genesis/build /home/lvillani/usr/share/devel/D/genesis/build/3rdparty/luad /home/lvillani/usr/share/devel/D/genesis/build/3rdparty/luad/CMakeFiles/luad.dir/DependInfo.cmake --color=make[2]: Leaving directory `/home/lvillani/usr/share/devel/D/genesis/build'make -f 3rdparty/luad/CMakeFiles/luad.dir/build.make 3rdparty/luad/CMakeFiles/luad.dir/buildmake[2]: Entering directory `/home/lvillani/usr/share/devel/D/genesis/build'make[2]: Nothing to be done for `3rdparty/luad/CMakeFiles/luad.dir/build'.make[2]: Leaving directory `/home/lvillani/usr/share/devel/D/genesis/build'/usr/bin/cmake -E cmake_progress_report /home/lvillani/usr/share/devel/D/genesis/build/CMakeFiles  31 32 33 34 35 36[ 41%] Built target luadmake -f 3rdparty/minid/CMakeFiles/minid.dir/build.make 3rdparty/minid/CMakeFiles/minid.dir/dependmake[2]: Entering directory `/home/lvillani/usr/share/devel/D/genesis/build'cd /home/lvillani/usr/share/devel/D/genesis/build && /usr/bin/cmake -E cmake_depends "Unix Makefiles" /home/lvillani/usr/share/devel/D/genesis /home/lvillani/usr/share/devel/D/genesis/3rdparty/minid /home/lvillani/usr/share/devel/D/genesis/build /home/lvillani/usr/share/devel/D/genesis/build/3rdparty/minid /home/lvillani/usr/share/devel/D/genesis/build/3rdparty/minid/CMakeFiles/minid.dir/DependInfo.cmake --color=make[2]: Leaving directory `/home/lvillani/usr/share/devel/D/genesis/build'make -f 3rdparty/minid/CMakeFiles/minid.dir/build.make 3rdparty/minid/CMakeFiles/minid.dir/buildmake[2]: Entering directory `/home/lvillani/usr/share/devel/D/genesis/build'/usr/bin/cmake -E cmake_progress_report /home/lvillani/usr/share/devel/D/genesis/build/CMakeFiles 73[ 43%] Building D object 3rdparty/minid/CMakeFiles/minid.dir/minid/interpreter.d.ocd /home/lvillani/usr/share/devel/D/genesis/build/3rdparty/minid && /home/lvillani/usr/share/devel/D/ldc/build/src/ldc    -I/home/lvillani/usr/share/devel/D/genesis/3rdparty/minid   -of=CMakeFiles/minid.dir/minid/interpreter.d.o -c /home/lvillani/usr/share/devel/D/genesis/3rdparty/minid/minid/interpreter.dNote: Variant vararg functionality not supported for this compiler/platform combination.To override and enable vararg support anyway, compile with the EnableVararg version./home/lvillani/usr/share/devel/D/genesis/3rdparty/minid/minid/interpreter.d(5417): Error: function tango.text.convert.Layout.Layout!(char).Layout.convert (char[],...) does not match parameter types (ulong delegate(char[] s),char[2LU],double)/home/lvillani/usr/share/devel/D/genesis/3rdparty/minid/minid/interpreter.d(5417): Error: cannot implicitly convert expression (__dgliteral1) of type ulong delegate(char[] s) to uint delegate(char[])/home/lvillani/usr/share/devel/D/genesis/3rdparty/minid/minid/interpreter.d(5425): Error: cannot implicitly convert expression ("{}") of type char[2LU] to TypeInfo[]/home/lvillani/usr/share/devel/D/genesis/3rdparty/minid/minid/interpreter.d(5425): Error: cannot implicitly convert expression (v.mFloat) of type double to void*/home/lvillani/usr/share/devel/D/genesis/3rdparty/minid/minid/interpreter.d(5417): Error: expected 4 arguments, not 3make[2]: *** [3rdparty/minid/CMakeFiles/minid.dir/minid/interpreter.d.o] Error 1make[2]: Leaving directory `/home/lvillani/usr/share/devel/D/genesis/build'make[1]: *** [3rdparty/minid/CMakeFiles/minid.dir/all] Error 2make[1]: Leaving directory `/home/lvillani/usr/share/devel/D/genesis/build'make: *** [all] Error 2