All pastes #152626 Raw Edit

Mine

public text v1 · immutable
#152626 ·published 2006-08-28 23:59 UTC
rendered paste body
       bzr: /usr/bin/bzr
    bzrlib: /usr/lib/python2.4/site-packages/bzrlib

running tests...
bzrlib.tests.test_sftp_transport.SSHVendorBadConnection.test_bad_connection_ssh: FAIL
bzrlib.tests.blackbox.test_diff.TestExternalDiff.test_external_diff: FAIL
bzrlib.tests.blackbox.test_selftest.TestRunBzrCaptured.test_run_bzr_subprocess: FAIL
[==================================================================================================================================] OK            3193/3193
======================================================================
FAIL: test_bad_connection_ssh (bzrlib.tests.test_sftp_transport.SSHVendorBadConnection)

vvvv[log from bzrlib.tests.test_sftp_transport.SSHVendorBadConnection.test_bad_connection_ssh]

^^^^[log from bzrlib.tests.test_sftp_transport.SSHVendorBadConnection.test_bad_connection_ssh]
----------------------------------------------------------------------
Traceback (most recent call last):
  File "/usr/lib/python2.4/site-packages/bzrlib/tests/test_sftp_transport.py", line 343, in test_bad_connection_ssh
    out, err = self.run_bzr_subprocess('log', self.bogus_url, retcode=3)
  File "/usr/lib/python2.4/site-packages/bzrlib/tests/__init__.py", line 857, in run_bzr_subprocess
    assert supplied_retcode == retcode
AssertionError

======================================================================
FAIL: test_external_diff (bzrlib.tests.blackbox.test_diff.TestExternalDiff)

vvvv[log from bzrlib.tests.blackbox.test_diff.TestExternalDiff.test_external_diff]
relpath '.' => url '.'
created control directory in file:///home/etienne/Canonical/packaging/bzr/0.10rc1/test0000.tmp/blackbox.test_diff.TestExternalDiff.test_external_diff/
creating repository in file:///home/etienne/Canonical/packaging/bzr/0.10rc1/test0000.tmp/blackbox.test_diff.TestExternalDiff.test_external_diff/.bzr/.
creating branch <bzrlib.branch.BzrBranchFormat5 object at 0x2aaaad42a590> in file:///home/etienne/Canonical/packaging/bzr/0.10rc1/test0000.tmp/blackbox.test_diff.TestExternalDiff.test_external_diff/.bzr/
got branch format Bazaar-NG Metadir branch format 5
got branch format Bazaar-NG Metadir branch format 5
opening working tree '/home/etienne/Canonical/packaging/bzr/0.10rc1/test0000.tmp/blackbox.test_diff.TestExternalDiff.test_external_diff'
failed to open /home/etienne/Canonical/packaging/bzr/0.10rc1/test0000.tmp/blackbox.test_diff.TestExternalDiff.test_external_diff/.bzr/checkout/stat-cache: [Errno 2] No such file or directory: u'/home/etienne/Canonical/packaging/bzr/0.10rc1/test0000.tmp/blackbox.test_diff.TestExternalDiff.test_external_diff/.bzr/checkout/stat-cache'
write hc
wrote working inventory
wrote working inventory
wrote working inventory
wrote working inventory
preparing to commit
Selecting files for commit with filter None
added revision_id {etienne@snowwhite-20060829000608-6763a43af0db10dc}
add {etienne@snowwhite-20060829000608-6763a43af0db10dc} to revision-history
wrote working inventory
preparing to commit
commit parent revision {etienne@snowwhite-20060829000608-6763a43af0db10dc}
Selecting files for commit with filter None
added revision_id {etienne@snowwhite-20060829000608-d75acf83d97b9ff6}
add {etienne@snowwhite-20060829000608-d75acf83d97b9ff6} to revision-history

^^^^[log from bzrlib.tests.blackbox.test_diff.TestExternalDiff.test_external_diff]
----------------------------------------------------------------------
Traceback (most recent call last):
  File "/usr/lib/python2.4/site-packages/bzrlib/tests/blackbox/test_diff.py", line 284, in test_external_diff
    self.assertEqual('', err)
AssertionError: '' != "/usr/bin/python2.4: can't open file '/usr/lib/python2.4/site-packages/bzr': [Errno 2] No such file or directory\n"

======================================================================
FAIL: test_run_bzr_subprocess (bzrlib.tests.blackbox.test_selftest.TestRunBzrCaptured)

vvvv[log from bzrlib.tests.blackbox.test_selftest.TestRunBzrCaptured.test_run_bzr_subprocess]

^^^^[log from bzrlib.tests.blackbox.test_selftest.TestRunBzrCaptured.test_run_bzr_subprocess]
----------------------------------------------------------------------
Traceback (most recent call last):
  File "/usr/lib/python2.4/site-packages/bzrlib/tests/blackbox/test_selftest.py", line 163, in test_run_bzr_subprocess
    result = self.run_bzr_subprocess('--version')
  File "/usr/lib/python2.4/site-packages/bzrlib/tests/__init__.py", line 857, in run_bzr_subprocess
    assert supplied_retcode == retcode
AssertionError

----------------------------------------------------------------------
Ran 3193 tests in 447.392s

FAILED (failures=3)
tests failed