etcat_1.10-29_i386.deb' to `/var/cache/pbuilder/aptcache/netcat_1.10-29_i386.deb': File exists
ln: creating hard link `/var/cache/pbuilder/build//7484/var/cache/apt/archives/ntpdate_1%3a4.2.0a+stable-8.1ubuntu6_i386.deb' to `/var/cache/pbuilder/aptcache/ntpdate_1%3a4.2.0a+stable-8.1ubuntu6_i386.deb': File exists
ln: creating hard link `/var/cache/pbuilder/build//7484/var/cache/apt/archives/passwd_1%3a4.0.13-7ubuntu3_i386.deb' to `/var/cache/pbuilder/aptcache/passwd_1%3a4.0.13-7ubuntu3_i386.deb': File exists
ln: creating hard link `/var/cache/pbuilder/build//7484/var/cache/apt/archives/pciutils_1%3a2.1.11-15.3ubuntu1_i386.deb' to `/var/cache/pbuilder/aptcache/pciutils_1%3a2.1.11-15.3ubuntu1_i386.deb': File exists
ln: creating hard link `/var/cache/pbuilder/build//7484/var/cache/apt/archives/pcmciautils_012-1ubuntu4_i386.deb' to `/var/cache/pbuilder/aptcache/pcmciautils_012-1ubuntu4_i386.deb': File exists
ln: creating hard link `/var/cache/pbuilder/build//7484/var/cache/apt/archives/perl-base_5.8.7-10ubuntu1_i386.deb' to `/var/cache/pbuilder/aptcache/perl-base_5.8.7-10ubuntu1_i386.deb': File exists
ln: creating hard link `/var/cache/pbuilder/build//7484/var/cache/apt/archives/procps_1%3a3.2.6-2ubuntu4_i386.deb' to `/var/cache/pbuilder/aptcache/procps_1%3a3.2.6-2ubuntu4_i386.deb': File exists
ln: creating hard link `/var/cache/pbuilder/build//7484/var/cache/apt/archives/python_2.4.2-0ubuntu3_all.deb' to `/var/cache/pbuilder/aptcache/python_2.4.2-0ubuntu3_all.deb': File exists
ln: creating hard link `/var/cache/pbuilder/build//7484/var/cache/apt/archives/python-minimal_2.4.2-0ubuntu3_all.deb' to `/var/cache/pbuilder/aptcache/python-minimal_2.4.2-0ubuntu3_all.deb': File exists
ln: creating hard link `/var/cache/pbuilder/build//7484/var/cache/apt/archives/python2.4_2.4.3-0ubuntu4_i386.deb' to `/var/cache/pbuilder/aptcache/python2.4_2.4.3-0ubuntu4_i386.deb': File exists
ln: creating hard link `/var/cache/pbuilder/build//7484/var/cache/apt/archives/python2.4-minimal_2.4.3-0ubuntu4_i386.deb' to `/var/cache/pbuilder/aptcache/python2.4-minimal_2.4.3-0ubuntu4_i386.deb': File exists
ln: creating hard link `/var/cache/pbuilder/build//7484/var/cache/apt/archives/readline-common_5.1-7build1_all.deb' to `/var/cache/pbuilder/aptcache/readline-common_5.1-7build1_all.deb': File exists
ln: creating hard link `/var/cache/pbuilder/build//7484/var/cache/apt/archives/reiser4progs_1.0.5-1_i386.deb' to `/var/cache/pbuilder/aptcache/reiser4progs_1.0.5-1_i386.deb': File exists
ln: creating hard link `/var/cache/pbuilder/build//7484/var/cache/apt/archives/reiserfsprogs_1%3a3.6.19-1_i386.deb' to `/var/cache/pbuilder/aptcache/reiserfsprogs_1%3a3.6.19-1_i386.deb': File exists
ln: creating hard link `/var/cache/pbuilder/build//7484/var/cache/apt/archives/sed_4.1.4-5_i386.deb' to `/var/cache/pbuilder/aptcache/sed_4.1.4-5_i386.deb': File exists
ln: creating hard link `/var/cache/pbuilder/build//7484/var/cache/apt/archives/strace_4.5.12-1ubuntu1_i386.deb' to `/var/cache/pbuilder/aptcache/strace_4.5.12-1ubuntu1_i386.deb': File exists
ln: creating hard link `/var/cache/pbuilder/build//7484/var/cache/apt/archives/sudo_1.6.8p12-1ubuntu6_i386.deb' to `/var/cache/pbuilder/aptcache/sudo_1.6.8p12-1ubuntu6_i386.deb': File exists
ln: creating hard link `/var/cache/pbuilder/build//7484/var/cache/apt/archives/sysklogd_1.4.1-17ubuntu7_i386.deb' to `/var/cache/pbuilder/aptcache/sysklogd_1.4.1-17ubuntu7_i386.deb': File exists
ln: creating hard link `/var/cache/pbuilder/build//7484/var/cache/apt/archives/sysv-rc_2.86.ds1-6ubuntu32_all.deb' to `/var/cache/pbuilder/aptcache/sysv-rc_2.86.ds1-6ubuntu32_all.deb': File exists
ln: creating hard link `/var/cache/pbuilder/build//7484/var/cache/apt/archives/sysvinit_2.86.ds1-6ubuntu32_i386.deb' to `/var/cache/pbuilder/aptcache/sysvinit_2.86.ds1-6ubuntu32_i386.deb': File exists
ln: creating hard link `/var/cache/pbuilder/build//7484/var/cache/apt/archives/tar_1.15.1-2ubuntu2_i386.deb' to `/var/cache/pbuilder/aptcache/tar_1.15.1-2ubuntu2_i386.deb': File exists
ln: creating hard link `/var/cache/pbuilder/build//7484/var/cache/apt/archives/tcpd_7.6.dbs-8ubuntu1_i386.deb' to `/var/cache/pbuilder/aptcache/tcpd_7.6.dbs-8ubuntu1_i386.deb': File exists
ln: creating hard link `/var/cache/pbuilder/build//7484/var/cache/apt/archives/ubuntu-keyring_2005.01.12.1_all.deb' to `/var/cache/pbuilder/aptcache/ubuntu-keyring_2005.01.12.1_all.deb': File exists
ln: creating hard link `/var/cache/pbuilder/build//7484/var/cache/apt/archives/ubuntu-minimal_0.119_i386.deb' to `/var/cache/pbuilder/aptcache/ubuntu-minimal_0.119_i386.deb': File exists
ln: creating hard link `/var/cache/pbuilder/build//7484/var/cache/apt/archives/udev_079-0ubuntu34_i386.deb' to `/var/cache/pbuilder/aptcache/udev_079-0ubuntu34_i386.deb': File exists
ln: creating hard link `/var/cache/pbuilder/build//7484/var/cache/apt/archives/usbutils_0.71+cvs20051029-4ubuntu1_i386.deb' to `/var/cache/pbuilder/aptcache/usbutils_0.71+cvs20051029-4ubuntu1_i386.deb': File exists
ln: creating hard link `/var/cache/pbuilder/build//7484/var/cache/apt/archives/util-linux_2.12r-4ubuntu6_i386.deb' to `/var/cache/pbuilder/aptcache/util-linux_2.12r-4ubuntu6_i386.deb': File exists
ln: creating hard link `/var/cache/pbuilder/build//7484/var/cache/apt/archives/vim_1%3a6.4-006+2ubuntu6_i386.deb' to `/var/cache/pbuilder/aptcache/vim_1%3a6.4-006+2ubuntu6_i386.deb': File exists
ln: creating hard link `/var/cache/pbuilder/build//7484/var/cache/apt/archives/vim-common_1%3a6.4-006+2ubuntu6_i386.deb' to `/var/cache/pbuilder/aptcache/vim-common_1%3a6.4-006+2ubuntu6_i386.deb': File exists
ln: creating hard link `/var/cache/pbuilder/build//7484/var/cache/apt/archives/vim-runtime_1%3a6.4-006+2ubuntu6_all.deb' to `/var/cache/pbuilder/aptcache/vim-runtime_1%3a6.4-006+2ubuntu6_all.deb': File exists
ln: creating hard link `/var/cache/pbuilder/build//7484/var/cache/apt/archives/whiptail_0.51.6-31ubuntu1_i386.deb' to `/var/cache/pbuilder/aptcache/whiptail_0.51.6-31ubuntu1_i386.deb': File exists
ln: creating hard link `/var/cache/pbuilder/build//7484/var/cache/apt/archives/wireless-tools_27+28pre13-1ubuntu2_i386.deb' to `/var/cache/pbuilder/aptcache/wireless-tools_27+28pre13-1ubuntu2_i386.deb': File exists
ln: creating hard link `/var/cache/pbuilder/build//7484/var/cache/apt/archives/wpasupplicant_0.4.8-3ubuntu1_i386.deb' to `/var/cache/pbuilder/aptcache/wpasupplicant_0.4.8-3ubuntu1_i386.deb': File exists
ln: creating hard link `/var/cache/pbuilder/build//7484/var/cache/apt/archives/xfsprogs_2.7.7-1_i386.deb' to `/var/cache/pbuilder/aptcache/xfsprogs_2.7.7-1_i386.deb': File exists
ln: creating hard link `/var/cache/pbuilder/build//7484/var/cache/apt/archives/zlib1g_1%3a1.2.3-6ubuntu4_i386.deb' to `/var/cache/pbuilder/aptcache/zlib1g_1%3a1.2.3-6ubuntu4_i386.deb': File exists
Reading package lists... Done
Building dependency tree... Done
Calculating upgrade... Done
0 upgraded, 0 newly installed, 0 to remove and 0 not upgraded.
Reading package lists... Done
Building dependency tree... Done
apt is already the newest version.
The following extra packages will be installed:
binutils cpp cpp-4.0 g++ g++-4.0 gcc gcc-4.0 libc6-dev libgdbm3
libstdc++6-4.0-dev linux-kernel-headers make patch perl perl-modules
Suggested packages:
binutils-doc cpp-doc gcc-4.0-locales debian-keyring gcc-4.0-doc lib64stdc++6
manpages-dev autoconf automake1.9 libtool flex bison gdb gcc-doc
libc6-dev-amd64 lib64gcc1 glibc-doc libstdc++6-4.0-doc stl-manual ed
libterm-readline-gnu-perl libterm-readline-perl-perl
Recommended packages:
libmudflap0-dev perl-doc
The following NEW packages will be installed:
binutils build-essential cpp cpp-4.0 dpkg-dev g++ g++-4.0 gcc gcc-4.0
libc6-dev libgdbm3 libstdc++6-4.0-dev linux-kernel-headers make patch perl
perl-modules
0 upgraded, 17 newly installed, 0 to remove and 0 not upgraded.
Need to get 0B/17.7MB of archives.
After unpacking 70.9MB of additional disk space will be used.
Selecting previously deselected package libgdbm3.
(Reading database ... 9287 files and directories currently installed.)
Unpacking libgdbm3 (from .../libgdbm3_1.8.3-2_i386.deb) ...
Selecting previously deselected package binutils.
Unpacking binutils (from .../binutils_2.16.1cvs20060117-1ubuntu2_i386.deb) ...
Selecting previously deselected package linux-kernel-headers.
Unpacking linux-kernel-headers (from .../linux-kernel-headers_2.6.11.2-0ubuntu18_i386.deb) ...
Selecting previously deselected package libc6-dev.
Unpacking libc6-dev (from .../libc6-dev_2.3.6-0ubuntu20_i386.deb) ...
Selecting previously deselected package cpp-4.0.
Unpacking cpp-4.0 (from .../cpp-4.0_4.0.3-1ubuntu5_i386.deb) ...
Selecting previously deselected package cpp.
Unpacking cpp (from .../cpp_4%3a4.0.3-1_i386.deb) ...
Selecting previously deselected package gcc-4.0.
Unpacking gcc-4.0 (from .../gcc-4.0_4.0.3-1ubuntu5_i386.deb) ...
Selecting previously deselected package gcc.
Unpacking gcc (from .../gcc_4%3a4.0.3-1_i386.deb) ...
Selecting previously deselected package libstdc++6-4.0-dev.
Unpacking libstdc++6-4.0-dev (from .../libstdc++6-4.0-dev_4.0.3-1ubuntu5_i386.deb) ...
Selecting previously deselected package g++-4.0.
Unpacking g++-4.0 (from .../g++-4.0_4.0.3-1ubuntu5_i386.deb) ...
Selecting previously deselected package g++.
Unpacking g++ (from .../g++_4%3a4.0.3-1_i386.deb) ...
Selecting previously deselected package make.
Unpacking make (from .../make_3.80+3.81.b4-1_i386.deb) ...
Selecting previously deselected package perl-modules.
Unpacking perl-modules (from .../perl-modules_5.8.7-10ubuntu1_all.deb) ...
Selecting previously deselected package perl.
Unpacking perl (from .../perl_5.8.7-10ubuntu1_i386.deb) ...
Selecting previously deselected package patch.
Unpacking patch (from .../patch_2.5.9-2_i386.deb) ...
Selecting previously deselected package dpkg-dev.
Unpacking dpkg-dev (from .../dpkg-dev_1.13.11ubuntu6_all.deb) ...
Selecting previously deselected package build-essential.
Unpacking build-essential (from .../build-essential_11.1_i386.deb) ...
Setting up libgdbm3 (1.8.3-2) ...
Setting up binutils (2.16.1cvs20060117-1ubuntu2) ...
Setting up linux-kernel-headers (2.6.11.2-0ubuntu18) ...
Setting up libc6-dev (2.3.6-0ubuntu20) ...
Setting up cpp-4.0 (4.0.3-1ubuntu5) ...
Setting up cpp (4.0.3-1) ...
Setting up gcc-4.0 (4.0.3-1ubuntu5) ...
Setting up gcc (4.0.3-1) ...
Setting up make (3.80+3.81.b4-1) ...
Setting up patch (2.5.9-2) ...
Setting up perl-modules (5.8.7-10ubuntu1) ...
Setting up g++-4.0 (4.0.3-1ubuntu5) ...
Setting up libstdc++6-4.0-dev (4.0.3-1ubuntu5) ...
Setting up g++ (4.0.3-1) ...
Setting up perl (5.8.7-10ubuntu1) ...
Setting up dpkg-dev (1.13.11ubuntu6) ...
Setting up build-essential (11.1) ...
Copying back the cached apt archive contents
-> unmounting dev/pts filesystem
-> unmounting proc filesystem
-> creating base tarball [/var/cache/pbuilder/base.tgz]
-> cleaning the build env
-> removing directory /var/cache/pbuilder/build//7484 and its subdirectoriesfrancois@fepc:~/package/vor-0.4$ debuild -S -sa
dpkg-buildpackage: source package is vor
dpkg-buildpackage: source version is 1.0.1-0ubuntu1
dpkg-buildpackage: source changed by francois <f.decamp@lavache.com>
fakeroot debian/rules clean
dh_testdir
dh_testroot
rm -f build-stamp configure-stamp
# Add here commands to clean up after the build process.
/usr/bin/make clean
make[1]: sdl-config : commande introuvable
make[1]: entrant dans le répertoire « /home/francois/package/vor-0.4 »
make[1]: sdl-config : commande introuvable
rm -f *.o vor
rm -f tags
make[1]: quittant le répertoire « /home/francois/package/vor-0.4 »
dh_clean
dpkg-source -b vor-0.4
dpkg-source: warning: source directory `./vor-0.4' is not <sourcepackage>-<upstreamversion> `vor-1.0.1'
dpkg-source: building vor in vor_1.0.1-0ubuntu1.tar.gz
dpkg-source: building vor in vor_1.0.1-0ubuntu1.dsc
dpkg-genchanges -S -sa
dpkg-genchanges: including full source code in upload
dpkg-buildpackage: source only upload: Debian-native package
Now running lintian...
E: vor_1.0.1-0ubuntu1_source.changes: bad-distribution-in-changes-file edgy
E: vor source: package-lacks-versioned-build-depends-on-debhelper 5
W: vor source: newer-standards-version 3.7.2
W: vor source: native-package-with-dash-version
W: vor source: maintainer-not-full-name francois
Finished running lintian.
Now signing changes and any dsc files...
signfile vor_1.0.1-0ubuntu1.dsc francois <f.decamp@lavache.com>
gpg: « francois <f.decamp@lavache.com> » a été ignoré: la clé secrète n'est pas disponible
gpg: [stdin]: clearsign failed: la clé secrète n'est pas disponible
debsign: gpg error occurred! Aborting....
debuild: fatal error at line 791:
running debsign failed
francois@fepc:~/package/vor-0.4$ sudo pbuilder build /home/francois/package/vor_1.0.1-0ubuntu1.dsc
W: /home/francois/.pbuilderrc does not exist
I: using fakeroot in build.
pbuilder-buildpackage/i386 $Id: pbuilder-buildpackage-funcs,v 1.28 2005/12/21 11:57:29 dancer Exp $
$Id: pbuilder-buildpackage,v 1.120 2006/01/06 12:30:51 dancer Exp $
Current time: Sun Aug 27 21:19:29 CEST 2006
pbuilder-time-stamp: 1156706369
Building the build Environment
-> extracting base tarball [/var/cache/pbuilder/base.tgz]
-> creating local configuration
-> copying local configuration
-> mounting /proc filesystem
ln: creating symbolic link `/var/cache/pbuilder/build//19078/etc/mtab' to `../proc/mounts': File exists
-> mounting /dev/pts filesystem
-> policy-rc.d already exists
-> created buildresult dir :/var/cache/pbuilder/result/
Obtaining the cached apt archive contents
Installing the build-deps
-> Attempting to parse the build-deps : pbuilder-satisfydepends,v 1.22 2005/12/04 05:16:40 dancer Exp $
-> Considering debhelper (>= 4.0.0)
-> Trying debhelper
-> Installing debhelper
Reading package lists... Done
Building dependency tree... Done
The following extra packages will be installed:
debconf-utils file gettext html2text intltool-debian libmagic1 po-debconf
Suggested packages:
dh-make cvs gettext-doc
Recommended packages:
curl wget lynx libmail-sendmail-perl libcompress-zlib-perl
The following NEW packages will be installed:
debconf-utils debhelper file gettext html2text intltool-debian libmagic1
po-debconf
0 upgraded, 8 newly installed, 0 to remove and 0 not upgraded.
Need to get 0B/2204kB of archives.
After unpacking 9282kB of additional disk space will be used.
Selecting previously deselected package libmagic1.
(Reading database ... 12890 files and directories currently installed.)
Unpacking libmagic1 (from .../libmagic1_4.16-0ubuntu3_i386.deb) ...
Selecting previously deselected package file.
Unpacking file (from .../file_4.16-0ubuntu3_i386.deb) ...
Selecting previously deselected package debconf-utils.
Unpacking debconf-utils (from .../debconf-utils_1.4.72ubuntu9_all.deb) ...
Selecting previously deselected package html2text.
Unpacking html2text (from .../html2text_1.3.2a-3_i386.deb) ...
Selecting previously deselected package gettext.
Unpacking gettext (from .../gettext_0.14.5-2ubuntu3_i386.deb) ...
Selecting previously deselected package intltool-debian.
Unpacking intltool-debian (from .../intltool-debian_0.34.1+20050828ubuntu1_all.deb) ...
Selecting previously deselected package po-debconf.
Unpacking po-debconf (from .../po-debconf_0.9.2_all.deb) ...
Selecting previously deselected package debhelper.
Unpacking debhelper (from .../debhelper_5.0.7ubuntu13_all.deb) ...
Setting up libmagic1 (4.16-0ubuntu3) ...
Setting up file (4.16-0ubuntu3) ...
Setting up debconf-utils (1.4.72ubuntu9) ...
Setting up html2text (1.3.2a-3) ...
Setting up gettext (0.14.5-2ubuntu3) ...
Setting up intltool-debian (0.34.1+20050828ubuntu1) ...
Setting up po-debconf (0.9.2) ...
Setting up debhelper (5.0.7ubuntu13) ...
-> Finished parsing the build-deps
Reading package lists... Done
Building dependency tree... Done
The following NEW packages will be installed:
fakeroot
0 upgraded, 1 newly installed, 0 to remove and 0 not upgraded.
Need to get 0B/93.8kB of archives.
After unpacking 385kB of additional disk space will be used.
Selecting previously deselected package fakeroot.
(Reading database ... 13426 files and directories currently installed.)
Unpacking fakeroot (from .../fakeroot_1.5.6ubuntu2_i386.deb) ...
Setting up fakeroot (1.5.6ubuntu2) ...
Copying back the cached apt archive contents
/var/cache/pbuilder/build/19078/etc/passwd
/var/cache/pbuilder/build/19078/etc/group
Copying source file
-> copying [/home/francois/package/vor_1.0.1-0ubuntu1.dsc]
-> copying [/home/francois/package/vor_1.0.1-0ubuntu1.tar.gz]
Extracting source
su: Authentication service cannot retrieve authentication info.
(Ignored)
dpkg-source: warning: no utmp entry available and LOGNAME not defined; using uid of process (1234)
dpkg-source: extracting vor in vor-1.0.1
dpkg-source: unpacking vor_1.0.1-0ubuntu1.tar.gz
-> Building the package
su: Authentication service cannot retrieve authentication info.
(Ignored)
dpkg-parsechangelog: warning: no utmp entry available and LOGNAME not defined; using uid of process (1234)
debian: warning: no utmp entry available and LOGNAME not defined; using uid of process (1234)
dpkg-buildpackage: source package is vor
dpkg-parsechangelog: warning: no utmp entry available and LOGNAME not defined; using uid of process (1234)
debian: warning: no utmp entry available and LOGNAME not defined; using uid of process (1234)
dpkg-buildpackage: source version is 1.0.1-0ubuntu1
dpkg-parsechangelog: warning: no utmp entry available and LOGNAME not defined; using uid of process (1234)
debian: warning: no utmp entry available and LOGNAME not defined; using uid of process (1234)
dpkg-buildpackage: source changed by francois <f.decamp@lavache.com>
dpkg-architecture: warning: no utmp entry available and LOGNAME not defined; using uid of process (1234)
dpkg-architecture: warning: no utmp entry available and LOGNAME not defined; using uid of process (1234)
dpkg-buildpackage: host architecture i386
dpkg-checkbuilddeps: warning: no utmp entry available and LOGNAME not defined; using uid of process (1234)
dpkg-architecture: warning: no utmp entry available and LOGNAME not defined; using uid of process (1234)
dpkg-architecture: warning: no utmp entry available and LOGNAME not defined; using uid of process (1234)
fakeroot debian/rules clean
dh_testdir
dh_testroot
rm -f build-stamp configure-stamp
# Add here commands to clean up after the build process.
/usr/bin/make clean
make[1]: sdl-config: Command not found
make[1]: Entering directory `/tmp/buildd/vor-1.0.1'
make[1]: sdl-config: Command not found
rm -f *.o vor
rm -f tags
make[1]: Leaving directory `/tmp/buildd/vor-1.0.1'
dh_clean
dpkg-source -b vor-1.0.1
dpkg-source: warning: no utmp entry available and LOGNAME not defined; using uid of process (1234)
dpkg-parsechangelog: warning: no utmp entry available and LOGNAME not defined; using uid of process (1234)
debian: warning: no utmp entry available and LOGNAME not defined; using uid of process (1234)
dpkg-source: building vor in vor_1.0.1-0ubuntu1.tar.gz
dpkg-source: building vor in vor_1.0.1-0ubuntu1.dsc
debian/rules build
dh_testdir
# Add here commands to configure the package.
touch configure-stamp
dh_testdir
# Add here commands to compile the package.
/usr/bin/make
make[1]: sdl-config: Command not found
make[1]: Entering directory `/tmp/buildd/vor-1.0.1'
make[1]: sdl-config: Command not found
compiling SFont.o from SFont.c
SFont.c:26:17: error: SDL.h: No such file or directory
In file included from SFont.c:30:
SFont.h:44: error: syntax error before 'SDL_Surface'
SFont.h:44: warning: no semicolon at end of struct or union
SFont.h:47: error: syntax error before '}' token
SFont.h:47: warning: type defaults to 'int' in declaration of 'SFont_Font'
SFont.h:47: warning: data definition has no type or storage class
SFont.h:52: error: syntax error before '*' token
SFont.h:52: error: syntax error before '*' token
SFont.h:52: warning: type defaults to 'int' in declaration of 'SFont_InitFont'
SFont.h:52: warning: data definition has no type or storage class
SFont.h:57: error: syntax error before '*' token
SFont.h:62: error: syntax error before '*' token
SFont.h:66: warning: type defaults to 'int' in declaration of 'SFont_Font'
SFont.h:66: error: syntax error before '*' token
SFont.h:68: warning: type defaults to 'int' in declaration of 'SFont_Font'
SFont.h:68: error: syntax error before '*' token
SFont.h:71: error: syntax error before '*' token
SFont.c:33: error: syntax error before 'GetPixel'
SFont.c:33: error: syntax error before '*' token
SFont.c:34: warning: return type defaults to 'int'
SFont.c: In function 'GetPixel':
SFont.c:35: error: 'Uint8' undeclared (first use in this function)
SFont.c:35: error: (Each undeclared identifier is reported only once
SFont.c:35: error: for each function it appears in.)
SFont.c:35: error: 'bits' undeclared (first use in this function)
SFont.c:36: error: 'Uint32' undeclared (first use in this function)
SFont.c:36: error: syntax error before 'Bpp'
SFont.c:38: error: 'X' undeclared (first use in this function)
SFont.c:39: error: 'Surface' undeclared (first use in this function)
SFont.c:41: error: 'Bpp' undeclared (first use in this function)
SFont.c:42: error: syntax error before ')' token
SFont.c:42: error: 'Y' undeclared (first use in this function)
SFont.c:47: error: syntax error before ')' token
SFont.c:50: error: 'Uint16' undeclared (first use in this function)
SFont.c:50: error: syntax error before ')' token
SFont.c:53: error: syntax error before 'r'
SFont.c:54: error: 'r' undeclared (first use in this function)
SFont.c:55: error: 'g' undeclared (first use in this function)
SFont.c:56: error: 'b' undeclared (first use in this function)
SFont.c:57: warning: implicit declaration of function 'SDL_MapRGB'
SFont.c:61: error: syntax error before ')' token
SFont.c: At top level:
SFont.c:68: error: syntax error before '*' token
SFont.c:69: error: syntax error before '*' token
SFont.c:70: warning: return type defaults to 'int'
SFont.c: In function 'SFont_InitFont':
SFont.c:72: error: 'Uint32' undeclared (first use in this function)
SFont.c:72: error: syntax error before 'pixel'
SFont.c:73: error: 'Font' undeclared (first use in this function)
SFont.c:74: error: syntax error before 'pink'
SFont.c:76: error: 'Surface' undeclared (first use in this function)
SFont.c:79: error: syntax error before ')' token
SFont.c:82: warning: implicit declaration of function 'SDL_LockSurface'
SFont.c:84: error: 'pink' undeclared (first use in this function)
SFont.c:96: error: 'pixel' undeclared (first use in this function)
SFont.c:97: warning: implicit declaration of function 'SDL_UnlockSurface'
SFont.c:98: warning: implicit declaration of function 'SDL_SetColorKey'
SFont.c:98: error: 'SDL_SRCCOLORKEY' undeclared (first use in this function)
SFont.c: At top level:
SFont.c:104: error: syntax error before '*' token
SFont.c: In function 'SFont_FreeFont':
SFont.c:106: warning: implicit declaration of function 'SDL_FreeSurface'
SFont.c:106: error: 'FontInfo' undeclared (first use in this function)
SFont.c: At top level:
SFont.c:111: error: syntax error before '*' token
SFont.c: In function 'SFont_Write':
SFont.c:116: error: 'SDL_Rect' undeclared (first use in this function)
SFont.c:116: error: syntax error before 'srcrect'
SFont.c:118: error: 'text' undeclared (first use in this function)
SFont.c:122: error: 'srcrect' undeclared (first use in this function)
SFont.c:123: error: 'dstrect' undeclared (first use in this function)
SFont.c:123: error: 'y' undeclared (first use in this function)
SFont.c:124: error: 'Font' undeclared (first use in this function)
SFont.c:126: error: 'x' undeclared (first use in this function)
SFont.c:126: error: 'Surface' undeclared (first use in this function)
SFont.c:141: warning: implicit declaration of function 'SDL_BlitSurface'
SFont.c: At top level:
SFont.c:148: warning: type defaults to 'int' in declaration of 'SFont_Font'
SFont.c:148: error: syntax error before '*' token
SFont.c: In function 'SFont_TextWidth':
SFont.c:154: error: 'text' undeclared (first use in this function)
SFont.c:160: error: 'Font' undeclared (first use in this function)
SFont.c: At top level:
SFont.c:172: warning: type defaults to 'int' in declaration of 'SFont_Font'
SFont.c:172: error: syntax error before '*' token
SFont.c: In function 'SFont_TextHeight':
SFont.c:174: error: 'Font' undeclared (first use in this function)
SFont.c: At top level:
SFont.c:178: error: syntax error before '*' token
SFont.c: In function 'SFont_WriteCenter':
SFont.c:181: error: 'Surface' undeclared (first use in this function)
SFont.c:181: error: 'Font' undeclared (first use in this function)
SFont.c:181: error: 'text' undeclared (first use in this function)
SFont.c:182: error: 'y' undeclared (first use in this function)
make[1]: *** [SFont.o] Error 1
make[1]: Leaving directory `/tmp/buildd/vor-1.0.1'
make: *** [build-stamp] Error 2
pbuilder: Failed autobuilding of package
-> Aborting with an error
-> unmounting dev/pts filesystem
-> unmounting proc filesystem
-> cleaning the build env
-> removing directory /var/cache/pbuilder/build//19078 and its subdirectories