[DEBUG] Setting system property [user.dir]=[/home/valera/studio/ldif-parser]
[DEBUG] Setting system property [localRepository]=[/home/valera/.m2/repository]
[DEBUG] Setting system property [basedir]=[/home/valera/studio/ldif-parser]
[DEBUG] Using JVM: /usr/local/jdk-1.5.0/jre/bin/java
[INFO] Surefire report directory: /home/valera/studio/ldif-parser/target/surefire-reports
Forking command line: /bin/sh -c cd /home/valera/studio/ldif-parser && /usr/local/jdk-1.5.0/jre/bin/java -Xmx1024m -jar /tmp/surefirebooter14506.jar /tmp/surefire14504tmp /tmp/surefire14505tmp
Error occurred during initialization of VM
Could not reserve enough space for object heap
Could not create the Java virtual machine.
[INFO] ------------------------------------------------------------------------
[ERROR] BUILD FAILURE
[INFO] ------------------------------------------------------------------------
[INFO] There are test failures.
Please refer to /home/valera/studio/ldif-parser/target/surefire-reports for the individual test results.
[INFO] ------------------------------------------------------------------------
[DEBUG] Trace
org.apache.maven.BuildFailureException: There are test failures.
Please refer to /home/valera/studio/ldif-parser/target/surefire-reports for the individual test results.
at org.apache.maven.lifecycle.DefaultLifecycleExecutor.executeGoals(DefaultLifecycleExecutor.java:699)
at org.apache.maven.lifecycle.DefaultLifecycleExecutor.executeGoalWithLifecycle(DefaultLifecycleExecutor.java:540)
at org.apache.maven.lifecycle.DefaultLifecycleExecutor.executeGoal(DefaultLifecycleExecutor.java:519)
at org.apache.maven.lifecycle.DefaultLifecycleExecutor.executeGoalAndHandleFailures(DefaultLifecycleExecutor.java:371)
at org.apache.maven.lifecycle.DefaultLifecycleExecutor.executeTaskSegments(DefaultLifecycleExecutor.java:332)
at org.apache.maven.lifecycle.DefaultLifecycleExecutor.execute(DefaultLifecycleExecutor.java:181)
at org.apache.maven.DefaultMaven.doExecute(DefaultMaven.java:356)
at org.apache.maven.DefaultMaven.execute(DefaultMaven.java:137)
at org.apache.maven.cli.MavenCli.main(MavenCli.java:362)
at org.apache.maven.cli.compat.CompatibleMain.main(CompatibleMain.java:41)
at sun.reflect.NativeMethodAccessorImpl.invoke0(Native Method)
at sun.reflect.NativeMethodAccessorImpl.invoke(NativeMethodAccessorImpl.java:39)
at sun.reflect.DelegatingMethodAccessorImpl.invoke(DelegatingMethodAccessorImpl.java:25)
at java.lang.reflect.Method.invoke(Method.java:585)
at org.codehaus.classworlds.Launcher.launchEnhanced(Launcher.java:315)
at org.codehaus.classworlds.Launcher.launch(Launcher.java:255)
at org.codehaus.classworlds.Launcher.mainWithExitCode(Launcher.java:430)
at org.codehaus.classworlds.Launcher.main(Launcher.java:375)
Caused by: org.apache.maven.plugin.MojoFailureException: There are test failures.
Please refer to /home/valera/studio/ldif-parser/target/surefire-reports for the individual test results.
at org.apache.maven.plugin.surefire.SurefirePlugin.execute(SurefirePlugin.java:575)
at org.apache.maven.plugin.DefaultPluginManager.executeMojo(DefaultPluginManager.java:483)
at org.apache.maven.lifecycle.DefaultLifecycleExecutor.executeGoals(DefaultLifecycleExecutor.java:678)
... 17 more
[INFO] ------------------------------------------------------------------------
[INFO] Total time: 35 seconds
[INFO] Finished at: Wed Jul 29 09:52:54 EEST 2009
[INFO] Final Memory: 47M/88M
[INFO] ------------------------------------------------------------------------