All pastes #1509787 Raw Edit

th

public text v1 · immutable
#1509787 ·published 2009-07-28 08:52 UTC
rendered paste body
th@hydra:~/src/oe/build$ bitbake xorg-imageParsing .bb files, please wait...done.
NOTE: Parsing finished. 6718 cached, 0 parsed, 265 skipped, 17 masked.NOTE: Cache is clean, not saving.NOTE: Resolving any missing task queue dependenciesNOTE: Preparing runqueueNOTE: Executing runqueueNOTE: Running task 1133 of 4496 (ID: 89, /home/th/src/oe/openembedded/recipes/fakeroot/fakeroot-native_1.12.4.bb, do_qa_configure)NOTE: Running task 3048 of 4496 (ID: 2070, /home/th/src/oe/openembedded/recipes/xorg-driver/xf86-video-vesa_2.2.0.bb, do_compile)NOTE: Running task 3049 of 4496 (ID: 90, /home/th/src/oe/openembedded/recipes/fakeroot/fakeroot-native_1.12.4.bb, do_compile)ERROR: function do_compile failedERROR: log data follows (/home/th/src/oe/build/tmp/work/i686p4c-angstrom-linux/xf86-video-vesa-1_2.2.0-r7/temp/log.do_compile.7005)| NOTE: make -j 3| make  all-recursive| make[1]: Entering directory `/home/th/src/oe/build/tmp/work/i686p4c-angstrom-linux/xf86-video-vesa-1_2.2.0-r7/xf86-video-vesa-2.2.0'| Making all in src| make[2]: Entering directory `/home/th/src/oe/build/tmp/work/i686p4c-angstrom-linux/xf86-video-vesa-1_2.2.0-r7/xf86-video-vesa-2.2.0/src'| /bin/sh ../i686-angstrom-linux-libtool --tag=CC   --mode=compile ccache i686-angstrom-linux-gcc -march=prescott -DHAVE_CONFIG_H -I. -I.. -I../src  -isystem/home/th/src/oe/build/tmp/staging/i686p4c-angstrom-linux/usr/include  -isystem/home/th/src/oe/build/tmp/staging/i686p4c-angstrom-linux/usr/include -fexpensive-optimizations -frename-registers -fomit-frame-pointer -O2 -ggdb3 -I/home/th/src/oe/build/tmp/staging/i686p4c-angstrom-linux -I/home/th/src/oe/build/tmp/staging/i686p4c-angstrom-linux/usr/include/pixman-1    -I../src -MT vesa.lo -MD -MP -MF .deps/vesa.Tpo -c -o vesa.lo vesa.c| i686-angstrom-linux-libtool: compile:  ccache i686-angstrom-linux-gcc -march=prescott -DHAVE_CONFIG_H -I. -I.. -I../src -isystem/home/th/src/oe/build/tmp/staging/i686p4c-angstrom-linux/usr/include -isystem/home/th/src/oe/build/tmp/staging/i686p4c-angstrom-linux/usr/include -fexpensive-optimizations -frename-registers -fomit-frame-pointer -O2 -ggdb3 -I/home/th/src/oe/build/tmp/staging/i686p4c-angstrom-linux -I/home/th/src/oe/build/tmp/staging/i686p4c-angstrom-linux/usr/include/pixman-1 -I../src -MT vesa.lo -MD -MP -MF .deps/vesa.Tpo -c vesa.c  -fPIC -DPIC -o .libs/vesa.o| In file included from vesa.c:43:| ../config.h:4:25: error: xorg-server.h: No such file or directory| In file included from vesa.c:48:| vesa.h:36:18: error: xf86.h: No such file or directory| vesa.h:37:25: error: xf86_OSproc.h: No such file or directory| vesa.h:38:27: error: xf86Resources.h: No such file or directory| vesa.h:42:22: error: compiler.h: No such file or directory| vesa.h:45:25: error: xf86PciInfo.h: No such file or directory| vesa.h:47:19: error: vgaHW.h: No such file or directory| vesa.h:50:21: error: xf86Pci.h: No such file or directory| vesa.h:53:17: error: vbe.h: No such file or directory| vesa.h:54:22: error: vbeModes.h: No such file or directory| vesa.h:55:21: error: xf86DDC.h: No such file or directory| vesa.h:61:23: error: xf86int10.h: No such file or directory| vesa.h:64:20: error: mibank.h: No such file or directory| vesa.h:67:21: error: dgaproc.h: No such file or directory| vesa.h:70:21: error: xf86RAC.h: No such file or directory| vesa.h:72:16: error: fb.h: No such file or directory| In file included from vesa.c:48:| vesa.h:89: error: expected specifier-qualifier-list before 'vbeInfoPtr'| vesa.c:51:23: error: mipointer.h: No such file or directory| vesa.c:54:22: error: mibstore.h: No such file or directory| vesa.c:57:20: error: micmap.h: No such file or directory| vesa.c:58:22: error: xf86cmap.h: No such file or directory| vesa.c:59:23: error: xf86Modes.h: No such file or directory| vesa.c:66: error: expected '=', ',', ';', 'asm' or '__attribute__' before '*' token| vesa.c:68: error: expected '=', ',', ';', 'asm' or '__attribute__' before 'VESAProbe'| vesa.c:73: error: expected '=', ',', ';', 'asm' or '__attribute__' before 'VESAPreInit'| vesa.c:74: error: expected '=', ',', ';', 'asm' or '__attribute__' before 'VESAScreenInit'| vesa.c:76: error: expected '=', ',', ';', 'asm' or '__attribute__' before 'VESAEnterVT'| vesa.c:78: error: expected '=', ',', ';', 'asm' or '__attribute__' before 'VESACloseScreen'| vesa.c:79: error: expected '=', ',', ';', 'asm' or '__attribute__' before 'VESASaveScreen'| vesa.c:81: error: expected '=', ',', ';', 'asm' or '__attribute__' before 'VESASwitchMode'| vesa.c:82: error: expected '=', ',', ';', 'asm' or '__attribute__' before 'VESASetMode'| vesa.c:85: error: expected ')' before 'pScrn'| vesa.c:86: error: expected ')' before 'pScrn'| vesa.c:89: error: expected ')' before 'pScrn'| vesa.c:93: error: expected ')' before 'dev'| vesa.c:94: error: expected '=', ',', ';', 'asm' or '__attribute__' before 'VESAMapVidMem'| vesa.c:95: error: expected ')' before 'pScrn'| vesa.c:96: error: expected ')' before 'pScreen'| vesa.c:97: error: expected ')' before 'pScrn'| vesa.c:99: error: expected ')' before 'pScrn'| vesa.c:100: error: expected ')' before 'pScrn'| vesa.c:102: error: expected '=', ',', ';', 'asm' or '__attribute__' before 'VESASaveRestore'| vesa.c:104: error: expected ')' before 'pScrn'| vesa.c:106: error: expected ')' before 'pScrn'| vesa.c:109: error: expected '=', ',', ';', 'asm' or '__attribute__' before 'VESADGAInit'| vesa.c:128: error: expected '=', ',', ';', 'asm' or '__attribute__' before 'VESAChipsets'| vesa.c:135: error: expected '=', ',', ';', 'asm' or '__attribute__' before 'VESAPCIchipsets'| vesa.c:156: error: expected '=', ',', ';', 'asm' or '__attribute__' before 'DriverRec'| vesa.c:179: error: expected '=', ',', ';', 'asm' or '__attribute__' before 'VESAOptions'| vesa.c:231: error: expected '=', ',', ';', 'asm' or '__attribute__' before '*' token| vesa.c: In function 'VESAIdentify':| vesa.c:240: error: 'VESAChipsets' undeclared (first use in this function)| vesa.c:240: error: (Each undeclared identifier is reported only once| vesa.c:240: error: for each function it appears in.)| vesa.c: At top level:| vesa.c:244: error: expected ')' before 'pScrn'| vesa.c:254: error: expected ')' before 'pVbe'| vesa.c:284: error: expected '=', ',', ';', 'asm' or '__attribute__' before 'VESAValidMode'| vesa.c:366: error: expected ')' before 'pScrn'| vesa.c:408: error: expected '=', ',', ';', 'asm' or '__attribute__' before 'VESAProbe'| vesa.c:506: error: expected ')' before 'pScrn'| vesa.c:540: error: expected ')' before 'pScrn'| vesa.c:560: error: expected '=', ',', ';', 'asm' or '__attribute__' before 'VESAPreInit'| vesa.c:831: error: expected '=', ',', ';', 'asm' or '__attribute__' before 'vesaCreateScreenResources'| vesa.c:848: error: expected declaration specifiers or '...' before 'Bool'| vesa.c: In function 'vesaEnableDisableFBAccess':| vesa.c:850: error: 'ScrnInfoPtr' undeclared (first use in this function)| vesa.c:850: error: expected ';' before 'pScrn'| vesa.c:851: error: 'pScrn' undeclared (first use in this function)| vesa.c:851: warning: initialization makes pointer from integer without a cast| vesa.c:853: error: 'struct _VESARec' has no member named 'accessEnabled'| vesa.c:853: error: 'enable' undeclared (first use in this function)| vesa.c:854: error: 'struct _VESARec' has no member named 'EnableDisableFBAccess'| vesa.c: At top level:| vesa.c:858: error: expected '=', ',', ';', 'asm' or '__attribute__' before 'VESAScreenInit'| vesa.c:1063: error: expected '=', ',', ';', 'asm' or '__attribute__' before 'VESAEnterVT'| vesa.c: In function 'VESALeaveVT':| vesa.c:1076: error: 'xf86Screens' undeclared (first use in this function)| vesa.c:1076: error: 'MODE_RESTORE' undeclared (first use in this function)| vesa.c: At top level:| vesa.c:1080: error: expected '=', ',', ';', 'asm' or '__attribute__' before 'VESACloseScreen'| vesa.c:1108: error: expected '=', ',', ';', 'asm' or '__attribute__' before 'VESASwitchMode'| vesa.c:1124: error: expected '=', ',', ';', 'asm' or '__attribute__' before 'VESASetMode'| vesa.c: In function 'VESAAdjustFrame':| vesa.c:1182: error: 'xf86Screens' undeclared (first use in this function)| vesa.c:1182: warning: initialization makes pointer from integer without a cast| vesa.c:1184: error: 'struct _VESARec' has no member named 'pVbe'| vesa.c:1184: error: 'TRUE' undeclared (first use in this function)| vesa.c: In function 'VESAFreeScreen':| vesa.c:1190: error: 'xf86Screens' undeclared (first use in this function)| vesa.c: At top level:| vesa.c:1194: error: expected '=', ',', ';', 'asm' or '__attribute__' before 'VESAMapVidMem'| vesa.c:1255: error: expected ')' before 'pScrn'| vesa.c:1280: error: expected ')' before 'pScreen'| vesa.c:1291: error: expected ')' before 'pScreen'| vesa.c:1310: error: expected ')' before 'pScrn'| vesa.c: In function 'WriteAttr':| vesa.c:1372: error: 'struct _VESARec' has no member named 'ioBase'| vesa.c:1372: error: 'VGA_IOBASE_COLOR' undeclared (first use in this function)| vesa.c:1372: error: 'VGA_IN_STAT_1_OFFSET' undeclared (first use in this function)| vesa.c:1375: error: 'struct _VESARec' has no member named 'ioBase'| vesa.c:1375: error: 'VGA_ATTR_INDEX' undeclared (first use in this function)| vesa.c:1376: error: 'struct _VESARec' has no member named 'ioBase'| vesa.c:1376: error: 'VGA_ATTR_DATA_W' undeclared (first use in this function)| vesa.c: In function 'ReadAttr':| vesa.c:1382: error: 'struct _VESARec' has no member named 'ioBase'| vesa.c:1382: error: 'VGA_IOBASE_COLOR' undeclared (first use in this function)| vesa.c:1382: error: 'VGA_IN_STAT_1_OFFSET' undeclared (first use in this function)| vesa.c:1385: error: 'struct _VESARec' has no member named 'ioBase'| vesa.c:1385: error: 'VGA_ATTR_INDEX' undeclared (first use in this function)| vesa.c:1386: error: 'struct _VESARec' has no member named 'ioBase'| vesa.c:1386: error: 'VGA_ATTR_DATA_R' undeclared (first use in this function)| vesa.c: In function 'ReadSeq':| vesa.c:1397: error: 'struct _VESARec' has no member named 'ioBase'| vesa.c:1397: error: 'VGA_SEQ_INDEX' undeclared (first use in this function)| vesa.c:1399: error: 'struct _VESARec' has no member named 'ioBase'| vesa.c:1399: error: 'VGA_SEQ_DATA' undeclared (first use in this function)| vesa.c: In function 'ReadGr':| vesa.c:1409: error: 'struct _VESARec' has no member named 'ioBase'| vesa.c:1409: error: 'VGA_GRAPH_INDEX' undeclared (first use in this function)| vesa.c:1411: error: 'struct _VESARec' has no member named 'ioBase'| vesa.c:1411: error: 'VGA_GRAPH_DATA' undeclared (first use in this function)| vesa.c: At top level:| vesa.c:1419: error: expected declaration specifiers or '...' before 'Bool'| vesa.c: In function 'SeqReset':| vesa.c:1421: error: 'start' undeclared (first use in this function)| vesa.c:1422: error: 'struct _VESARec' has no member named 'ioBase'| vesa.c:1422: error: 'VGA_SEQ_INDEX' undeclared (first use in this function)| vesa.c:1422: error: 'struct _VESARec' has no member named 'ioBase'| vesa.c:1422: error: 'VGA_SEQ_DATA' undeclared (first use in this function)| vesa.c:1425: error: 'struct _VESARec' has no member named 'ioBase'| vesa.c:1425: error: 'struct _VESARec' has no member named 'ioBase'| vesa.c: At top level:| vesa.c:1430: error: expected ')' before 'pScrn'| vesa.c:1495: error: expected ')' before 'pScrn'| vesa.c:1567: error: expected '=', ',', ';', 'asm' or '__attribute__' before 'VESASaveScreen'| vesa.c:1592: error: expected ')' before 'pScreen'| vesa.c:1611: error: expected '=', ',', ';', 'asm' or '__attribute__' before 'VESASaveRestore'| vesa.c:1670: error: expected ')' before 'pScrn'| vesa.c:1684: error: expected '=', ',', ';', 'asm' or '__attribute__' before 'VESADGAOpenFramebuffer'| vesa.c:1688: error: expected '=', ',', ';', 'asm' or '__attribute__' before 'VESADGASetMode'| vesa.c:1689: error: expected ')' before 'pScrn'| vesa.c:1692: error: expected '=', ',', ';', 'asm' or '__attribute__' before 'VESADGAOpenFramebuffer'| vesa.c:1708: error: expected '=', ',', ';', 'asm' or '__attribute__' before 'VESADGASetMode'| vesa.c:1734: error: expected ')' before 'pScrn'| vesa.c:1740: error: expected ')' before 'pScrn'| vesa.c:1745: error: expected '=', ',', ';', 'asm' or '__attribute__' before 'VESADGAFunctions'| vesa.c:1759: error: expected ')' before 'pScrn'| vesa.c:1808: error: expected '=', ',', ';', 'asm' or '__attribute__' before 'VESADGAInit'| make[2]: *** [vesa.lo] Error 1| make[2]: Leaving directory `/home/th/src/oe/build/tmp/work/i686p4c-angstrom-linux/xf86-video-vesa-1_2.2.0-r7/xf86-video-vesa-2.2.0/src'| make[1]: *** [all-recursive] Error 1| make[1]: Leaving directory `/home/th/src/oe/build/tmp/work/i686p4c-angstrom-linux/xf86-video-vesa-1_2.2.0-r7/xf86-video-vesa-2.2.0'| make: *** [all] Error 2| FATAL: oe_runmake failedNOTE: Task failed: /home/th/src/oe/build/tmp/work/i686p4c-angstrom-linux/xf86-video-vesa-1_2.2.0-r7/temp/log.do_compile.7005ERROR: TaskFailed event exception, abortingERROR: Build of /home/th/src/oe/openembedded/recipes/xorg-driver/xf86-video-vesa_2.2.0.bb do_compile failedERROR: Task 2070 (/home/th/src/oe/openembedded/recipes/xorg-driver/xf86-video-vesa_2.2.0.bb, do_compile) failedNOTE: Waiting for 1 active tasks to finishNOTE: 1: /home/th/src/oe/openembedded/recipes/fakeroot/fakeroot-native_1.12.4.bb, do_compile (7006)NOTE: Tasks Summary: Attempted 3047 tasks of which 3046 didn't need to be rerun and 1 failed.ERROR: '/home/th/src/oe/openembedded/recipes/xorg-driver/xf86-video-vesa_2.2.0.bb' failed