X:\rel-build>emerge --update kde-4.3/kdebase-runtime
emerge.bat executed
06:29
emerge debug: buildAction: all
emerge debug: doPretend: False
emerge debug: packageName: kde-4.3/kdebase-runtime
emerge debug: buildType: RelWithDebInfo
emerge debug: buildTests: True
emerge debug: verbose: 1
emerge debug: KDEROOT: X:\rel-build
________________________________________________________________________________
emerge debug: getCategoryPackageVersion: X:\rel-build\emerge\portage\kde-4.3\kdepimlibs\kdepimlibs-20080202.py
emerge debug: setdir category: kde-4.3, package: kdepimlibs
emerge debug: cmakeInstallPrefix: X:/rel-build
emerge debug: base exec called. args: ['X:\\rel-build\\emerge\\portage\\kde-4.3\\kdepimlibs\\kdepimlibs-20080202.py', 'fetch']
emerge debug: command: fetch
emerge debug: getCategoryPackageVersion: X:\rel-build\emerge\portage\kde-4.3\kdepimlibs\kdepimlibs-20080202.py
emerge debug: setdir category: kde-4.3, package: kdepimlibs
emerge debug: cmakeInstallPrefix: X:/rel-build
emerge debug: base exec called. args: ['X:\\rel-build\\emerge\\portage\\kde-4.3\\kdepimlibs\\kdepimlibs-20080202.py', 'unpack']
emerge debug: command: unpack
ksco exists: X:\shared\svn branches
ksco exists: X:\shared\svn\branches KDE
ksco exists: X:\shared\svn\branches\KDE 4.3
dir in which to really checkout: X:\shared\svn\branches\KDE\4.3
dir to really checkout: kdepimlibs
At revision 994004.
emerge debug: getCategoryPackageVersion: X:\rel-build\emerge\portage\kde-4.3\kdepimlibs\kdepimlibs-20080202.py
emerge debug: setdir category: kde-4.3, package: kdepimlibs
emerge debug: cmakeInstallPrefix: X:/rel-build
emerge debug: base exec called. args: ['X:\\rel-build\\emerge\\portage\\kde-4.3\\kdepimlibs\\kdepimlibs-20080202.py', 'compile']
emerge debug: command: compile
configuration command: cmake -G "MinGW Makefiles" "X:\shared\svn\branches\KDE\4.3\kdepimlibs" -DCMAKE_INSTALL_PREFIX="X:/rel-build" -DCMAKE_INCLUDE_PATH="X:/rel-build/include" -DCMAKE_LIBRARY_PATH="X:/rel-build/lib" -DKDE4_BUILD_TESTS=1 -DKDE4_ENABLE_EXPERIMENTAL_LIB_EXPORT:BOOL=ON -DKDEWIN_DIR:PATH="X:/rel-build"
-DCMAKE_BUILD_TYPE=RelWithDebInfo
-- Found Qt-Version 4.5.1 (using X:/rel-build/bin/qmake.exe)
-- Phonon Version: 4.3.50
-- Found KDEWIN library: X:/rel-build/lib/libkdewin.dll.a
-- Found KDE 4.3 include dir: X:/rel-build/include
-- Found KDE 4.3 library dir: X:/rel-build/lib
-- Found the KDE4 kconfig_compiler preprocessor: X:/rel-build/bin/kconfig_compiler.exe
-- Found automoc4: X:/rel-build/bin/automoc4.exe
-- The kdewin32 cmake module is deprecated, use kdewin instead
-- Found KDEWIN library: X:/rel-build/lib/libkdewin.dll.a
-- Usable gpgme flavours found: vanilla
-- Found Libical version 0.43
-----------------------------------------------------------------------------
-- The following external packages were located on your system.
-- This installation will have the extra features provided by these packages.
-----------------------------------------------------------------------------
* boost - Boost C++ Libraries
* gpgme - GnuPG Made Easy Development Libraries
* Akonadi - Akonadi server (from kdesupport)
* cyrus-sasl - Cyrus SASL API
* SMI - SharedMimeInfo
* libical - Reference implementation of the iCalendar data type and serialization format
-----------------------------------------------------------------------------
-- The following OPTIONAL packages could NOT be located on your system.
-- Consider installing them to enable more features from this software.
-----------------------------------------------------------------------------
* OpenLDAP <http://www.openldap.org>
LDAP (Lightweight Directory Access Protocol) libraries
STRONGLY RECOMMENDED: Needed to provide LDAP functionality in KDE
-----------------------------------------------------------------------------
-- Configuring done
-- Generating done
-- Build files have been written to: X:/rel-build/tmp/kdepimlibs-20080202/work/mingw-RelWithDebInfo
[ 0%] Built target gpgmepp_automoc
[ 2%] Built target gpgmepp
[ 2%] Built target qgpgme_automoc
[ 2%] Built target qgpgme
[ 2%] Built target dataprovidertest_automoc
[ 3%] Built target dataprovidertest
[ 3%] Built target installtest_automoc
Linking CXX executable installtest.exe
CMakeFiles\installtest.dir\installtest.obj: In function `main':
X:/shared/svn/branches/KDE/4.3/kdepimlibs/qgpgme/tests/installtest.cpp:72: undefined reference to `gpgme_engine_check_version'
X:/shared/svn/branches/KDE/4.3/kdepimlibs/qgpgme/tests/installtest.cpp:73: undefined reference to `gpgme_engine_check_version'
X:/shared/svn/branches/KDE/4.3/kdepimlibs/qgpgme/tests/installtest.cpp:75: undefined reference to `gpgme_get_engine_info'
collect2: ld returned 1 exit status
mingw32-make[2]: *** [qgpgme/tests/installtest.exe] Error 1
mingw32-make[1]: *** [qgpgme/tests/CMakeFiles/installtest.dir/all] Error 2
mingw32-make: *** [all] Error 2
emerge fatal error: while Make'ing. cmd: mingw32-make
emerge fatal error: running python X:\rel-build\emerge\portage\kde-4.3\kdepimlibs\kdepimlibs-20080202.py compile
emerge error: fatal error: package kde-4.3/kdepimlibs-20080202 all failed
06:30
X:\rel-build>