gtkcellrendererprogress.c:1492: error: structure has no member named `background
_set'
gtkcellrendererprogress.c:1494: error: structure has no member named `background
'
gtkcellrendererprogress.c:1495: error: structure has no member named `background
'
gtkcellrendererprogress.c:1496: error: structure has no member named `background
'
gtkcellrendererprogress.c:1507: error: structure has no member named `foreground
_set'
gtkcellrendererprogress.c:1509: error: structure has no member named `foreground
'
gtkcellrendererprogress.c:1510: error: structure has no member named `foreground
'
gtkcellrendererprogress.c:1511: error: structure has no member named `foreground
'
gtkcellrendererprogress.c:1522: error: structure has no member named `progressgr
ound_set'
gtkcellrendererprogress.c:1524: error: structure has no member named `progressgr
ound'
gtkcellrendererprogress.c:1525: error: structure has no member named `value'
gtkcellrendererprogress.c:1526: error: structure has no member named `value_star
t'
gtkcellrendererprogress.c: In function `gtk_cell_renderer_progress_finalize':
gtkcellrendererprogress.c:1558: error: structure has no member named `font'
gtkcellrendererprogress.c:1560: error: structure has no member named `extra_attr
s'
gtkcellrendererprogress.c:1561: error: structure has no member named `extra_attr
s'
make[2]: *** [gtkcellrendererprogress.o] Error 1
make[2]: *** Waiting for unfinished jobs....
make[2]: Leaving directory `/var/tmp/portage/giftui-0.3.1/work/giftui-0.3.1/src'
make[1]: *** [all] Error 2
make[1]: Leaving directory `/var/tmp/portage/giftui-0.3.1/work/giftui-0.3.1/src'
make: *** [all-recursive] Error 1
!!! ERROR: net-p2p/giftui-0.3.1 failed.
!!! Function src_compile, Line 556, Exitcode 2
!!! emake failed
!!! If you need support, post the topmost build error, NOT this status message.
anubis johnny #