All pastes #148681 Raw Edit

Something

public text v1 · immutable
#148681 ·published 2006-08-25 09:26 UTC
rendered paste body
 g++ -DHAVE_CONFIG_H -I. -I. -I../.. -I../../include -I. -I./unrtf -DQT3 -I/usr/include -D_REENTRANT -DQT_THREAD_SUPPORT -DPLUGIN_NAME=flpimport -O -march=athlon-xp -mmmx -msse -m3dnow -pipe -DPIC -fPIC -O3 -g -g -floop-optimize2 -fgcse-sm -fgcse-las -ftree-vectorize -ftree-loop-linear -funsafe-loop-optimizations -Wunsafe-loop-optimizations -DSINGLE_SOURCE_COMPILE -ansi -Wall -fno-exceptions -I/usr/local/include -MT flp_import.lo -MD -MP -MF .deps/flp_import.Tpo -c flp_import.cpp  -fPIC -DPIC -o .libs/flp_import.o
./unrtf/convert.c: In function 'void word_dump_date(Word*)':
./unrtf/convert.c:256: error: 'isdigit' was not declared in this scope
./unrtf/convert.c: In function 'void process_info_group(Word*)':
./unrtf/convert.c:563: error: 'isdigit' was not declared in this scope
./unrtf/convert.c: In function 'void print_with_special_exprs(char*)':
./unrtf/convert.c:2622: error: 'toupper' was not declared in this scope
./unrtf/convert.c: In function 'void word_print_core(Word*)':
./unrtf/convert.c:2877: error: 'tolower' was not declared in this scope
./unrtf/convert.c:3020: error: 'isdigit' was not declared in this scope
./unrtf/convert.c:3021: error: 'isdigit' was not declared in this scope
./unrtf/convert.c:3027: error: 'tolower' was not declared in this scope
./unrtf/parse.c: In function 'int read_word(QBuffer*)':
./unrtf/parse.c:399: error: 'isdigit' was not declared in this scope
./unrtf/util.c: In function 'int h2toi(char*)':
./unrtf/util.c:61: error: 'tolower' was not declared in this scope
make[3]: Leaving directory `/usr/src/lmms-0.2.1/plugins/flp_import'
make[3]: *** [flp_import.lo] Error 1
make[2]: Leaving directory `/usr/src/lmms-0.2.1/plugins'
make[2]: *** [all-recursive] Error 1
make[1]: *** [all-recursive] Error 1
make[1]: Leaving directory `/usr/src/lmms-0.2.1'
make: *** [all] Error 2