calcifer:~/P dicesquirrel$ make
mod 'i_script.c'
i_script.c:30:18: error: pcre.h: No such file or directory
i_script.c:274: error: parse error before 'pcre'
i_script.c:274: warning: no semicolon at end of struct or union
i_script.c:275: warning: type defaults to 'int' in declaration of 'extra'
i_script.c:275: warning: data definition has no type or storage class
i_script.c:280: error: parse error before '}' token
i_script.c: In function 'exec_trigger':
i_script.c:632: error: dereferencing pointer to incomplete type
i_script.c: In function 'check_triggers':
i_script.c:648: error: dereferencing pointer to incomplete type
i_script.c:650: error: dereferencing pointer to incomplete type
i_script.c:653: error: dereferencing pointer to incomplete type
i_script.c:664: error: dereferencing pointer to incomplete type
i_script.c:670: error: dereferencing pointer to incomplete type
i_script.c:672: warning: implicit declaration of function 'pcre_exec'
i_script.c:672: error: dereferencing pointer to incomplete type
i_script.c:672: error: dereferencing pointer to incomplete type
i_script.c:690: error: dereferencing pointer to incomplete type
i_script.c: In function 'do_searchback':
i_script.c:853: error: 'pcre' undeclared (first use in this function)
i_script.c:853: error: (Each undeclared identifier is reported only once
i_script.c:853: error: for each function it appears in.)
i_script.c:853: error: 'pattern' undeclared (first use in this function)
i_script.c:854: error: 'pcre_extra' undeclared (first use in this function)
i_script.c:873: warning: implicit declaration of function 'pcre_compile'
i_script.c:873: error: 'PCRE_MULTILINE' undeclared (first use in this function)
i_script.c:881: warning: implicit declaration of function 'pcre_study'
i_script.c:881: warning: assignment makes pointer from integer without a cast
i_script.c: In function 'show_statistics':
i_script.c:1062: error: dereferencing pointer to incomplete type
i_script.c:1064: error: invalid application of 'sizeof' to incomplete type 'TRIGGER'
i_script.c:1065: error: dereferencing pointer to incomplete type
i_script.c:1065: error: dereferencing pointer to incomplete type
i_script.c:1066: error: dereferencing pointer to incomplete type
i_script.c:1066: error: dereferencing pointer to incomplete type
i_script.c:1074: warning: format '%d' expects type 'int', but argument 3 has type 'long unsigned int'
i_script.c: In function 'destroy_script':
i_script.c:1513: error: dereferencing pointer to incomplete type
i_script.c:1515: error: dereferencing pointer to incomplete type
i_script.c:1516: error: dereferencing pointer to incomplete type
i_script.c:1517: error: dereferencing pointer to incomplete type
i_script.c:1518: error: dereferencing pointer to incomplete type
i_script.c:1519: error: dereferencing pointer to incomplete type
i_script.c:1520: error: dereferencing pointer to incomplete type
i_script.c:1521: error: dereferencing pointer to incomplete type
i_script.c:1522: error: dereferencing pointer to incomplete type
i_script.c: In function 'load_script_trigger':
i_script.c:2823: error: invalid application of 'sizeof' to incomplete type 'TRIGGER'
i_script.c:2824: error: dereferencing pointer to incomplete type
i_script.c:2830: error: dereferencing pointer to incomplete type
i_script.c:2831: error: dereferencing pointer to incomplete type
i_script.c:2832: error: dereferencing pointer to incomplete type
i_script.c:2835: error: dereferencing pointer to incomplete type
i_script.c:2835: error: dereferencing pointer to incomplete type
i_script.c:2835: error: dereferencing pointer to incomplete type
i_script.c:2835: error: dereferencing pointer to incomplete type
i_script.c:2835: error: dereferencing pointer to incomplete type
i_script.c:2853: error: dereferencing pointer to incomplete type
i_script.c:2865: error: dereferencing pointer to incomplete type
i_script.c:2867: error: dereferencing pointer to incomplete type
i_script.c:2869: error: dereferencing pointer to incomplete type
i_script.c:2871: error: dereferencing pointer to incomplete type
i_script.c:2874: error: dereferencing pointer to incomplete type
i_script.c:2875: error: dereferencing pointer to incomplete type
i_script.c:2886: error: dereferencing pointer to incomplete type
i_script.c:2903: error: dereferencing pointer to incomplete type
i_script.c:2908: error: dereferencing pointer to incomplete type
i_script.c:2912: error: dereferencing pointer to incomplete type
i_script.c:2917: error: dereferencing pointer to incomplete type
i_script.c:2917: error: dereferencing pointer to incomplete type
i_script.c:2923: error: dereferencing pointer to incomplete type
i_script.c: In function 'debug_show_value':
i_script.c:4523: warning: format '%d' expects type 'int', but argument 3 has type 'size_t'
make: *** [i_script.so] Error 1
calcifer:~/P dicesquirrel$