All pastes #1479594 Raw Edit

smoke test

public text v1 · immutable
#1479594 ·published 2009-06-30 15:01 UTC
rendered paste body
Buildfile: build.xml.complete

test.integration.smoke.masterdata.00:

init:
    [mkdir] Created dir: /home/openbravo/Automated_Test_Main/build/classes
    [mkdir] Created dir: /home/openbravo/Automated_Test_Main/log
    [mkdir] Created dir: /home/openbravo/Automated_Test_Main/report

compile:
    [javac] Compiling 272 source files to /home/openbravo/Automated_Test_Main/build/classes

test.integration:

selenium.start:
  [waitfor] Wait for proxy server launch
    [junit] Running com.openbravo.test.integration.smoke.masterdata.A_00_Logging
    [junit] Tests run: 0, Failures: 0, Errors: 1, Time elapsed: 0.055 sec

BUILD FAILED
/home/openbravo/Automated_Test_Main/build.xml.complete:132: The following error occurred while executing this line:
/home/openbravo/Automated_Test_Main/build.xml.complete:63: Test com.openbravo.test.integration.smoke.masterdata.A_00_Logging failed

Total time: 3 seconds
Buildfile: build.xml.complete

test.integration.smoke.masterdata.00:

init:

compile:

test.integration:

selenium.start:
  [waitfor] Wait for proxy server launch
    [junit] Running com.openbravo.test.integration.smoke.masterdata.A_00_Logging
    [junit] Tests run: 1, Failures: 0, Errors: 1, Time elapsed: 38.283 sec

BUILD FAILED
/home/openbravo/Automated_Test_Main/build.xml.complete:132: The following error occurred while executing this line:
/home/openbravo/Automated_Test_Main/build.xml.complete:63: Test com.openbravo.test.integration.smoke.masterdata.A_00_Logging failed

Total time: 38 seconds
Buildfile: build.xml.complete

test.integration.smoke.masterdata.00:

init:

compile:

test.integration:
  [waitfor] Wait for proxy server launch

selenium.start:
    [junit] Running com.openbravo.test.integration.smoke.masterdata.A_00_Logging
    [junit] Tests run: 1, Failures: 0, Errors: 1, Time elapsed: 24.952 sec

BUILD FAILED
/home/openbravo/Automated_Test_Main/build.xml.complete:132: The following error occurred while executing this line:
/home/openbravo/Automated_Test_Main/build.xml.complete:63: Test com.openbravo.test.integration.smoke.masterdata.A_00_Logging failed

Total time: 25 seconds
Buildfile: build.xml.complete

test.integration.smoke.masterdata.00:

init:

compile:

test.integration:

selenium.start:
  [waitfor] Wait for proxy server launch
    [junit] Running com.openbravo.test.integration.smoke.masterdata.A_00_Logging
    [junit] Tests run: 1, Failures: 0, Errors: 0, Time elapsed: 19.915 sec

selenium.stop:
[selenium-shutdown] Getting: http://localhost:4444/selenium-server/driver/?cmd=shutDown
[selenium-shutdown] To: /home/openbravo/Automated_Test_Main/log/result.txt
[selenium-shutdown] DGF Errors during shutdown are expected

test.integration.smoke.masterdata.01:

init:

compile:

test.integration:

selenium.start:
  [waitfor] Wait for proxy server launch
    [junit] Running com.openbravo.test.integration.smoke.masterdata.A_01_InitialClientSetup
    [junit] Tests run: 1, Failures: 0, Errors: 0, Time elapsed: 63.617 sec

selenium.stop:
[selenium-shutdown] Getting: http://localhost:4444/selenium-server/driver/?cmd=shutDown
[selenium-shutdown] To: /home/openbravo/Automated_Test_Main/log/result.txt
[selenium-shutdown] DGF Errors during shutdown are expected

test.integration.smoke.masterdata.01A:

init:

compile:

test.integration:

selenium.start:
  [waitfor] Wait for proxy server launch
    [junit] Running com.openbravo.test.integration.smoke.masterdata.A_01A_InitialOrganizationSetup
    [junit] Tests run: 1, Failures: 0, Errors: 0, Time elapsed: 188.653 sec

selenium.stop:
[selenium-shutdown] Getting: http://localhost:4444/selenium-server/driver/?cmd=shutDown
[selenium-shutdown] To: /home/openbravo/Automated_Test_Main/log/result.txt
[selenium-shutdown] DGF Errors during shutdown are expected

test.integration.smoke.masterdata.03A:

init:

compile:

test.integration:

selenium.start:
  [waitfor] Wait for proxy server launch
    [junit] Running com.openbravo.test.integration.smoke.masterdata.A_03A_CreateModule
    [junit] Tests run: 1, Failures: 0, Errors: 0, Time elapsed: 71.689 sec

selenium.stop:
[selenium-shutdown] Getting: http://localhost:4444/selenium-server/driver/?cmd=shutDown
[selenium-shutdown] To: /home/openbravo/Automated_Test_Main/log/result.txt
[selenium-shutdown] DGF Errors during shutdown are expected

test.integration.smoke.masterdata.04:

init:

compile:

test.integration:

selenium.start:
  [waitfor] Wait for proxy server launch
    [junit] Running com.openbravo.test.integration.smoke.masterdata.A_04_CreateUser
    [junit] Tests run: 1, Failures: 0, Errors: 0, Time elapsed: 48.906 sec

selenium.stop:
[selenium-shutdown] Getting: http://localhost:4444/selenium-server/driver/?cmd=shutDown
[selenium-shutdown] To: /home/openbravo/Automated_Test_Main/log/result.txt
[selenium-shutdown] DGF Errors during shutdown are expected

test.integration.smoke.masterdata.05:

init:

compile:

test.integration:

selenium.start:
  [waitfor] Wait for proxy server launch
    [junit] Running com.openbravo.test.integration.smoke.masterdata.A_05_CreateRole
    [junit] Tests run: 1, Failures: 0, Errors: 0, Time elapsed: 91.307 sec

selenium.stop:
[selenium-shutdown] Getting: http://localhost:4444/selenium-server/driver/?cmd=shutDown
[selenium-shutdown] To: /home/openbravo/Automated_Test_Main/log/result.txt
[selenium-shutdown] DGF Errors during shutdown are expected

test.integration.smoke.masterdata.05A:

init:

compile:

test.integration:

selenium.start:
  [waitfor] Wait for proxy server launch
    [junit] Running com.openbravo.test.integration.smoke.masterdata.A_05A_CreateFiscalCalendar
    [junit] Tests run: 1, Failures: 0, Errors: 0, Time elapsed: 58.999 sec

selenium.stop:
[selenium-shutdown] Getting: http://localhost:4444/selenium-server/driver/?cmd=shutDown
[selenium-shutdown] To: /home/openbravo/Automated_Test_Main/log/result.txt
[selenium-shutdown] DGF Errors during shutdown are expected

test.integration.smoke.masterdata.05B:

init:

compile:

test.integration:

selenium.start:
  [waitfor] Wait for proxy server launch
    [junit] Running com.openbravo.test.integration.smoke.masterdata.A_05B_EditOrganization
    [junit] Tests run: 1, Failures: 0, Errors: 0, Time elapsed: 87.22 sec

selenium.stop:
[selenium-shutdown] Getting: http://localhost:4444/selenium-server/driver/?cmd=shutDown
[selenium-shutdown] To: /home/openbravo/Automated_Test_Main/log/result.txt
[selenium-shutdown] DGF Errors during shutdown are expected

test.integration.smoke.masterdata.05C:

init:

compile:

test.integration:

selenium.start:
  [waitfor] Wait for proxy server launch
    [junit] Running com.openbravo.test.integration.smoke.masterdata.A_05C_OpenClosePeriod
    [junit] Tests run: 1, Failures: 0, Errors: 0, Time elapsed: 142.99 sec

selenium.stop:
[selenium-shutdown] Getting: http://localhost:4444/selenium-server/driver/?cmd=shutDown
[selenium-shutdown] To: /home/openbravo/Automated_Test_Main/log/result.txt
[selenium-shutdown] DGF Errors during shutdown are expected

test.integration.smoke.masterdata.05D:

init:

compile:

test.integration:

selenium.start:
  [waitfor] Wait for proxy server launch
    [junit] Running com.openbravo.test.integration.smoke.masterdata.A_05D_CreateWareHouse
    [junit] Tests run: 1, Failures: 0, Errors: 0, Time elapsed: 46.839 sec

selenium.stop:
[selenium-shutdown] Getting: http://localhost:4444/selenium-server/driver/?cmd=shutDown
[selenium-shutdown] To: /home/openbravo/Automated_Test_Main/log/result.txt
[selenium-shutdown] DGF Errors during shutdown are expected

test.integration.smoke.masterdata.06:

init:

compile:

test.integration:

selenium.start:
  [waitfor] Wait for proxy server launch
    [junit] Running com.openbravo.test.integration.smoke.masterdata.A_06_CreateImportLoaderFormat
    [junit] Tests run: 3, Failures: 0, Errors: 0, Time elapsed: 376.288 sec

selenium.stop:
[selenium-shutdown] Getting: http://localhost:4444/selenium-server/driver/?cmd=shutDown
[selenium-shutdown] To: /home/openbravo/Automated_Test_Main/log/result.txt
[selenium-shutdown] DGF Errors during shutdown are expected

test.integration.smoke.masterdata.07:

init:

compile:

test.integration:

selenium.start:
  [waitfor] Wait for proxy server launch
    [junit] Running com.openbravo.test.integration.smoke.masterdata.A_07_ImportFileLoader
    [junit] Tests run: 3, Failures: 0, Errors: 0, Time elapsed: 77.135 sec

selenium.stop:
[selenium-shutdown] Getting: http://localhost:4444/selenium-server/driver/?cmd=shutDown
[selenium-shutdown] To: /home/openbravo/Automated_Test_Main/log/result.txt
[selenium-shutdown] DGF Errors during shutdown are expected

test.integration.smoke.masterdata.08:

init:

compile:

test.integration:

selenium.start:
  [waitfor] Wait for proxy server launch
    [junit] Running com.openbravo.test.integration.smoke.masterdata.A_08_CreateProductCategory
    [junit] Tests run: 3, Failures: 0, Errors: 0, Time elapsed: 84.263 sec

selenium.stop:
[selenium-shutdown] Getting: http://localhost:4444/selenium-server/driver/?cmd=shutDown
[selenium-shutdown] To: /home/openbravo/Automated_Test_Main/log/result.txt
[selenium-shutdown] DGF Errors during shutdown are expected

test.integration.smoke.masterdata.08A:

init:

compile:

test.integration:

selenium.start:
  [waitfor] Wait for proxy server launch
    [junit] Running com.openbravo.test.integration.smoke.masterdata.A_08A_CreateUOM
    [junit] Tests run: 1, Failures: 0, Errors: 0, Time elapsed: 29.379 sec

selenium.stop:
[selenium-shutdown] Getting: http://localhost:4444/selenium-server/driver/?cmd=shutDown
[selenium-shutdown] To: /home/openbravo/Automated_Test_Main/log/result.txt
[selenium-shutdown] DGF Errors during shutdown are expected

test.integration.smoke.masterdata.09:

init:

compile:

test.integration:

selenium.start:
  [waitfor] Wait for proxy server launch
    [junit] Running com.openbravo.test.integration.smoke.masterdata.A_09_CreateBusinessPartnerCategory
    [junit] Tests run: 5, Failures: 0, Errors: 1, Time elapsed: 131.137 sec

BUILD FAILED
/home/openbravo/Automated_Test_Main/build.xml.complete:215: The following error occurred while executing this line:
/home/openbravo/Automated_Test_Main/build.xml.complete:63: Test com.openbravo.test.integration.smoke.masterdata.A_09_CreateBusinessPartnerCategory failed

Total time: 26 minutes 37 seconds