All pastes #147926 Raw Edit

cedega cvs

public text v1 · immutable
#147926 ·published 2006-08-24 19:30 UTC
rendered paste body
--------- Error log - file /root/.WineCVS/sources/cvscedega/ErrorLog : ---------In file included from ../../include/wine/wingdi16.h:6,
                 from ../../include/wine/winuser16.h:4,
                 from event.c:23:
../../include/wine/winbase16.h:56: warning: ‘packed’ attribute ignored for field of type ‘CHAR[7u]’
In file included from event.c:23:
../../include/wine/winuser16.h:78: warning: ‘packed’ attribute ignored for field of type ‘POINT16’
../../include/wine/winuser16.h:79: warning: ‘packed’ attribute ignored for field of type ‘POINT16’
../../include/wine/winuser16.h:80: warning: ‘packed’ attribute ignored for field of type ‘RECT16’
../../include/wine/winuser16.h:122: warning: ‘packed’ attribute ignored for field of type ‘POINT16’
../../include/wine/winuser16.h:510: warning: ‘packed’ attribute ignored for field of type ‘RECT16’
In file included from event.c:23:
../../include/wine/winuser16.h:953: warning: ‘packed’ attribute ignored for field of type ‘POINT16’
event.c: In function ‘EVENT_SelectionRequest_STRING’:
event.c:684: warning: pointer targets in passing argument 5 of ‘RegQueryValueExA’ differ in signedness
event.c:728: warning: pointer targets in passing argument 7 of ‘TSXChangeProperty’ differ in signedness
event.c: In function ‘EVENT_DropFromOffiX’:
event.c:1194: warning: pointer targets in assignment differ in signedness
event.c:1197: warning: pointer targets in passing argument 1 of ‘GetShortPathNameA’ differ in signedness
event.c:1201: warning: pointer targets in passing argument 1 of ‘strlen’ differ in signedness
event.c:1226: warning: pointer targets in assignment differ in signedness
event.c:1231: warning: pointer targets in passing argument 1 of ‘GetShortPathNameA’ differ in signedness
event.c:1234: warning: pointer targets in passing argument 1 of ‘strlen’ differ in signedness
event.c: In function ‘EVENT_DropURLs’:
event.c:1280: warning: pointer targets in assignment differ in signedness
event.c:1299: warning: pointer targets in passing argument 9 of ‘TSXQueryPointer’ differ in signedness
event.c:1322: warning: pointer targets in assignment differ in signedness
gcc -MMD -c  -I. -I. -I../../include -I../../include  -g -O2 -Wall -mpreferred-stack-boundary=2 -fno-keep-static-consts -D__const=const -fno-strict-aliasing -Wa,--execstack -D__int8=char -D__int16=short -D__int32=int "-D__int64=long long" -fPIC -D__WINE__ -DBINDIR="\"/usr/lib/cvscedega/bin\"" -D_REENTRANT  -o keyboard.o keyboard.c
In file included from ../../include/wine/wingdi16.h:6,
                 from ../../include/wine/winuser16.h:4,
                 from keyboard.c:29:
../../include/wine/winbase16.h:56: warning: ‘packed’ attribute ignored for field of type ‘CHAR[7u]’
In file included from keyboard.c:29:
../../include/wine/winuser16.h:78: warning: ‘packed’ attribute ignored for field of type ‘POINT16’
../../include/wine/winuser16.h:79: warning: ‘packed’ attribute ignored for field of type ‘POINT16’
../../include/wine/winuser16.h:80: warning: ‘packed’ attribute ignored for field of type ‘RECT16’
../../include/wine/winuser16.h:122: warning: ‘packed’ attribute ignored for field of type ‘POINT16’
../../include/wine/winuser16.h:510: warning: ‘packed’ attribute ignored for field of type ‘RECT16’
In file included from keyboard.c:29:
../../include/wine/winuser16.h:953: warning: ‘packed’ attribute ignored for field of type ‘POINT16’
keyboard.c: In function ‘X11DRV_ToUnicode’:
keyboard.c:1700: warning: pointer targets in passing argument 3 of ‘MultiByteToWideChar’ differ in signedness
ld -r  clipboard.o event.o keyboard.o      -o x11drv.o
ld: édition de lien finale en échec: Aucun espace disponible sur le périphériquemake[3]: *** [x11drv.o] Erreur 1
make[3]: quittant le répertoire « /root/.WineCVS/sources/cvscedega/winex/windows/x11drv »
make[2]: *** [../../windows/x11drv/x11drv.o] Erreur 2
make[2]: quittant le répertoire « /root/.WineCVS/sources/cvscedega/winex/dlls/x11drv »
make[1]: *** [x11drv/libx11drv.so] Erreur 2
make[1]: quittant le répertoire « /root/.WineCVS/sources/cvscedega/winex/dlls »
make: *** [dlls] Erreur 2