All pastes #147532 Raw Edit

Mine

public text v1 · immutable
#147532 ·published 2006-08-24 12:55 UTC
rendered paste body
make[5]: Entering directory `/home/matteo/src/openwrt/build_mipsel/busybox-1.1.3'
make -C /home/matteo/src/openwrt/build_mipsel/busybox-1.1.3 \
        top_srcdir=/home/matteo/src/openwrt/build_mipsel/busybox-1.1.3 \
        top_builddir=/home/matteo/src/openwrt/build_mipsel/busybox-1.1.3 \
        KBUILD_SRC=/home/matteo/src/openwrt/build_mipsel/busybox-1.1.3 \
        -f /home/matteo/src/openwrt/build_mipsel/busybox-1.1.3/Makefile _all
/home/matteo/src/openwrt/staging_dir_mipsel/bin/mipsel-linux-uclibc-gcc -I/home/matteo/src/openwrt/build_mipsel/busybox-1.1.3/include -I/home/matteo/src/openwrt/build_mipsel/busybox-1.1.3/include -I/home/matteo/src/openwrt/build_mipsel/busybox-1.1.3/libbb -funsigned-char -D_LARGEFILE_SOURCE -D_LARGEFILE64_SOURCE -D_FILE_OFFSET_BITS=64 -Wall -Wstrict-prototypes -Wshadow -Os -funit-at-a-time -fomit-frame-pointer -D_GNU_SOURCE -DNDEBUG -Os -DIPKG_LIB -DIPKGLIBDIR="/usr/lib" -DHOST_CPU_STR="mipsel" -Os -pipe -mips32 -mtune=mips32 -funit-at-a-time -Wl,--warn-common -Wl,--sort-common
/home/matteo/src/openwrt/build_mipsel/busybox-1.1.3/miscutils/lock.c:16:29: macro "usage" passed 1 arguments, but takes just 0
/home/matteo/src/openwrt/build_mipsel/busybox-1.1.3/miscutils/lock.c:17: error: syntax error before '{' token
/home/matteo/src/openwrt/build_mipsel/busybox-1.1.3/miscutils/lock.c:23: error: syntax error before numeric constant
/home/matteo/src/openwrt/build_mipsel/busybox-1.1.3/miscutils/lock.c:23: warning: type defaults to `int' in declaration of `exit'
/home/matteo/src/openwrt/build_mipsel/busybox-1.1.3/miscutils/lock.c:23: warning: function declaration isn't a prototype
/home/matteo/src/openwrt/build_mipsel/busybox-1.1.3/miscutils/lock.c:23: error: conflicting types for 'exit'
/home/matteo/src/openwrt/build_mipsel/busybox-1.1.3/miscutils/lock.c:23: error: conflicting types for 'exit'
/home/matteo/src/openwrt/build_mipsel/busybox-1.1.3/miscutils/lock.c:23: warning: data definition has no type or storage class
/home/matteo/src/openwrt/build_mipsel/busybox-1.1.3/miscutils/lock.c:121:16: macro "usage" passed 1 arguments, but takes just 0
/home/matteo/src/openwrt/build_mipsel/busybox-1.1.3/miscutils/lock.c: In function `lock_main':
/home/matteo/src/openwrt/build_mipsel/busybox-1.1.3/miscutils/lock.c:121: error: `usage' undeclared (first use in this function)
/home/matteo/src/openwrt/build_mipsel/busybox-1.1.3/miscutils/lock.c:121: error: (Each undeclared identifier is reported only once
/home/matteo/src/openwrt/build_mipsel/busybox-1.1.3/miscutils/lock.c:121: error: for each function it appears in.)
/home/matteo/src/openwrt/build_mipsel/busybox-1.1.3/modutils/insmod.c:685: warning: 'obj_gpl_license' declared `static' but never defined
/home/matteo/src/openwrt/build_mipsel/busybox-1.1.3/modutils/lsmod.c: In function `lsmod_main':
/home/matteo/src/openwrt/build_mipsel/busybox-1.1.3/modutils/lsmod.c:109: warning: dereferencing type-punned pointer will break strict-aliasing rules
/home/matteo/src/openwrt/build_mipsel/busybox-1.1.3/modutils/lsmod.c:127: warning: dereferencing type-punned pointer will break strict-aliasing rules
/home/matteo/src/openwrt/build_mipsel/busybox-1.1.3/modutils/rmmod.c: In function `rmmod_main':
/home/matteo/src/openwrt/build_mipsel/busybox-1.1.3/modutils/rmmod.c:89: warning: passing arg 3 of `my_query_module' from incompatible pointer type
/home/matteo/src/openwrt/build_mipsel/busybox-1.1.3/networking/udhcp/options.c:44: warning: initializer-string for array of chars is too long
/home/matteo/src/openwrt/build_mipsel/busybox-1.1.3/networking/udhcp/options.c:44: warning: (near initialization for `dhcp_options[26].name')
make[6]: *** [busybox_unstripped] Error 1
make[5]: *** [_all] Error 2
make[5]: Leaving directory `/home/matteo/src/openwrt/build_mipsel/busybox-1.1.3'
make[4]: *** [/home/matteo/src/openwrt/build_mipsel/busybox-1.1.3/.built] Error 2
make[4]: Leaving directory `/home/matteo/src/openwrt/package/busybox'
make[3]: *** [compile] Error 2
make[3]: Leaving directory `/home/matteo/src/openwrt/package/busybox'
make[2]: *** [busybox-compile] Error 2
make[2]: Leaving directory `/home/matteo/src/openwrt/package'
make[1]: *** [package/compile] Error 2
make[1]: Leaving directory `/home/matteo/src/openwrt'
make: *** [world] Error 2
[~/src/openwrt]$