rendered paste bodyThis file contains any messages produced by compilers while
running configure, to aid debugging if configure makes a mistake.
It was created by USRP configure 0.0.1, which was
generated by GNU Autoconf 2.59. Invocation command line was
$ ./configure
## --------- ##
## Platform. ##
## --------- ##
hostname = CRLSDR05
uname -m = i686
uname -r = 2.6.15-1.2054_FC5smp
uname -s = Linux
uname -v = #1 SMP Tue Mar 14 16:05:46 EST 2006
/usr/bin/uname -p = unknown
/bin/uname -X = unknown
/bin/arch = i686
/usr/bin/arch -k = unknown
/usr/convex/getsysinfo = unknown
hostinfo = unknown
/bin/machine = unknown
/usr/bin/oslevel = unknown
/bin/universe = unknown
PATH: /usr/kerberos/bin
PATH: /usr/local/bin
PATH: /usr/bin
PATH: /bin
PATH: /usr/X11R6/bin
PATH: /home/student/bin
## ----------- ##
## Core tests. ##
## ----------- ##
configure:1413: checking for a BSD-compatible install
configure:1468: result: /usr/bin/install -c
configure:1479: checking whether build environment is sane
configure:1522: result: yes
configure:1587: checking for gawk
configure:1603: found /usr/bin/gawk
configure:1613: result: gawk
configure:1623: checking whether make sets $(MAKE)
configure:1643: result: yes
configure:1866: checking for g++
configure:1882: found /usr/bin/g++
configure:1892: result: g++
configure:1908: checking for C++ compiler version
configure:1911: g++ --version </dev/null >&5
g++ (GCC) 4.1.0 20060304 (Red Hat 4.1.0-3)
Copyright (C) 2006 Free Software Foundation, Inc.
This is free software; see the source for copying conditions. There is NO
warranty; not even for MERCHANTABILITY or FITNESS FOR A PARTICULAR PURPOSE.
configure:1914: $? = 0
configure:1916: g++ -v </dev/null >&5
Using built-in specs.
Target: i386-redhat-linux
Configured with: ../configure --prefix=/usr --mandir=/usr/share/man --infodir=/usr/share/info --enable-shared --enable-threads=posix --enable-checking=release --with-system-zlib --enable-__cxa_atexit --disable-libunwind-exceptions --enable-libgcj-multifile --enable-languages=c,c++,objc,obj-c++,java,fortran,ada --enable-java-awt=gtk --disable-dssi --with-java-home=/usr/lib/jvm/java-1.4.2-gcj-1.4.2.0/jre --with-cpu=generic --host=i386-redhat-linux
Thread model: posix
gcc version 4.1.0 20060304 (Red Hat 4.1.0-3)
configure:1919: $? = 0
configure:1921: g++ -V </dev/null >&5
g++: '-V' option must have argument
configure:1924: $? = 1
configure:1947: checking for C++ compiler default output file name
configure:1950: g++ conftest.cc >&5
configure:1953: $? = 0
configure:1999: result: a.out
configure:2004: checking whether the C++ compiler works
configure:2010: ./a.out
configure:2013: $? = 0
configure:2030: result: yes
configure:2037: checking whether we are cross compiling
configure:2039: result: no
configure:2042: checking for suffix of executables
configure:2044: g++ -o conftest conftest.cc >&5
configure:2047: $? = 0
configure:2072: result:
configure:2078: checking for suffix of object files
configure:2099: g++ -c conftest.cc >&5
configure:2102: $? = 0
configure:2124: result: o
configure:2128: checking whether we are using the GNU C++ compiler
configure:2152: g++ -c conftest.cc >&5
configure:2158: $? = 0
configure:2162: test -z
|| test ! -s conftest.err
configure:2165: $? = 0
configure:2168: test -s conftest.o
configure:2171: $? = 0
configure:2184: result: yes
configure:2190: checking whether g++ accepts -g
configure:2211: g++ -c -g conftest.cc >&5
configure:2217: $? = 0
configure:2221: test -z
|| test ! -s conftest.err
configure:2224: $? = 0
configure:2227: test -s conftest.o
configure:2230: $? = 0
configure:2241: result: yes
configure:2283: g++ -c -g -O2 conftest.cc >&5
configure:2289: $? = 0
configure:2293: test -z
|| test ! -s conftest.err
configure:2296: $? = 0
configure:2299: test -s conftest.o
configure:2302: $? = 0
configure:2328: g++ -c -g -O2 conftest.cc >&5
conftest.cc: In function 'int main()':
conftest.cc:15: error: 'exit' was not declared in this scope
configure:2334: $? = 1
configure: failed program was:
| /* confdefs.h. */
|
| #define PACKAGE_NAME "USRP"
| #define PACKAGE_TARNAME "usrp"
| #define PACKAGE_VERSION "0.0.1"
| #define PACKAGE_STRING "USRP 0.0.1"
| #define PACKAGE_BUGREPORT ""
| #define PACKAGE "usrp"
| #define VERSION "0.0.1"
| /* end confdefs.h. */
|
| int
| main ()
| {
| exit (42);
| ;
| return 0;
| }
configure:2283: g++ -c -g -O2 conftest.cc >&5
configure:2289: $? = 0
configure:2293: test -z
|| test ! -s conftest.err
configure:2296: $? = 0
configure:2299: test -s conftest.o
configure:2302: $? = 0
configure:2328: g++ -c -g -O2 conftest.cc >&5
configure:2334: $? = 0
configure:2338: test -z
|| test ! -s conftest.err
configure:2341: $? = 0
configure:2344: test -s conftest.o
configure:2347: $? = 0
configure:2381: checking for style of include used by make
configure:2409: result: GNU
configure:2437: checking dependency style of g++
configure:2527: result: gcc3
configure:2557: checking for a BSD-compatible install
configure:2612: result: /usr/bin/install -c
configure:2623: checking whether make sets $(MAKE)
configure:2643: result: yes
configure:2699: checking for gcc
configure:2715: found /usr/bin/gcc
configure:2725: result: gcc
configure:2969: checking for C compiler version
configure:2972: gcc --version </dev/null >&5
gcc (GCC) 4.1.0 20060304 (Red Hat 4.1.0-3)
Copyright (C) 2006 Free Software Foundation, Inc.
This is free software; see the source for copying conditions. There is NO
warranty; not even for MERCHANTABILITY or FITNESS FOR A PARTICULAR PURPOSE.
configure:2975: $? = 0
configure:2977: gcc -v </dev/null >&5
Using built-in specs.
Target: i386-redhat-linux
Configured with: ../configure --prefix=/usr --mandir=/usr/share/man --infodir=/usr/share/info --enable-shared --enable-threads=posix --enable-checking=release --with-system-zlib --enable-__cxa_atexit --disable-libunwind-exceptions --enable-libgcj-multifile --enable-languages=c,c++,objc,obj-c++,java,fortran,ada --enable-java-awt=gtk --disable-dssi --with-java-home=/usr/lib/jvm/java-1.4.2-gcj-1.4.2.0/jre --with-cpu=generic --host=i386-redhat-linux
Thread model: posix
gcc version 4.1.0 20060304 (Red Hat 4.1.0-3)
configure:2980: $? = 0
configure:2982: gcc -V </dev/null >&5
gcc: '-V' option must have argument
configure:2985: $? = 1
configure:2988: checking whether we are using the GNU C compiler
configure:3012: gcc -c conftest.c >&5
configure:3018: $? = 0
configure:3022: test -z
|| test ! -s conftest.err
configure:3025: $? = 0
configure:3028: test -s conftest.o
configure:3031: $? = 0
configure:3044: result: yes
configure:3050: checking whether gcc accepts -g
configure:3071: gcc -c -g conftest.c >&5
configure:3077: $? = 0
configure:3081: test -z
|| test ! -s conftest.err
configure:3084: $? = 0
configure:3087: test -s conftest.o
configure:3090: $? = 0
configure:3101: result: yes
configure:3118: checking for gcc option to accept ANSI C
configure:3188: gcc -c -g -O2 conftest.c >&5
configure:3194: $? = 0
configure:3198: test -z
|| test ! -s conftest.err
configure:3201: $? = 0
configure:3204: test -s conftest.o
configure:3207: $? = 0
configure:3225: result: none needed
configure:3243: gcc -c -g -O2 conftest.c >&5
conftest.c:2: error: expected '=', ',', ';', 'asm' or '__attribute__' before 'me'
configure:3249: $? = 1
configure: failed program was:
| #ifndef __cplusplus
| choke me
| #endif
configure:3384: checking dependency style of gcc
configure:3474: result: gcc3
configure:3492: checking for sys/wait.h that is POSIX.1 compatible
configure:3523: gcc -c -g -O2 conftest.c >&5
configure:3529: $? = 0
configure:3533: test -z
|| test ! -s conftest.err
configure:3536: $? = 0
configure:3539: test -s conftest.o
configure:3542: $? = 0
configure:3553: result: yes
configure:3569: checking how to run the C preprocessor
configure:3604: gcc -E conftest.c
configure:3610: $? = 0
configure:3642: gcc -E conftest.c
conftest.c:15:28: error: ac_nonexistent.h: No such file or directory
configure:3648: $? = 1
configure: failed program was:
| /* confdefs.h. */
|
| #define PACKAGE_NAME "USRP"
| #define PACKAGE_TARNAME "usrp"
| #define PACKAGE_VERSION "0.0.1"
| #define PACKAGE_STRING "USRP 0.0.1"
| #define PACKAGE_BUGREPORT ""
| #define PACKAGE "usrp"
| #define VERSION "0.0.1"
| #ifdef __cplusplus
| extern "C" void std::exit (int) throw (); using std::exit;
| #endif
| #define HAVE_SYS_WAIT_H 1
| /* end confdefs.h. */
| #include <ac_nonexistent.h>
configure:3687: result: gcc -E
configure:3711: gcc -E conftest.c
configure:3717: $? = 0
configure:3749: gcc -E conftest.c
conftest.c:15:28: error: ac_nonexistent.h: No such file or directory
configure:3755: $? = 1
configure: failed program was:
| /* confdefs.h. */
|
| #define PACKAGE_NAME "USRP"
| #define PACKAGE_TARNAME "usrp"
| #define PACKAGE_VERSION "0.0.1"
| #define PACKAGE_STRING "USRP 0.0.1"
| #define PACKAGE_BUGREPORT ""
| #define PACKAGE "usrp"
| #define VERSION "0.0.1"
| #ifdef __cplusplus
| extern "C" void std::exit (int) throw (); using std::exit;
| #endif
| #define HAVE_SYS_WAIT_H 1
| /* end confdefs.h. */
| #include <ac_nonexistent.h>
configure:3799: checking for egrep
configure:3809: result: grep -E
configure:3814: checking for ANSI C header files
configure:3839: gcc -c -g -O2 conftest.c >&5
configure:3845: $? = 0
configure:3849: test -z
|| test ! -s conftest.err
configure:3852: $? = 0
configure:3855: test -s conftest.o
configure:3858: $? = 0
configure:3947: gcc -o conftest -g -O2 conftest.c >&5
conftest.c: In function 'main':
conftest.c:32: warning: incompatible implicit declaration of built-in function 'exit'
configure:3950: $? = 0
configure:3952: ./conftest
configure:3955: $? = 0
configure:3970: result: yes
configure:3994: checking for sys/types.h
configure:4010: gcc -c -g -O2 conftest.c >&5
configure:4016: $? = 0
configure:4020: test -z
|| test ! -s conftest.err
configure:4023: $? = 0
configure:4026: test -s conftest.o
configure:4029: $? = 0
configure:4040: result: yes
configure:3994: checking for sys/stat.h
configure:4010: gcc -c -g -O2 conftest.c >&5
configure:4016: $? = 0
configure:4020: test -z
|| test ! -s conftest.err
configure:4023: $? = 0
configure:4026: test -s conftest.o
configure:4029: $? = 0
configure:4040: result: yes
configure:3994: checking for stdlib.h
configure:4010: gcc -c -g -O2 conftest.c >&5
configure:4016: $? = 0
configure:4020: test -z
|| test ! -s conftest.err
configure:4023: $? = 0
configure:4026: test -s conftest.o
configure:4029: $? = 0
configure:4040: result: yes
configure:3994: checking for string.h
configure:4010: gcc -c -g -O2 conftest.c >&5
configure:4016: $? = 0
configure:4020: test -z
|| test ! -s conftest.err
configure:4023: $? = 0
configure:4026: test -s conftest.o
configure:4029: $? = 0
configure:4040: result: yes
configure:3994: checking for memory.h
configure:4010: gcc -c -g -O2 conftest.c >&5
configure:4016: $? = 0
configure:4020: test -z
|| test ! -s conftest.err
configure:4023: $? = 0
configure:4026: test -s conftest.o
configure:4029: $? = 0
configure:4040: result: yes
configure:3994: checking for strings.h
configure:4010: gcc -c -g -O2 conftest.c >&5
configure:4016: $? = 0
configure:4020: test -z
|| test ! -s conftest.err
configure:4023: $? = 0
configure:4026: test -s conftest.o
configure:4029: $? = 0
configure:4040: result: yes
configure:3994: checking for inttypes.h
configure:4010: gcc -c -g -O2 conftest.c >&5
configure:4016: $? = 0
configure:4020: test -z
|| test ! -s conftest.err
configure:4023: $? = 0
configure:4026: test -s conftest.o
configure:4029: $? = 0
configure:4040: result: yes
configure:3994: checking for stdint.h
configure:4010: gcc -c -g -O2 conftest.c >&5
configure:4016: $? = 0
configure:4020: test -z
|| test ! -s conftest.err
configure:4023: $? = 0
configure:4026: test -s conftest.o
configure:4029: $? = 0
configure:4040: result: yes
configure:3994: checking for unistd.h
configure:4010: gcc -c -g -O2 conftest.c >&5
configure:4016: $? = 0
configure:4020: test -z
|| test ! -s conftest.err
configure:4023: $? = 0
configure:4026: test -s conftest.o
configure:4029: $? = 0
configure:4040: result: yes
configure:4052: checking for pid_t
configure:4076: gcc -c -g -O2 conftest.c >&5
configure:4082: $? = 0
configure:4086: test -z
|| test ! -s conftest.err
configure:4089: $? = 0
configure:4092: test -s conftest.o
configure:4095: $? = 0
configure:4106: result: yes
configure:4124: checking for unistd.h
configure:4129: result: yes
configure:4133: checking vfork.h usability
configure:4145: gcc -c -g -O2 conftest.c >&5
conftest.c:60:19: error: vfork.h: No such file or directory
configure:4151: $? = 1
configure: failed program was:
| /* confdefs.h. */
|
| #define PACKAGE_NAME "USRP"
| #define PACKAGE_TARNAME "usrp"
| #define PACKAGE_VERSION "0.0.1"
| #define PACKAGE_STRING "USRP 0.0.1"
| #define PACKAGE_BUGREPORT ""
| #define PACKAGE "usrp"
| #define VERSION "0.0.1"
| #ifdef __cplusplus
| extern "C" void std::exit (int) throw (); using std::exit;
| #endif
| #define HAVE_SYS_WAIT_H 1
| #define STDC_HEADERS 1
| #define HAVE_SYS_TYPES_H 1
| #define HAVE_SYS_STAT_H 1
| #define HAVE_STDLIB_H 1
| #define HAVE_STRING_H 1
| #define HAVE_MEMORY_H 1
| #define HAVE_STRINGS_H 1
| #define HAVE_INTTYPES_H 1
| #define HAVE_STDINT_H 1
| #define HAVE_UNISTD_H 1
| #define HAVE_UNISTD_H 1
| /* end confdefs.h. */
| #include <stdio.h>
| #if HAVE_SYS_TYPES_H
| # include <sys/types.h>
| #endif
| #if HAVE_SYS_STAT_H
| # include <sys/stat.h>
| #endif
| #if STDC_HEADERS
| # include <stdlib.h>
| # include <stddef.h>
| #else
| # if HAVE_STDLIB_H
| # include <stdlib.h>
| # endif
| #endif
| #if HAVE_STRING_H
| # if !STDC_HEADERS && HAVE_MEMORY_H
| # include <memory.h>
| # endif
| # include <string.h>
| #endif
| #if HAVE_STRINGS_H
| # include <strings.h>
| #endif
| #if HAVE_INTTYPES_H
| # include <inttypes.h>
| #else
| # if HAVE_STDINT_H
| # include <stdint.h>
| # endif
| #endif
| #if HAVE_UNISTD_H
| # include <unistd.h>
| #endif
| #include <vfork.h>
configure:4174: result: no
configure:4178: checking vfork.h presence
configure:4188: gcc -E conftest.c
conftest.c:26:19: error: vfork.h: No such file or directory
configure:4194: $? = 1
configure: failed program was:
| /* confdefs.h. */
|
| #define PACKAGE_NAME "USRP"
| #define PACKAGE_TARNAME "usrp"
| #define PACKAGE_VERSION "0.0.1"
| #define PACKAGE_STRING "USRP 0.0.1"
| #define PACKAGE_BUGREPORT ""
| #define PACKAGE "usrp"
| #define VERSION "0.0.1"
| #ifdef __cplusplus
| extern "C" void std::exit (int) throw (); using std::exit;
| #endif
| #define HAVE_SYS_WAIT_H 1
| #define STDC_HEADERS 1
| #define HAVE_SYS_TYPES_H 1
| #define HAVE_SYS_STAT_H 1
| #define HAVE_STDLIB_H 1
| #define HAVE_STRING_H 1
| #define HAVE_MEMORY_H 1
| #define HAVE_STRINGS_H 1
| #define HAVE_INTTYPES_H 1
| #define HAVE_STDINT_H 1
| #define HAVE_UNISTD_H 1
| #define HAVE_UNISTD_H 1
| /* end confdefs.h. */
| #include <vfork.h>
configure:4214: result: no
configure:4249: checking for vfork.h
configure:4256: result: no
configure:4274: checking for fork
configure:4331: gcc -o conftest -g -O2 conftest.c >&5
conftest.c:50: warning: conflicting types for built-in function 'fork'
configure:4337: $? = 0
configure:4341: test -z
|| test ! -s conftest.err
configure:4344: $? = 0
configure:4347: test -s conftest
configure:4350: $? = 0
configure:4362: result: yes
configure:4274: checking for vfork
configure:4331: gcc -o conftest -g -O2 conftest.c >&5
configure:4337: $? = 0
configure:4341: test -z
|| test ! -s conftest.err
configure:4344: $? = 0
configure:4347: test -s conftest
configure:4350: $? = 0
configure:4362: result: yes
configure:4373: checking for working fork
configure:4396: gcc -o conftest -g -O2 conftest.c >&5
conftest.c: In function 'main':
conftest.c:10: warning: incompatible implicit declaration of built-in function 'exit'
configure:4399: $? = 0
configure:4401: ./conftest
configure:4404: $? = 0
configure:4418: result: yes
configure:4439: checking for working vfork
configure:4572: result: yes
configure:4605: checking for libraries containing socket functions
configure:4638: gcc -o conftest -g -O2 conftest.c >&5
configure:4644: $? = 0
configure:4648: test -z
|| test ! -s conftest.err
configure:4651: $? = 0
configure:4654: test -s conftest
configure:4657: $? = 0
configure:4792: result: -lc
configure:4822: checking build system type
configure:4840: result: i686-pc-linux-gnu
configure:4848: checking host system type
configure:4862: result: i686-pc-linux-gnu
configure:5018: checking for the pthreads library -lpthreads
configure:5056: gcc -o conftest -g -O2 conftest.c -lpthreads >&5
/usr/bin/ld: cannot find -lpthreads
collect2: ld returned 1 exit status
configure:5062: $? = 1
configure: failed program was:
| /* confdefs.h. */
|
| #define PACKAGE_NAME "USRP"
| #define PACKAGE_TARNAME "usrp"
| #define PACKAGE_VERSION "0.0.1"
| #define PACKAGE_STRING "USRP 0.0.1"
| #define PACKAGE_BUGREPORT ""
| #define PACKAGE "usrp"
| #define VERSION "0.0.1"
| #ifdef __cplusplus
| extern "C" void std::exit (int) throw (); using std::exit;
| #endif
| #define HAVE_SYS_WAIT_H 1
| #define STDC_HEADERS 1
| #define HAVE_SYS_TYPES_H 1
| #define HAVE_SYS_STAT_H 1
| #define HAVE_STDLIB_H 1
| #define HAVE_STRING_H 1
| #define HAVE_MEMORY_H 1
| #define HAVE_STRINGS_H 1
| #define HAVE_INTTYPES_H 1
| #define HAVE_STDINT_H 1
| #define HAVE_UNISTD_H 1
| #define HAVE_UNISTD_H 1
| #define HAVE_FORK 1
| #define HAVE_VFORK 1
| #define HAVE_WORKING_VFORK 1
| #define HAVE_WORKING_FORK 1
| /* end confdefs.h. */
| #include <pthread.h>
| int
| main ()
| {
| pthread_t th; pthread_join(th, 0);
| pthread_attr_init(0); pthread_cleanup_push(0, 0);
| pthread_create(0,0,0,0); pthread_cleanup_pop(0);
| ;
| return 0;
| }
configure:5089: result: no
configure:5007: checking whether pthreads work without any flags
configure:5056: gcc -o conftest -g -O2 conftest.c >&5
/tmp/cciTtFvQ.o: In function `main':/home/student/src/components/lab4/USRP2/USRP/conftest.c:34: undefined reference to `pthread_join'
:/home/student/src/components/lab4/USRP2/USRP/conftest.c:35: undefined reference to `__pthread_register_cancel'
:/home/student/src/components/lab4/USRP2/USRP/conftest.c:36: undefined reference to `pthread_create'
:/home/student/src/components/lab4/USRP2/USRP/conftest.c:36: undefined reference to `__pthread_unregister_cancel'
collect2: ld returned 1 exit status
configure:5062: $? = 1
configure: failed program was:
| /* confdefs.h. */
|
| #define PACKAGE_NAME "USRP"
| #define PACKAGE_TARNAME "usrp"
| #define PACKAGE_VERSION "0.0.1"
| #define PACKAGE_STRING "USRP 0.0.1"
| #define PACKAGE_BUGREPORT ""
| #define PACKAGE "usrp"
| #define VERSION "0.0.1"
| #ifdef __cplusplus
| extern "C" void std::exit (int) throw (); using std::exit;
| #endif
| #define HAVE_SYS_WAIT_H 1
| #define STDC_HEADERS 1
| #define HAVE_SYS_TYPES_H 1
| #define HAVE_SYS_STAT_H 1
| #define HAVE_STDLIB_H 1
| #define HAVE_STRING_H 1
| #define HAVE_MEMORY_H 1
| #define HAVE_STRINGS_H 1
| #define HAVE_INTTYPES_H 1
| #define HAVE_STDINT_H 1
| #define HAVE_UNISTD_H 1
| #define HAVE_UNISTD_H 1
| #define HAVE_FORK 1
| #define HAVE_VFORK 1
| #define HAVE_WORKING_VFORK 1
| #define HAVE_WORKING_FORK 1
| /* end confdefs.h. */
| #include <pthread.h>
| int
| main ()
| {
| pthread_t th; pthread_join(th, 0);
| pthread_attr_init(0); pthread_cleanup_push(0, 0);
| pthread_create(0,0,0,0); pthread_cleanup_pop(0);
| ;
| return 0;
| }
configure:5089: result: no
configure:5012: checking whether pthreads work with -Kthread
configure:5056: gcc -o conftest -g -O2 -Kthread conftest.c >&5
gcc: unrecognized option '-Kthread'
/tmp/ccIxkie5.o: In function `main':/home/student/src/components/lab4/USRP2/USRP/conftest.c:34: undefined reference to `pthread_join'
:/home/student/src/components/lab4/USRP2/USRP/conftest.c:35: undefined reference to `__pthread_register_cancel'
:/home/student/src/components/lab4/USRP2/USRP/conftest.c:36: undefined reference to `pthread_create'
:/home/student/src/components/lab4/USRP2/USRP/conftest.c:36: undefined reference to `__pthread_unregister_cancel'
collect2: ld returned 1 exit status
configure:5062: $? = 1
configure: failed program was:
| /* confdefs.h. */
|
| #define PACKAGE_NAME "USRP"
| #define PACKAGE_TARNAME "usrp"
| #define PACKAGE_VERSION "0.0.1"
| #define PACKAGE_STRING "USRP 0.0.1"
| #define PACKAGE_BUGREPORT ""
| #define PACKAGE "usrp"
| #define VERSION "0.0.1"
| #ifdef __cplusplus
| extern "C" void std::exit (int) throw (); using std::exit;
| #endif
| #define HAVE_SYS_WAIT_H 1
| #define STDC_HEADERS 1
| #define HAVE_SYS_TYPES_H 1
| #define HAVE_SYS_STAT_H 1
| #define HAVE_STDLIB_H 1
| #define HAVE_STRING_H 1
| #define HAVE_MEMORY_H 1
| #define HAVE_STRINGS_H 1
| #define HAVE_INTTYPES_H 1
| #define HAVE_STDINT_H 1
| #define HAVE_UNISTD_H 1
| #define HAVE_UNISTD_H 1
| #define HAVE_FORK 1
| #define HAVE_VFORK 1
| #define HAVE_WORKING_VFORK 1
| #define HAVE_WORKING_FORK 1
| /* end confdefs.h. */
| #include <pthread.h>
| int
| main ()
| {
| pthread_t th; pthread_join(th, 0);
| pthread_attr_init(0); pthread_cleanup_push(0, 0);
| pthread_create(0,0,0,0); pthread_cleanup_pop(0);
| ;
| return 0;
| }
configure:5089: result: no
configure:5012: checking whether pthreads work with -kthread
configure:5056: gcc -o conftest -g -O2 -kthread conftest.c >&5
gcc: unrecognized option '-kthread'
/tmp/ccggVL3b.o: In function `main':/home/student/src/components/lab4/USRP2/USRP/conftest.c:34: undefined reference to `pthread_join'
:/home/student/src/components/lab4/USRP2/USRP/conftest.c:35: undefined reference to `__pthread_register_cancel'
:/home/student/src/components/lab4/USRP2/USRP/conftest.c:36: undefined reference to `pthread_create'
:/home/student/src/components/lab4/USRP2/USRP/conftest.c:36: undefined reference to `__pthread_unregister_cancel'
collect2: ld returned 1 exit status
configure:5062: $? = 1
configure: failed program was:
| /* confdefs.h. */
|
| #define PACKAGE_NAME "USRP"
| #define PACKAGE_TARNAME "usrp"
| #define PACKAGE_VERSION "0.0.1"
| #define PACKAGE_STRING "USRP 0.0.1"
| #define PACKAGE_BUGREPORT ""
| #define PACKAGE "usrp"
| #define VERSION "0.0.1"
| #ifdef __cplusplus
| extern "C" void std::exit (int) throw (); using std::exit;
| #endif
| #define HAVE_SYS_WAIT_H 1
| #define STDC_HEADERS 1
| #define HAVE_SYS_TYPES_H 1
| #define HAVE_SYS_STAT_H 1
| #define HAVE_STDLIB_H 1
| #define HAVE_STRING_H 1
| #define HAVE_MEMORY_H 1
| #define HAVE_STRINGS_H 1
| #define HAVE_INTTYPES_H 1
| #define HAVE_STDINT_H 1
| #define HAVE_UNISTD_H 1
| #define HAVE_UNISTD_H 1
| #define HAVE_FORK 1
| #define HAVE_VFORK 1
| #define HAVE_WORKING_VFORK 1
| #define HAVE_WORKING_FORK 1
| /* end confdefs.h. */
| #include <pthread.h>
| int
| main ()
| {
| pthread_t th; pthread_join(th, 0);
| pthread_attr_init(0); pthread_cleanup_push(0, 0);
| pthread_create(0,0,0,0); pthread_cleanup_pop(0);
| ;
| return 0;
| }
configure:5089: result: no
configure:5018: checking for the pthreads library -llthread
configure:5056: gcc -o conftest -g -O2 conftest.c -llthread >&5
/usr/bin/ld: cannot find -llthread
collect2: ld returned 1 exit status
configure:5062: $? = 1
configure: failed program was:
| /* confdefs.h. */
|
| #define PACKAGE_NAME "USRP"
| #define PACKAGE_TARNAME "usrp"
| #define PACKAGE_VERSION "0.0.1"
| #define PACKAGE_STRING "USRP 0.0.1"
| #define PACKAGE_BUGREPORT ""
| #define PACKAGE "usrp"
| #define VERSION "0.0.1"
| #ifdef __cplusplus
| extern "C" void std::exit (int) throw (); using std::exit;
| #endif
| #define HAVE_SYS_WAIT_H 1
| #define STDC_HEADERS 1
| #define HAVE_SYS_TYPES_H 1
| #define HAVE_SYS_STAT_H 1
| #define HAVE_STDLIB_H 1
| #define HAVE_STRING_H 1
| #define HAVE_MEMORY_H 1
| #define HAVE_STRINGS_H 1
| #define HAVE_INTTYPES_H 1
| #define HAVE_STDINT_H 1
| #define HAVE_UNISTD_H 1
| #define HAVE_UNISTD_H 1
| #define HAVE_FORK 1
| #define HAVE_VFORK 1
| #define HAVE_WORKING_VFORK 1
| #define HAVE_WORKING_FORK 1
| /* end confdefs.h. */
| #include <pthread.h>
| int
| main ()
| {
| pthread_t th; pthread_join(th, 0);
| pthread_attr_init(0); pthread_cleanup_push(0, 0);
| pthread_create(0,0,0,0); pthread_cleanup_pop(0);
| ;
| return 0;
| }
configure:5089: result: no
configure:5012: checking whether pthreads work with -pthread
configure:5056: gcc -o conftest -g -O2 -pthread conftest.c >&5
configure:5062: $? = 0
configure:5066: test -z
|| test ! -s conftest.err
configure:5069: $? = 0
configure:5072: test -s conftest
configure:5075: $? = 0
configure:5089: result: yes
configure:5109: checking for joinable pthread attribute
configure:5127: gcc -o conftest -g -O2 -pthread conftest.c >&5
configure:5133: $? = 0
configure:5137: test -z
|| test ! -s conftest.err
configure:5140: $? = 0
configure:5143: test -s conftest
configure:5146: $? = 0
configure:5212: result: PTHREAD_CREATE_JOINABLE
configure:5219: checking if more special flags are required for pthreads
configure:5226: result: no
configure:5238: checking for cc_r
configure:5265: result: gcc
configure:5414: checking how to run the C++ preprocessor
configure:5445: g++ -E conftest.cc
configure:5451: $? = 0
configure:5483: g++ -E conftest.cc
conftest.cc:34:28: error: ac_nonexistent.h: No such file or directory
configure:5489: $? = 1
configure: failed program was:
| /* confdefs.h. */
|
| #define PACKAGE_NAME "USRP"
| #define PACKAGE_TARNAME "usrp"
| #define PACKAGE_VERSION "0.0.1"
| #define PACKAGE_STRING "USRP 0.0.1"
| #define PACKAGE_BUGREPORT ""
| #define PACKAGE "usrp"
| #define VERSION "0.0.1"
| #ifdef __cplusplus
| extern "C" void std::exit (int) throw (); using std::exit;
| #endif
| #define HAVE_SYS_WAIT_H 1
| #define STDC_HEADERS 1
| #define HAVE_SYS_TYPES_H 1
| #define HAVE_SYS_STAT_H 1
| #define HAVE_STDLIB_H 1
| #define HAVE_STRING_H 1
| #define HAVE_MEMORY_H 1
| #define HAVE_STRINGS_H 1
| #define HAVE_INTTYPES_H 1
| #define HAVE_STDINT_H 1
| #define HAVE_UNISTD_H 1
| #define HAVE_UNISTD_H 1
| #define HAVE_FORK 1
| #define HAVE_VFORK 1
| #define HAVE_WORKING_VFORK 1
| #define HAVE_WORKING_FORK 1
| #define HAVE_PTHREAD 1
| #define __linux__ 1
| #define __OSVERSION__ 2
| #define __x86__ 1
| /* end confdefs.h. */
| #include <ac_nonexistent.h>
configure:5528: result: g++ -E
configure:5552: g++ -E conftest.cc
configure:5558: $? = 0
configure:5590: g++ -E conftest.cc
conftest.cc:34:28: error: ac_nonexistent.h: No such file or directory
configure:5596: $? = 1
configure: failed program was:
| /* confdefs.h. */
|
| #define PACKAGE_NAME "USRP"
| #define PACKAGE_TARNAME "usrp"
| #define PACKAGE_VERSION "0.0.1"
| #define PACKAGE_STRING "USRP 0.0.1"
| #define PACKAGE_BUGREPORT ""
| #define PACKAGE "usrp"
| #define VERSION "0.0.1"
| #ifdef __cplusplus
| extern "C" void std::exit (int) throw (); using std::exit;
| #endif
| #define HAVE_SYS_WAIT_H 1
| #define STDC_HEADERS 1
| #define HAVE_SYS_TYPES_H 1
| #define HAVE_SYS_STAT_H 1
| #define HAVE_STDLIB_H 1
| #define HAVE_STRING_H 1
| #define HAVE_MEMORY_H 1
| #define HAVE_STRINGS_H 1
| #define HAVE_INTTYPES_H 1
| #define HAVE_STDINT_H 1
| #define HAVE_UNISTD_H 1
| #define HAVE_UNISTD_H 1
| #define HAVE_FORK 1
| #define HAVE_VFORK 1
| #define HAVE_WORKING_VFORK 1
| #define HAVE_WORKING_FORK 1
| #define HAVE_PTHREAD 1
| #define __linux__ 1
| #define __OSVERSION__ 2
| #define __x86__ 1
| /* end confdefs.h. */
| #include <ac_nonexistent.h>
configure:5655: checking for omniORB4
configure:5744: g++ -E -pthread -I/usr/local/include conftest.cc
configure:5750: $? = 0
configure:5889: g++ -o conftest -g -O2 -pthread -I/usr/local/include -pthread -L/usr/local/lib conftest.cc -lomniORB4 -lomniDynamic4 -lomnithread >&5
configure:5895: $? = 0
configure:5899: test -z
|| test ! -s conftest.err
configure:5902: $? = 0
configure:5905: test -s conftest
configure:5908: $? = 0
configure:5994: result: /usr/local/include
configure:6018: checking for omniidl
configure:6078: result: /usr/local/bin/omniidl
configure:6084: /usr/local/bin/omniidl -bcxx -Wbh=.hh conftest.idl
configure:6087: $? = 0
configure:6589: checking for pkg-config
configure:6607: found /usr/bin/pkg-config
configure:6619: result: /usr/bin/pkg-config
configure:6634: checking pkg-config is at least version 0.9.0
configure:6637: result: yes
configure:6648: checking for USRP
configure:6656: $PKG_CONFIG --exists --print-errors "usrp >= 0.9 "
configure:6659: $? = 0
configure:6674: $PKG_CONFIG --exists --print-errors "usrp >= 0.9 "
configure:6677: $? = 0
configure:6711: result: yes
configure:6720: checking for OSSIE
configure:6728: $PKG_CONFIG --exists --print-errors "ossie >= 0.0.1"
configure:6731: $? = 0
configure:6746: $PKG_CONFIG --exists --print-errors "ossie >= 0.0.1"
configure:6749: $? = 0
configure:6783: result: yes
configure:6793: checking for SI
configure:6801: $PKG_CONFIG --exists --print-errors "standardInterfaces >= 0.6.0"
Requested 'standardInterfaces >= 0.6.0' but version of standardInterfaces is 0.5.0
configure:6804: $? = 1
configure:6819: $PKG_CONFIG --exists --print-errors "standardInterfaces >= 0.6.0"
Requested 'standardInterfaces >= 0.6.0' but version of standardInterfaces is 0.5.0
configure:6822: $? = 1
Requested 'standardInterfaces >= 0.6.0' but version of standardInterfaces is 0.5.0
## ---------------- ##
## Cache variables. ##
## ---------------- ##
ac_cv_build=i686-pc-linux-gnu
ac_cv_build_alias=i686-pc-linux-gnu
ac_cv_c_compiler_gnu=yes
ac_cv_corba_omniorb4=/usr/local/include
ac_cv_cxx_compiler_gnu=yes
ac_cv_env_CC_set=
ac_cv_env_CC_value=
ac_cv_env_CFLAGS_set=
ac_cv_env_CFLAGS_value=
ac_cv_env_CPPFLAGS_set=
ac_cv_env_CPPFLAGS_value=
ac_cv_env_CPP_set=
ac_cv_env_CPP_value=
ac_cv_env_CXXCPP_set=
ac_cv_env_CXXCPP_value=
ac_cv_env_CXXFLAGS_set=
ac_cv_env_CXXFLAGS_value=
ac_cv_env_CXX_set=
ac_cv_env_CXX_value=
ac_cv_env_LDFLAGS_set=
ac_cv_env_LDFLAGS_value=
ac_cv_env_OSSIE_CFLAGS_set=
ac_cv_env_OSSIE_CFLAGS_value=
ac_cv_env_OSSIE_LIBS_set=
ac_cv_env_OSSIE_LIBS_value=
ac_cv_env_PKG_CONFIG_set=
ac_cv_env_PKG_CONFIG_value=
ac_cv_env_SI_CFLAGS_set=
ac_cv_env_SI_CFLAGS_value=
ac_cv_env_SI_LIBS_set=
ac_cv_env_SI_LIBS_value=
ac_cv_env_USRP_CFLAGS_set=
ac_cv_env_USRP_CFLAGS_value=
ac_cv_env_USRP_LIBS_set=
ac_cv_env_USRP_LIBS_value=
ac_cv_env_build_alias_set=
ac_cv_env_build_alias_value=
ac_cv_env_host_alias_set=
ac_cv_env_host_alias_value=
ac_cv_env_target_alias_set=
ac_cv_env_target_alias_value=
ac_cv_exeext=
ac_cv_func_fork=yes
ac_cv_func_fork_works=yes
ac_cv_func_vfork=yes
ac_cv_func_vfork_works=yes
ac_cv_header_inttypes_h=yes
ac_cv_header_memory_h=yes
ac_cv_header_stdc=yes
ac_cv_header_stdint_h=yes
ac_cv_header_stdlib_h=yes
ac_cv_header_string_h=yes
ac_cv_header_strings_h=yes
ac_cv_header_sys_stat_h=yes
ac_cv_header_sys_types_h=yes
ac_cv_header_sys_wait_h=yes
ac_cv_header_unistd_h=yes
ac_cv_header_vfork_h=no
ac_cv_host=i686-pc-linux-gnu
ac_cv_host_alias=i686-pc-linux-gnu
ac_cv_objext=o
ac_cv_path_IDL=/usr/local/bin/omniidl
ac_cv_path_ac_pt_PKG_CONFIG=/usr/bin/pkg-config
ac_cv_path_install='/usr/bin/install -c'
ac_cv_prog_AWK=gawk
ac_cv_prog_CPP='gcc -E'
ac_cv_prog_CXXCPP='g++ -E'
ac_cv_prog_PTHREAD_CC=gcc
ac_cv_prog_ac_ct_CC=gcc
ac_cv_prog_ac_ct_CXX=g++
ac_cv_prog_cc_g=yes
ac_cv_prog_cc_stdc=
ac_cv_prog_cxx_g=yes
ac_cv_prog_egrep='grep -E'
ac_cv_prog_make_make_set=yes
ac_cv_socket_libs=-lc
ac_cv_type_pid_t=yes
am_cv_CC_dependencies_compiler_type=gcc3
am_cv_CXX_dependencies_compiler_type=gcc3
pkg_cv_OSSIE_CFLAGS='-I/usr/local/include '
pkg_cv_OSSIE_LIBS='-L/usr/local/lib -lossieidl -lossieparser -lossiecf '
pkg_cv_USRP_CFLAGS='-I/usr/local/include '
pkg_cv_USRP_LIBS='-L/usr/local/lib -lusrp -lusb '
## ----------------- ##
## Output variables. ##
## ----------------- ##
ACLOCAL='${SHELL} /home/student/src/components/lab4/USRP2/USRP/missing --run aclocal-1.9'
AMDEPBACKSLASH='\'
AMDEP_FALSE='#'
AMDEP_TRUE=''
AMTAR='${SHELL} /home/student/src/components/lab4/USRP2/USRP/missing --run tar'
AUTOCONF='${SHELL} /home/student/src/components/lab4/USRP2/USRP/missing --run autoconf'
AUTOHEADER='${SHELL} /home/student/src/components/lab4/USRP2/USRP/missing --run autoheader'
AUTOMAKE='${SHELL} /home/student/src/components/lab4/USRP2/USRP/missing --run automake-1.9'
AWK='gawk'
CC='gcc'
CCDEPMODE='depmode=gcc3'
CFLAGS='-g -O2'
CORBA_ORB='omniORB4'
CPP='gcc -E'
CPPFLAGS=' -pthread -I/usr/local/include'
CXX='g++'
CXXCPP='g++ -E'
CXXDEPMODE='depmode=gcc3'
CXXFLAGS='-g -O2 -I/usr/local/include -DHAVE_USRP -I/usr/local/include '
CYGPATH_W='echo'
DEFS=''
DEPDIR='.deps'
ECHO_C=''
ECHO_N='-n'
ECHO_T=''
EGREP='grep -E'
ETR_SOCKET_LIBS=''
EXEEXT=''
IDL='/usr/local/bin/omniidl'
IDL_CPPFLAGS=''
IDL_FLAGS='-I/usr/local/include '
INSTALL_DATA='${INSTALL} -m 644'
INSTALL_PROGRAM='${INSTALL}'
INSTALL_SCRIPT='${INSTALL}'
INSTALL_STRIP_PROGRAM='${SHELL} $(install_sh) -c -s'
LDFLAGS=' -pthread -L/usr/local/lib'
LIBOBJS=''
LIBS=' -lomniORB4 -lomniDynamic4 -lomnithread -L/usr/local/lib -lusrp -lusb '
LTLIBOBJS=''
MAKEINFO='${SHELL} /home/student/src/components/lab4/USRP2/USRP/missing --run makeinfo'
OBJEXT='o'
OSSIE_CFLAGS='-I/usr/local/include '
OSSIE_LIBS='-L/usr/local/lib -lossieidl -lossieparser -lossiecf '
OSVERSION='2'
PACKAGE='usrp'
PACKAGE_BUGREPORT=''
PACKAGE_NAME='USRP'
PACKAGE_STRING='USRP 0.0.1'
PACKAGE_TARNAME='usrp'
PACKAGE_VERSION='0.0.1'
PATH_SEPARATOR=':'
PKG_CONFIG='/usr/bin/pkg-config'
PLATFORM_DEFINITION='__linux__'
PLATFORM_NAME='Linux'
PROCESSOR_DEFINITION='__x86__'
PROCESSOR_NAME='x86Processor'
PTHREAD_CC='gcc'
PTHREAD_CFLAGS='-pthread'
PTHREAD_LIBS=''
SET_MAKE=''
SHELL='/bin/sh'
SI_CFLAGS=''
SI_LIBS=''
SI_PATH=''
STRIP=''
USRP_CFLAGS='-I/usr/local/include '
USRP_LIBS='-L/usr/local/lib -lusrp -lusb '
VERSION='0.0.1'
ac_ct_CC='gcc'
ac_ct_CXX='g++'
ac_ct_STRIP=''
ac_pt_PKG_CONFIG='/usr/bin/pkg-config'
am__fastdepCC_FALSE='#'
am__fastdepCC_TRUE=''
am__fastdepCXX_FALSE='#'
am__fastdepCXX_TRUE=''
am__include='include'
am__leading_dot='.'
am__quote=''
am__tar='${AMTAR} chof - "$$tardir"'
am__untar='${AMTAR} xf -'
bindir='${exec_prefix}/bin'
build='i686-pc-linux-gnu'
build_alias=''
build_cpu='i686'
build_os='linux-gnu'
build_vendor='pc'
datadir='${prefix}/share'
exec_prefix='NONE'
host='i686-pc-linux-gnu'
host_alias=''
host_cpu='i686'
host_os='linux-gnu'
host_vendor='pc'
includedir='${prefix}/include'
infodir='${prefix}/info'
install_sh='/home/student/src/components/lab4/USRP2/USRP/install-sh'
libdir='${exec_prefix}/lib'
libexecdir='${exec_prefix}/libexec'
localstatedir='${prefix}/var'
mandir='${prefix}/man'
mkdir_p='mkdir -p --'
oldincludedir='/usr/include'
prefix='NONE'
program_transform_name='s,x,x,'
sbindir='${exec_prefix}/sbin'
sharedstatedir='${prefix}/com'
sysconfdir='${prefix}/etc'
target_alias=''
## ----------- ##
## confdefs.h. ##
## ----------- ##
#define HAVE_FORK 1
#define HAVE_INTTYPES_H 1
#define HAVE_MEMORY_H 1
#define HAVE_OMNIORB4 1
#define HAVE_PTHREAD 1
#define HAVE_STDINT_H 1
#define HAVE_STDLIB_H 1
#define HAVE_STRINGS_H 1
#define HAVE_STRING_H 1
#define HAVE_SYS_STAT_H 1
#define HAVE_SYS_TYPES_H 1
#define HAVE_SYS_WAIT_H 1
#define HAVE_UNISTD_H 1
#define HAVE_UNISTD_H 1
#define HAVE_VFORK 1
#define HAVE_WORKING_FORK 1
#define HAVE_WORKING_VFORK 1
#define PACKAGE "usrp"
#define PACKAGE_BUGREPORT ""
#define PACKAGE_NAME "USRP"
#define PACKAGE_STRING "USRP 0.0.1"
#define PACKAGE_TARNAME "usrp"
#define PACKAGE_VERSION "0.0.1"
#define STDC_HEADERS 1
#define VERSION "0.0.1"
#define __OSVERSION__ 2
#define __linux__ 1
#define __x86__ 1
#endif
#ifdef __cplusplus
extern "C" void std::exit (int) throw (); using std::exit;
configure: exit 0