bash: cd: home: No such file or directory
MrNick01@linux-klzy:~> cd mrnick01
bash: cd: mrnick01: No such file or directory
MrNick01@linux-klzy:~> cd ndiswrapper-1.17
MrNick01@linux-klzy:~/ndiswrapper-1.17> yum install
bash: yum: command not found
MrNick01@linux-klzy:~/ndiswrapper-1.17> install
install: missing file operand
Try `install --help' for more information.
MrNick01@linux-klzy:~/ndiswrapper-1.17> install ndiswrapper-1.17
install: missing destination file operand after `ndiswrapper-1.17'
Try `install --help' for more information.
MrNick01@linux-klzy:~/ndiswrapper-1.17> install ndiswrapper
install: missing destination file operand after `ndiswrapper'
Try `install --help' for more information.
MrNick01@linux-klzy:~/ndiswrapper-1.17> make
make -C driver
make[1]: Entering directory `/home/MrNick01/ndiswrapper-1.17/driver'
Can't find kernel build files in /lib/modules/2.6.16.13-4-default/build;
give the path to kernel build directory with
KBUILD=<path> argument to make
make[1]: *** [prereq_check] Error 1
make[1]: Leaving directory `/home/MrNick01/ndiswrapper-1.17/driver'
make: *** [all] Error 2
MrNick01@linux-klzy:~/ndiswrapper-1.17> install
install: missing file operand
Try `install --help' for more information.
MrNick01@linux-klzy:~/ndiswrapper-1.17> make all
make -C driver
make[1]: Entering directory `/home/MrNick01/ndiswrapper-1.17/driver'
Can't find kernel build files in /lib/modules/2.6.16.13-4-default/build;
give the path to kernel build directory with
KBUILD=<path> argument to make
make[1]: *** [prereq_check] Error 1
make[1]: Leaving directory `/home/MrNick01/ndiswrapper-1.17/driver'
make: *** [all] Error 2
MrNick01@linux-klzy:~/ndiswrapper-1.17>